{"text_format":"1","workbook":"xlsx","n_sheets":6,"sheets":["dashboard","data","control","calcs","charts","map icon"],"not_rendered":{"charts":5,"images":11,"macros":1,"external_links":0,"defined_names":35,"comments":0,"pivot_tables":0},"unopened":[],"bounds":{"document_bytes":16777216,"sheet_cells":100000,"rows_first":2000,"rows_last":500,"rows_between":2000,"halvings":0,"cell_chars":16384,"cell_head_chars":4096},"cells_cut":0,"cells_raw":0,"read":"whole","date_system":"1900"}

{"sheet":"dashboard","index":0,"n_rows":44,"n_cols":29,"rows_kept":44,"cut":false,"hidden":false,"merged":[[1,25,1,28],[1,23,3,23],[25,1,25,11],[6,13,6,18],[6,20,6,23],[1,1,3,8],[43,2,43,13],[2,25,2,28],[3,25,3,28],[41,2,41,13],[40,8,40,10],[40,2,40,6],[42,2,42,13]]}
[]
[null,"European Union Unemployment Rates",null,null,null,null,null,null,null,null,null,null,null,null,null,null,null,null,null,null,null,null,null,1,null,"Robert Mundigl & Pedro Wave"]
[null,null,null,null,null,null,null,null,null,null,"Age group",null,null,null,null,"Country",null,null,null,null,"Year",null,null,null,null,"www.clearlyandsimply.com"]
[null,null,null,null,null,null,null,null,null,null,null,null,null,null,null,null,null,null,null,null,null,null,null,null,null,"pedrowave.blogspot.com"]
[]
[]
[null,null,null,"Band Chart",null,null,null,"Line Chart",null,null,null,null,null,{"$f":"\"Sorted Bar Chart (\"&YEAR(calcs!$D$40)&\")\"","v":"Sorted Bar Chart (2019)"},null,null,null,null,null,null,{"$f":"\"Choropleth Map (\"&YEAR(calcs!$D$40)&\")\"","v":"Choropleth Map (2019)"},null,null,null,"Color scale"]
[]
[null,null,null,null,null,null,null,null,null,null,null,null,null,null,null,"Click on a Country to select",null,null,null,null,null,"Click on a Country to select"]
[]
[null,null,null,null,null,null,null,null,null,null,null,null,null,null,{"$f":"calcs!B45","v":1},{"$f":"calcs!H45","v":"Greece"}]
[null,null,null,null,null,null,null,null,null,null,null,null,null,null,{"$f":"calcs!B46","v":2},{"$f":"calcs!H46","v":"Spain"}]
[null,null,null,null,null,null,null,null,null,null,null,null,null,null,{"$f":"calcs!B47","v":3},{"$f":"calcs!H47","v":"Italy"}]
[null,null,null,null,null,null,null,null,null,null,null,null,null,null,{"$f":"calcs!B48","v":4},{"$f":"calcs!H48","v":"France"}]
[null,null,null,null,null,null,null,null,null,null,null,null,null,null,{"$f":"calcs!B49","v":5},{"$f":"calcs!H49","v":"Cyprus"}]
[null,null,null,null,null,null,null,null,null,null,null,null,null,null,{"$f":"calcs!B50","v":6},{"$f":"calcs!H50","v":"Latvia"}]
[null,null,null,null,null,null,null,null,null,null,null,null,null,null,{"$f":"calcs!B51","v":7},{"$f":"calcs!H51","v":"Lithuania"}]
[null,null,null,null,null,null,null,null,null,null,null,null,null,null,{"$f":"calcs!B52","v":8},{"$f":"calcs!H52","v":"Croatia"}]
[null,null,null,null,null,null,null,null,null,null,null,null,null,null,{"$f":"calcs!B53","v":9},{"$f":"calcs!H53","v":"Portugal"}]
[null,null,null,null,null,null,null,null,null,null,null,null,null,null,{"$f":"calcs!B54","v":10},{"$f":"calcs!H54","v":"Finland"}]
[null,null,null,null,null,null,null,null,null,null,null,null,null,null,{"$f":"calcs!B55","v":11},{"$f":"calcs!H55","v":"Sweden"}]
[null,null,null,null,null,null,null,null,null,null,null,null,null,null,{"$f":"calcs!B56","v":12},{"$f":"calcs!H56","v":"Slovakia"}]
[null,null,null,null,null,null,null,null,null,null,null,null,null,null,{"$f":"calcs!B57","v":13},{"$f":"calcs!H57","v":"Luxembourg"}]
[null,null,null,null,null,null,null,null,null,null,null,null,null,null,{"$f":"calcs!B58","v":14},{"$f":"calcs!H58","v":"Belgium"}]
[null,null,null,null,null,null,null,null,null,null,null,null,null,null,{"$f":"calcs!B59","v":15},{"$f":"calcs!H59","v":"Slovenia"}]
[null,"Scrollable Data Table",null,null,null,null,null,null,null,null,null,null,null,null,{"$f":"calcs!B60","v":16},{"$f":"calcs!H60","v":"Denmark"}]
[null,null,null,null,"Click on a Country or Year to select",null,null,null,null,null,null,null,null,null,{"$f":"calcs!B61","v":17},{"$f":"calcs!H61","v":"Ireland"}]
[null,{"$f":"calcs!C123","v":"Country"},{"$f":"calcs!D123","v":"2011-01-01"},{"$f":"calcs!E123","v":"2012-01-01"},{"$f":"calcs!F123","v":"2013-01-01"},{"$f":"calcs!G123","v":"2014-01-01"},{"$f":"calcs!H123","v":"2015-01-01"},{"$f":"calcs!I123","v":"2016-01-01"},{"$f":"calcs!J123","v":"2017-01-01"},{"$f":"calcs!K123","v":"2018-01-01"},{"$f":"calcs!L123","v":"2019-01-01"},{"$f":"calcs!M123","v":"2020-01-01"},null,null,{"$f":"calcs!B62","v":18},{"$f":"calcs!H62","v":"Bulgaria"}]
[null,{"$f":"calcs!C124","v":"Malta"},{"$f":"calcs!D124","v":0.05},{"$f":"calcs!E124","v":4.8000000000000001E-2},{"$f":"calcs!F124","v":4.9000000000000002E-2},{"$f":"calcs!G124","v":4.7E-2},{"$f":"calcs!H124","v":4.4000000000000004E-2},{"$f":"calcs!I124","v":3.7999999999999999E-2},{"$f":"calcs!J124","v":3.1E-2},{"$f":"calcs!K124","v":2.8999999999999998E-2},{"$f":"calcs!L124","v":2.6000000000000002E-2},{"$f":"calcs!M124","v":2.7E-2},null,null,{"$f":"calcs!B63","v":19},{"$f":"calcs!H63","v":"Austria"},null,null,null,null,null,null,null,null,null,null,null,null,"not EU"]
[null,{"$f":"calcs!C125","v":"Netherlands"},{"$f":"calcs!D125","v":0.04},{"$f":"calcs!E125","v":4.7E-2},{"$f":"calcs!F125","v":6.0999999999999999E-2},{"$f":"calcs!G125","v":6.5000000000000002E-2},{"$f":"calcs!H125","v":6.0999999999999999E-2},{"$f":"calcs!I125","v":5.0999999999999997E-2},{"$f":"calcs!J125","v":4.0999999999999995E-2},{"$f":"calcs!K125","v":3.2000000000000001E-2},{"$f":"calcs!L125","v":2.7999999999999997E-2},{"$f":"calcs!M125","v":2.5000000000000001E-2},null,null,{"$f":"calcs!B64","v":20},{"$f":"calcs!H64","v":"Estonia"},null,null,null,null,null,null,null,null,null,null,null,{"$f":"IF(AC30=calcs!$D$171,\"t\",\"\")","v":""},{"$f":"control!E54","v":"no data"}]
[null,{"$f":"calcs!C126","v":"Poland"},{"$f":"calcs!D126","v":0.08},{"$f":"calcs!E126","v":8.5000000000000006E-2},{"$f":"calcs!F126","v":8.8000000000000009E-2},{"$f":"calcs!G126","v":7.6999999999999999E-2},{"$f":"calcs!H126","v":6.4000000000000001E-2},{"$f":"calcs!I126","v":5.2000000000000005E-2},{"$f":"calcs!J126","v":4.0999999999999995E-2},{"$f":"calcs!K126","v":3.2000000000000001E-2},{"$f":"calcs!L126","v":2.7999999999999997E-2},{"$f":"calcs!M126","v":2.8000000000000001E-2},null,null,{"$f":"calcs!B65","v":21},{"$f":"calcs!H65","v":"Romania"},null,null,null,null,null,null,null,null,null,null,null,{"$f":"IF(AC31=calcs!$D$171,\"t\",\"\")","v":""},{"$f":"control!E55","v":"0% to 2%"}]
[null,{"$f":"calcs!C127","v":"Portugal"},{"$f":"calcs!D127","v":0.113},{"$f":"calcs!E127","v":0.13900000000000001},{"$f":"calcs!F127","v":0.14699999999999999},{"$f":"calcs!G127","v":0.125},{"$f":"calcs!H127","v":0.111},{"$f":"calcs!I127","v":9.9000000000000005E-2},{"$f":"calcs!J127","v":7.8E-2},{"$f":"calcs!K127","v":6.0999999999999999E-2},{"$f":"calcs!L127","v":5.5999999999999994E-2},{"$f":"calcs!M127","v":5.8000000000000003E-2},null,null,{"$f":"calcs!B66","v":22},{"$f":"calcs!H66","v":"Germany"},null,null,null,null,null,null,null,null,null,null,null,{"$f":"IF(AC32=calcs!$D$171,\"t\",\"\")","v":""},{"$f":"control!E56","v":"2% to 4%"}]
[null,{"$f":"calcs!C128","v":"Romania"},{"$f":"calcs!D128","v":5.7000000000000002E-2},{"$f":"calcs!E128","v":5.4000000000000006E-2},{"$f":"calcs!F128","v":5.7000000000000002E-2},{"$f":"calcs!G128","v":5.5E-2},{"$f":"calcs!H128","v":5.5999999999999994E-2},{"$f":"calcs!I128","v":4.8000000000000001E-2},{"$f":"calcs!J128","v":3.9E-2},{"$f":"calcs!K128","v":3.3000000000000002E-2},{"$f":"calcs!L128","v":0.03},{"$f":"calcs!M128","v":3.7999999999999999E-2},null,null,{"$f":"calcs!B67","v":23},{"$f":"calcs!H67","v":"Poland"},null,null,null,null,null,null,null,null,null,null,null,{"$f":"IF(AC33=calcs!$D$171,\"t\",\"\")","v":""},{"$f":"control!E57","v":"4% to 6%"}]
[null,{"$f":"calcs!C129","v":"Slovakia"},{"$f":"calcs!D129","v":0.11800000000000001},{"$f":"calcs!E129","v":0.122},{"$f":"calcs!F129","v":0.125},{"$f":"calcs!G129","v":0.11800000000000001},{"$f":"calcs!H129","v":0.10199999999999999},{"$f":"calcs!I129","v":8.6999999999999994E-2},{"$f":"calcs!J129","v":7.2999999999999995E-2},{"$f":"calcs!K129","v":5.9000000000000004E-2},{"$f":"calcs!L129","v":5.0999999999999997E-2},{"$f":"calcs!M129","v":4.9000000000000002E-2},null,null,{"$f":"calcs!B68","v":24},{"$f":"calcs!H68","v":"Netherlands"},null,null,null,null,null,null,null,null,null,null,null,{"$f":"IF(AC34=calcs!$D$171,\"t\",\"\")","v":""},{"$f":"control!E58","v":"6% to 8%"}]
[null,{"$f":"calcs!C130","v":"Slovenia"},{"$f":"calcs!D130","v":7.4999999999999997E-2},{"$f":"calcs!E130","v":7.9000000000000001E-2},{"$f":"calcs!F130","v":9.1999999999999998E-2},{"$f":"calcs!G130","v":0.09},{"$f":"calcs!H130","v":8.4000000000000005E-2},{"$f":"calcs!I130","v":7.4999999999999997E-2},{"$f":"calcs!J130","v":6.2E-2},{"$f":"calcs!K130","v":4.8000000000000001E-2},{"$f":"calcs!L130","v":4.2000000000000003E-2},{"$f":"calcs!M130","v":3.5999999999999997E-2},null,null,{"$f":"calcs!B69","v":25},{"$f":"calcs!H69","v":"Hungary"},null,null,null,null,null,null,null,null,null,null,null,{"$f":"IF(AC35=calcs!$D$171,\"t\",\"\")","v":""},{"$f":"control!E59","v":"8% to 10%"}]
[null,{"$f":"calcs!C131","v":"Spain"},{"$f":"calcs!D131","v":0.192},{"$f":"calcs!E131","v":0.22500000000000001},{"$f":"calcs!F131","v":0.23800000000000002},{"$f":"calcs!G131","v":0.223},{"$f":"calcs!H131","v":0.20199999999999999},{"$f":"calcs!I131","v":0.17899999999999999},{"$f":"calcs!J131","v":0.157},{"$f":"calcs!K131","v":0.13900000000000001},{"$f":"calcs!L131","v":0.128},{"$f":"calcs!M131","v":0.13600000000000001},null,null,{"$f":"calcs!B70","v":26},{"$f":"calcs!H70","v":"United Kingdom"},null,null,null,null,null,null,null,null,null,null,null,{"$f":"IF(AC36=calcs!$D$171,\"t\",\"\")","v":""},{"$f":"control!E60","v":"10% to 12%"}]
[null,{"$f":"calcs!C132","v":"Sweden"},{"$f":"calcs!D132","v":5.5E-2},{"$f":"calcs!E132","v":5.7000000000000002E-2},{"$f":"calcs!F132","v":5.7000000000000002E-2},{"$f":"calcs!G132","v":5.7000000000000002E-2},{"$f":"calcs!H132","v":5.5999999999999994E-2},{"$f":"calcs!I132","v":5.2999999999999999E-2},{"$f":"calcs!J132","v":5.2000000000000005E-2},{"$f":"calcs!K132","v":4.9000000000000002E-2},{"$f":"calcs!L132","v":5.0999999999999997E-2},{"$f":"calcs!M132","v":5.3999999999999999E-2},null,null,{"$f":"calcs!B71","v":27},{"$f":"calcs!H71","v":"Malta"},null,null,null,null,null,null,null,null,null,null,null,{"$f":"IF(AC37=calcs!$D$171,\"t\",\"\")","v":"t"},{"$f":"control!E61","v":"12% to 14%"}]
[null,{"$f":"calcs!C133","v":"United Kingdom"},{"$f":"calcs!D133","v":5.7999999999999996E-2},{"$f":"calcs!E133","v":5.7000000000000002E-2},{"$f":"calcs!F133","v":5.4000000000000006E-2},{"$f":"calcs!G133","v":4.4000000000000004E-2},{"$f":"calcs!H133","v":3.7999999999999999E-2},{"$f":"calcs!I133","v":3.6000000000000004E-2},{"$f":"calcs!J133","v":3.2000000000000001E-2},{"$f":"calcs!K133","v":0.03},{"$f":"calcs!L133","v":2.7000000000000003E-2},{"$f":"calcs!M133","v":2.8000000000000001E-2},null,null,{"$f":"calcs!B72","v":28},{"$f":"calcs!H72","v":"Czech Republic"},null,null,null,null,null,null,null,null,null,null,null,{"$f":"IF(AC38=calcs!$D$171,\"t\",\"\")","v":""},{"$f":"control!E62","v":"14% to 16%"}]
[null,null,null,null,null,null,null,null,null,null,null,null,null,null,null,null,null,null,null,null,null,null,null,null,null,null,null,{"$f":"IF(AC39=calcs!$D$171,\"t\",\"\")","v":""},{"$f":"control!E63","v":"16% or more"}]
[]
[null,{"$f":"data!U2","v":"Source: EuroStat"},"https://ec.europa.eu/eurostat/en/home",null,null,null,null,"ILOSTAT","https://ilostat.ilo.org/"]
[null,"Original Post","www.clearlyandsimply.com/clearly_and_simply/2015/03/highlighting-across-excel-dashboards.html"]
[null,"New Post","https://pedrowave.blogspot.com/2020/06/tasas-de-desempleo-de-la-ue.html"]
[null,"COPYRIGHT","https://creativecommons.org/licenses/by-nc-sa/3.0/deed.en"]

{"sheet":"data","index":1,"n_rows":98,"n_cols":34,"rows_kept":98,"cut":false,"hidden":false,"merged":[[1,21,1,30],[1,1,1,2],[3,21,3,32]]}
[]
[null,"EU Unemployment\nRates by Country",null,null,null,null,null,null,null,null,null,null,null,null,null,null,null,null,null,null,"Source: EuroStat","https://ec.europa.eu/eurostat/web/products-datasets/-/tipsun20"]
[]
[null,"Age group 15 to 74",null,null,null,null,null,null,null,null,null,null,null,null,null,null,null,null,null,null,"ILOSTAT Monthly","https://www.ilo.org/shinyapps/bulkexplorer9/?lang=en&segment=indicator&id=UNE_DEAP_SEX_AGE_RT_M"]
[]
[null,"Country",null,"1990-01-01","1991-01-01","1992-01-01","1993-01-01","1994-01-01","1995-01-01","1996-01-01","1997-01-01","1998-01-01","1999-01-01","2000-01-01","2001-01-01","2002-01-01","2003-01-01","2004-01-01","2005-01-01","2006-01-01","2007-01-01","2008-01-01","2009-01-01","2010-01-01","2011-01-01","2012-01-01","2013-01-01","2014-01-01","2015-01-01","2016-01-01","2017-01-01","2018-01-01","2019-01-01","2020-01-01"]
[null,"Austria",null,null,null,null,null,null,4.2000000000000003E-2,4.5999999999999999E-2,4.5999999999999999E-2,4.4000000000000004E-2,3.7000000000000005E-2,3.5000000000000003E-2,3.6000000000000004E-2,0.04,4.2999999999999997E-2,5.5E-2,5.5999999999999994E-2,5.2999999999999999E-2,4.9000000000000002E-2,4.0999999999999995E-2,5.2999999999999999E-2,4.8000000000000001E-2,4.5999999999999999E-2,4.9000000000000002E-2,5.4000000000000006E-2,5.5999999999999994E-2,5.7000000000000002E-2,0.06,5.5E-2,4.9000000000000002E-2,4.4999999999999998E-2]
[null,"Belgium",null,null,null,null,null,null,9.5000000000000001E-2,9.5000000000000001E-2,9.3000000000000013E-2,9.3000000000000013E-2,8.5999999999999993E-2,7.0000000000000007E-2,6.6000000000000003E-2,7.4999999999999997E-2,8.199999999999999E-2,8.4000000000000005E-2,8.5000000000000006E-2,8.3000000000000004E-2,7.4999999999999997E-2,7.0000000000000007E-2,7.9000000000000001E-2,8.3000000000000004E-2,7.2000000000000008E-2,7.5999999999999998E-2,8.4000000000000005E-2,8.5000000000000006E-2,8.5000000000000006E-2,7.8E-2,7.0999999999999994E-2,0.06,5.4000000000000006E-2]
[null,"Bulgaria",null,null,null,null,null,null,"","","","","",0.16899999999999998,0.20300000000000001,0.182,0.13699999999999998,0.121,0.10099999999999999,0.09,6.9000000000000006E-2,5.5999999999999994E-2,6.8000000000000005E-2,0.10300000000000001,0.113,0.12300000000000001,0.13,0.114,9.1999999999999998E-2,7.5999999999999998E-2,6.2E-2,5.2000000000000005E-2,4.2000000000000003E-2]
[null,"Croatia",null,null,null,null,null,null,"","","","","",0.156,0.16,0.15,0.14199999999999999,0.13699999999999998,0.127,0.113,9.9000000000000005E-2,8.5999999999999993E-2,9.1999999999999998E-2,0.11699999999999999,0.13699999999999998,0.16,0.17300000000000001,0.17300000000000001,0.16200000000000001,0.13100000000000001,0.11199999999999999,8.5000000000000006E-2,6.6000000000000003E-2]
[null,"Cyprus",null,null,null,null,null,null,"","",0.05,0.05,5.2000000000000005E-2,4.9000000000000002E-2,3.9E-2,3.6000000000000004E-2,4.2999999999999997E-2,4.7E-2,5.2999999999999999E-2,4.5999999999999999E-2,3.9E-2,3.7000000000000005E-2,5.4000000000000006E-2,6.3E-2,7.9000000000000001E-2,0.11900000000000001,0.159,0.161,0.15,0.13,0.111,8.4000000000000005E-2,7.0999999999999994E-2]
[null,"Czech Republic",null,null,null,null,null,null,"","","",6.5000000000000002E-2,8.8000000000000009E-2,8.8000000000000009E-2,8.199999999999999E-2,7.2999999999999995E-2,7.8E-2,8.3000000000000004E-2,7.9000000000000001E-2,7.2000000000000008E-2,5.2999999999999999E-2,4.4000000000000004E-2,6.7000000000000004E-2,7.2999999999999995E-2,6.7000000000000004E-2,7.0000000000000007E-2,7.0000000000000007E-2,6.0999999999999999E-2,5.0999999999999997E-2,0.04,2.8999999999999998E-2,2.2000000000000002E-2,0.02]
[null,"Denmark",null,null,null,null,null,null,7.2999999999999995E-2,6.8000000000000005E-2,5.7000000000000002E-2,5.4000000000000006E-2,5.5999999999999994E-2,4.5999999999999999E-2,4.5999999999999999E-2,4.5999999999999999E-2,5.4000000000000006E-2,5.5E-2,4.8000000000000001E-2,3.9E-2,3.7999999999999999E-2,3.7000000000000005E-2,6.4000000000000001E-2,7.6999999999999999E-2,7.8E-2,7.8E-2,7.400000000000001E-2,6.9000000000000006E-2,6.3E-2,0.06,5.7999999999999996E-2,5.0999999999999997E-2,0.05]
[null,"Estonia",null,null,null,null,null,null,"","",0.10199999999999999,0.1,0.124,0.14599999999999999,0.13,0.11199999999999999,0.10300000000000001,0.10099999999999999,0.08,5.9000000000000004E-2,4.5999999999999999E-2,5.5E-2,0.13500000000000001,0.16699999999999998,0.12300000000000001,0.1,8.5999999999999993E-2,7.400000000000001E-2,6.2E-2,6.8000000000000005E-2,5.7999999999999996E-2,5.4000000000000006E-2,4.4000000000000004E-2]
[null,"Finland",null,null,null,null,null,null,"",0.13900000000000001,0.13100000000000001,0.114,0.10199999999999999,9.8000000000000004E-2,9.0999999999999998E-2,9.0999999999999998E-2,0.09,8.8000000000000009E-2,8.4000000000000005E-2,7.6999999999999999E-2,6.9000000000000006E-2,6.4000000000000001E-2,8.199999999999999E-2,8.4000000000000005E-2,7.8E-2,7.6999999999999999E-2,8.199999999999999E-2,8.6999999999999994E-2,9.4E-2,8.8000000000000009E-2,8.5999999999999993E-2,7.400000000000001E-2,6.7000000000000004E-2]
[null,"France",null,null,null,null,null,null,"","","","","","","","",8.5000000000000006E-2,8.900000000000001E-2,8.900000000000001E-2,8.8000000000000009E-2,0.08,7.400000000000001E-2,9.0999999999999998E-2,9.3000000000000013E-2,9.1999999999999998E-2,9.8000000000000004E-2,0.10300000000000001,0.10300000000000001,0.10400000000000001,0.1,9.4E-2,0.09,8.5000000000000006E-2]
[null,"Germany",null,null,null,null,null,null,8.4000000000000005E-2,9.0999999999999998E-2,9.9000000000000005E-2,9.6000000000000002E-2,8.6999999999999994E-2,7.9000000000000001E-2,0.08,8.8000000000000009E-2,9.9000000000000005E-2,0.109,0.11199999999999999,0.10300000000000001,8.6999999999999994E-2,7.4999999999999997E-2,7.8E-2,7.0000000000000007E-2,5.7999999999999996E-2,5.4000000000000006E-2,5.2000000000000005E-2,0.05,4.5999999999999999E-2,4.0999999999999995E-2,3.7999999999999999E-2,3.4000000000000002E-2,3.2000000000000001E-2]
[null,"Greece",null,null,null,null,null,null,9.4E-2,9.8000000000000004E-2,0.10199999999999999,0.11199999999999999,0.121,0.114,0.10800000000000001,0.10400000000000001,9.8000000000000004E-2,0.106,0.1,0.09,8.4000000000000005E-2,7.8E-2,9.6000000000000002E-2,0.127,0.17899999999999999,0.245,0.27500000000000002,0.26500000000000001,0.249,0.23600000000000002,0.215,0.193,0.17300000000000001]
[null,"Hungary",null,null,null,null,null,null,"","",9.0999999999999998E-2,8.5000000000000006E-2,7.0000000000000007E-2,6.4000000000000001E-2,5.7000000000000002E-2,5.7999999999999996E-2,5.9000000000000004E-2,6.0999999999999999E-2,7.2000000000000008E-2,7.4999999999999997E-2,7.400000000000001E-2,7.8E-2,0.1,0.11199999999999999,0.11,0.11,0.10199999999999999,7.6999999999999999E-2,6.8000000000000005E-2,5.0999999999999997E-2,4.2000000000000003E-2,3.7000000000000005E-2,3.4000000000000002E-2]
[null,"Ireland",null,null,null,null,null,null,0.121,0.11599999999999999,9.9000000000000005E-2,7.8E-2,5.9000000000000004E-2,4.4999999999999998E-2,4.2000000000000003E-2,4.7E-2,4.8000000000000001E-2,4.7E-2,4.5999999999999999E-2,4.8000000000000001E-2,0.05,6.8000000000000005E-2,0.126,0.14599999999999999,0.154,0.155,0.13800000000000001,0.11900000000000001,0.1,8.4000000000000005E-2,6.7000000000000004E-2,5.7999999999999996E-2,0.05]
[null,"Italy",null,null,null,null,null,null,0.114,0.11699999999999999,0.11699999999999999,0.11900000000000001,0.114,0.106,9.6000000000000002E-2,0.09,8.6999999999999994E-2,0.08,7.6999999999999999E-2,6.8000000000000005E-2,6.0999999999999999E-2,6.7000000000000004E-2,7.8E-2,8.4000000000000005E-2,8.4000000000000005E-2,0.107,0.122,0.127,0.11900000000000001,0.11699999999999999,0.11199999999999999,0.106,0.1]
[null,"Latvia",null,null,null,null,null,null,"","",0.14400000000000002,0.14000000000000001,0.14000000000000001,0.14300000000000002,0.13699999999999998,0.125,0.11599999999999999,0.11699999999999999,0.1,7.0000000000000007E-2,6.0999999999999999E-2,7.6999999999999999E-2,0.17499999999999999,0.19500000000000001,0.16200000000000001,0.15,0.11900000000000001,0.10800000000000001,9.9000000000000005E-2,9.6000000000000002E-2,8.6999999999999994E-2,7.400000000000001E-2,6.3E-2]
[null,"Lithuania",null,null,null,null,null,null,"","",0.13100000000000001,0.13400000000000001,0.14400000000000002,0.16399999999999998,0.17300000000000001,0.13699999999999998,0.125,0.109,8.3000000000000004E-2,5.7999999999999996E-2,4.2999999999999997E-2,5.7999999999999996E-2,0.13800000000000001,0.17800000000000002,0.154,0.13400000000000001,0.11800000000000001,0.107,9.0999999999999998E-2,7.9000000000000001E-2,7.0999999999999994E-2,6.2E-2,6.3E-2]
[null,"Luxembourg",null,null,null,null,null,null,2.8999999999999998E-2,2.8999999999999998E-2,2.5000000000000001E-2,2.6000000000000002E-2,2.4E-2,2.4E-2,2.3E-2,2.8999999999999998E-2,3.7000000000000005E-2,5.0999999999999997E-2,4.4999999999999998E-2,4.7E-2,4.0999999999999995E-2,5.0999999999999997E-2,5.0999999999999997E-2,4.4000000000000004E-2,4.9000000000000002E-2,5.0999999999999997E-2,5.9000000000000004E-2,5.9000000000000004E-2,6.7000000000000004E-2,6.3E-2,5.5E-2,5.5999999999999994E-2,5.5999999999999994E-2]
[null,"Malta",null,null,null,null,null,null,"","",6.3E-2,6.4000000000000001E-2,6.4000000000000001E-2,6.6000000000000003E-2,6.9000000000000006E-2,6.9000000000000006E-2,7.5999999999999998E-2,7.2000000000000008E-2,6.9000000000000006E-2,6.8000000000000005E-2,6.5000000000000002E-2,0.06,6.9000000000000006E-2,6.9000000000000006E-2,6.4000000000000001E-2,6.2E-2,6.0999999999999999E-2,5.7000000000000002E-2,5.4000000000000006E-2,4.7E-2,0.04,3.7000000000000005E-2,3.4000000000000002E-2]
[null,"Netherlands",null,null,null,null,null,null,7.0999999999999994E-2,6.4000000000000001E-2,5.5E-2,4.4000000000000004E-2,3.6000000000000004E-2,2.8999999999999998E-2,2.3E-2,2.7999999999999997E-2,3.7000000000000005E-2,4.5999999999999999E-2,5.9000000000000004E-2,0.05,4.2000000000000003E-2,3.7000000000000005E-2,4.4000000000000004E-2,0.05,0.05,5.7999999999999996E-2,7.2999999999999995E-2,7.400000000000001E-2,6.9000000000000006E-2,0.06,4.9000000000000002E-2,3.7999999999999999E-2,3.4000000000000002E-2]
[null,"Poland",null,null,null,null,null,null,"","","",0.10300000000000001,0.13200000000000001,0.16200000000000001,0.183,0.2,0.19699999999999998,0.19,0.17800000000000002,0.13900000000000001,9.6000000000000002E-2,7.0999999999999994E-2,8.199999999999999E-2,9.6999999999999989E-2,9.6999999999999989E-2,0.10099999999999999,0.10300000000000001,0.09,7.4999999999999997E-2,6.2E-2,4.9000000000000002E-2,3.9E-2,3.3000000000000002E-2]
[null,"Portugal",null,null,null,null,null,null,7.400000000000001E-2,7.400000000000001E-2,6.9000000000000006E-2,5.0999999999999997E-2,4.5999999999999999E-2,4.0999999999999995E-2,4.0999999999999995E-2,5.0999999999999997E-2,6.4000000000000001E-2,6.7000000000000004E-2,7.6999999999999999E-2,7.8E-2,8.1000000000000003E-2,7.6999999999999999E-2,9.6000000000000002E-2,0.11,0.129,0.158,0.16399999999999998,0.14099999999999999,0.126,0.11199999999999999,0.09,7.0999999999999994E-2,6.5000000000000002E-2]
[null,"Romania",null,null,null,null,null,null,"","","",6.4000000000000001E-2,7.0999999999999994E-2,7.2999999999999995E-2,6.8000000000000005E-2,8.5999999999999993E-2,7.0000000000000007E-2,8.1000000000000003E-2,7.2000000000000008E-2,7.2999999999999995E-2,6.4000000000000001E-2,5.7999999999999996E-2,6.9000000000000006E-2,7.0000000000000007E-2,7.2000000000000008E-2,6.8000000000000005E-2,7.0999999999999994E-2,6.8000000000000005E-2,6.8000000000000005E-2,5.9000000000000004E-2,4.9000000000000002E-2,4.2000000000000003E-2,3.9E-2]
[null,"Slovakia",null,null,null,null,null,null,"","",0.122,0.126,0.16399999999999998,0.188,0.193,0.187,0.17600000000000002,0.182,0.16300000000000001,0.13400000000000001,0.111,9.5000000000000001E-2,0.12,0.14400000000000002,0.13600000000000001,0.14000000000000001,0.14199999999999999,0.13200000000000001,0.115,9.6999999999999989E-2,8.1000000000000003E-2,6.5000000000000002E-2,5.7999999999999996E-2]
[null,"Slovenia",null,null,null,null,null,null,"","",6.9000000000000006E-2,7.400000000000001E-2,7.400000000000001E-2,6.8000000000000005E-2,6.2E-2,6.3E-2,6.7000000000000004E-2,6.3E-2,6.5000000000000002E-2,0.06,4.9000000000000002E-2,4.4000000000000004E-2,5.9000000000000004E-2,7.2999999999999995E-2,8.199999999999999E-2,8.900000000000001E-2,0.10099999999999999,9.6999999999999989E-2,0.09,0.08,6.6000000000000003E-2,5.0999999999999997E-2,4.4999999999999998E-2]
[null,"Spain",null,null,null,null,null,null,0.22899999999999998,0.221,0.20600000000000002,0.18600000000000003,0.157,0.13900000000000001,0.106,0.115,0.115,0.11,9.1999999999999998E-2,8.5000000000000006E-2,8.199999999999999E-2,0.113,0.17899999999999999,0.19899999999999998,0.214,0.248,0.26100000000000001,0.245,0.221,0.19600000000000001,0.17199999999999999,0.153,0.14099999999999999]
[null,"Sweden",null,null,null,null,null,null,"",9.6000000000000002E-2,0.10099999999999999,8.8000000000000009E-2,7.2999999999999995E-2,5.5E-2,4.9000000000000002E-2,5.0999999999999997E-2,5.7000000000000002E-2,6.5000000000000002E-2,7.4999999999999997E-2,7.0999999999999994E-2,6.2E-2,6.2E-2,8.4000000000000005E-2,8.5999999999999993E-2,7.8E-2,0.08,8.1000000000000003E-2,0.08,7.400000000000001E-2,7.0000000000000007E-2,6.7000000000000004E-2,6.4000000000000001E-2,6.8000000000000005E-2]
[null,"United Kingdom",null,null,null,null,null,null,8.8000000000000009E-2,8.199999999999999E-2,7.0999999999999994E-2,6.4000000000000001E-2,6.0999999999999999E-2,5.5999999999999994E-2,0.05,5.0999999999999997E-2,0.05,4.7E-2,4.8000000000000001E-2,5.4000000000000006E-2,5.2999999999999999E-2,5.5999999999999994E-2,7.5999999999999998E-2,7.8E-2,8.1000000000000003E-2,7.9000000000000001E-2,7.4999999999999997E-2,6.0999999999999999E-2,5.2999999999999999E-2,4.8000000000000001E-2,4.2999999999999997E-2,0.04,3.7999999999999999E-2]
[]
[null,"Age group 15 to 24"]
[]
[null,"Country",null,"1990-01-01","1991-01-01","1992-01-01","1993-01-01","1994-01-01","1995-01-01","1996-01-01","1997-01-01","1998-01-01","1999-01-01","2000-01-01","2001-01-01","2002-01-01","2003-01-01","2004-01-01","2005-01-01","2006-01-01","2007-01-01","2008-01-01","2009-01-01","2010-01-01","2011-01-01","2012-01-01","2013-01-01","2014-01-01","2015-01-01","2016-01-01","2017-01-01","2018-01-01","2019-01-01","2020-01-01"]
[null,"Austria",null,null,null,null,null,5.7000000000000002E-2,5.9000000000000004E-2,6.5000000000000002E-2,6.7000000000000004E-2,6.2E-2,0.05,5.0999999999999997E-2,5.7000000000000002E-2,6.2E-2,7.0000000000000007E-2,0.105,0.11,9.8000000000000004E-2,9.4E-2,8.5000000000000006E-2,0.107,9.5000000000000001E-2,8.900000000000001E-2,9.4E-2,9.6999999999999989E-2,0.10300000000000001,0.106,0.11199999999999999,9.8000000000000004E-2,9.4E-2,8.5000000000000006E-2,8.3000000000000004E-2]
[null,"Belgium",null,0.14599999999999999,0.14199999999999999,0.154,0.20699999999999999,0.23199999999999998,0.215,0.20899999999999999,0.21100000000000002,0.21,0.21,0.17499999999999999,0.17,0.17699999999999999,0.218,0.21199999999999999,0.215,0.20499999999999999,0.188,0.18,0.21899999999999997,0.22399999999999998,0.187,0.19800000000000001,0.23699999999999999,0.23199999999999998,0.221,0.20100000000000001,0.193,0.158,0.14199999999999999,0.152]
[null,"Bulgaria",null,null,null,null,null,null,"","","","","",0.35499999999999998,0.40399999999999997,0.37200000000000005,0.28199999999999997,0.25800000000000001,0.223,0.19500000000000001,0.151,0.127,0.16200000000000001,0.21899999999999997,0.25,0.28100000000000003,0.28399999999999997,0.23800000000000002,0.21600000000000003,0.17199999999999999,0.129,0.127,8.900000000000001E-2,0.13800000000000001]
[null,"Croatia",null,null,null,null,null,null,"","","","","",0.377,0.38299999999999995,0.36099999999999999,0.35,0.32799999999999996,0.317,0.28699999999999998,0.252,0.23699999999999999,0.252,0.32400000000000001,0.36700000000000005,0.42100000000000004,0.5,0.45500000000000002,0.42299999999999999,0.313,0.27399999999999997,0.23699999999999999,0.16600000000000001,0.189]
[null,"Cyprus",null,null,null,null,null,null,"","",0.10199999999999999,0.10199999999999999,0.10199999999999999,9.6999999999999989E-2,8.199999999999999E-2,7.9000000000000001E-2,8.8000000000000009E-2,0.10099999999999999,0.13900000000000001,0.1,0.10199999999999999,0.09,0.13800000000000001,0.16600000000000001,0.22399999999999998,0.27699999999999997,0.38900000000000001,0.36,0.32799999999999996,0.29100000000000004,0.247,0.20199999999999999,0.16600000000000001,0.16]
[null,"Czech Republic",null,null,null,null,8.4000000000000005E-2,8.6999999999999994E-2,"","","",0.13,0.18,0.18100000000000002,0.17600000000000002,0.16899999999999998,0.18600000000000003,0.21,0.192,0.17499999999999999,0.107,9.9000000000000005E-2,0.16600000000000001,0.183,0.18100000000000002,0.19500000000000001,0.19,0.159,0.126,0.105,7.9000000000000001E-2,6.7000000000000004E-2,5.5999999999999994E-2,4.9000000000000002E-2]
[null,"Denmark",null,0.105,0.107,0.11699999999999999,0.128,0.10199999999999999,0.10199999999999999,0.10099999999999999,8.3000000000000004E-2,8.1000000000000003E-2,9.5000000000000001E-2,6.7000000000000004E-2,8.4000000000000005E-2,7.400000000000001E-2,9.1999999999999998E-2,8.199999999999999E-2,8.5999999999999993E-2,7.6999999999999999E-2,7.4999999999999997E-2,9.5000000000000001E-2,0.13500000000000001,0.156,0.16399999999999998,0.158,0.14800000000000002,0.14199999999999999,0.122,0.122,0.124,0.105,0.10099999999999999,0.109]
[null,"Estonia",null,null,null,null,null,null,"","",0.17600000000000002,0.16,0.21100000000000002,0.23899999999999999,0.222,0.17899999999999999,0.20899999999999999,0.23899999999999999,0.151,0.121,0.10099999999999999,0.12,0.27399999999999997,0.32899999999999996,0.22399999999999998,0.20899999999999999,0.187,0.15,0.13100000000000001,0.13400000000000001,0.121,0.11800000000000001,0.111,9.8000000000000004E-2]
[null,"Finland",null,9.3000000000000013E-2,0.16300000000000001,0.26400000000000001,0.33600000000000002,0.34,"",0.31900000000000001,0.26899999999999996,0.24,0.215,0.214,0.19800000000000001,0.21,0.218,0.20699999999999999,0.20100000000000001,0.187,0.16500000000000001,0.16500000000000001,0.215,0.214,0.20100000000000001,0.19,0.19899999999999998,0.20499999999999999,0.22399999999999998,0.20100000000000001,0.20100000000000001,0.17,0.17199999999999999,0.25800000000000001]
[null,"France",null,0.214,0.23600000000000002,0.27600000000000002,0.33,0.35399999999999998,"","","","","","","","",0.18899999999999997,0.20399999999999999,0.20899999999999999,0.22,0.19399999999999998,0.19,0.23600000000000002,0.23300000000000001,0.22699999999999998,0.24399999999999999,0.249,0.24199999999999999,0.247,0.245,0.221,0.20800000000000002,0.19600000000000001,0.2]
[null,"Germany",null,null,5.7999999999999996E-2,6.5000000000000002E-2,0.08,8.900000000000001E-2,0.09,0.10099999999999999,0.107,9.8000000000000004E-2,9.0999999999999998E-2,8.5999999999999993E-2,8.4000000000000005E-2,9.8000000000000004E-2,0.11599999999999999,0.13699999999999998,0.155,0.13800000000000001,0.11900000000000001,0.106,0.11199999999999999,9.8000000000000004E-2,8.5000000000000006E-2,0.08,7.8E-2,7.6999999999999999E-2,7.2000000000000008E-2,7.0999999999999994E-2,6.8000000000000005E-2,6.2E-2,5.7999999999999996E-2,5.8000000000000003E-2]
[null,"Greece",null,null,null,null,null,null,0.28699999999999998,0.311,0.314,0.30499999999999999,0.316,0.29199999999999998,0.28000000000000003,0.26600000000000001,0.26600000000000001,0.26500000000000001,0.25800000000000001,0.25,0.22699999999999998,0.21899999999999997,0.25700000000000001,0.33,0.44700000000000001,0.55299999999999994,0.58299999999999996,0.52400000000000002,0.498,0.47299999999999998,0.436,0.39899999999999997,0.35200000000000004,0.39300000000000002]
[null,"Hungary",null,null,null,null,null,null,"","",0.17100000000000001,0.151,0.128,0.125,0.113,0.127,0.13400000000000001,0.155,0.19399999999999998,0.191,0.18,0.19500000000000001,0.26400000000000001,0.26400000000000001,0.26,0.28199999999999997,0.26600000000000001,0.20399999999999999,0.17300000000000001,0.129,0.107,0.10199999999999999,0.114,0.114]
[null,"Ireland",null,0.19399999999999998,0.22399999999999998,0.24399999999999999,0.253,0.23,0.192,0.17899999999999999,0.154,0.113,8.6999999999999994E-2,6.9000000000000006E-2,7.2999999999999995E-2,8.5000000000000006E-2,8.900000000000001E-2,8.8000000000000009E-2,8.6999999999999994E-2,8.8000000000000009E-2,9.1999999999999998E-2,0.13500000000000001,0.245,0.28100000000000003,0.29600000000000004,0.308,0.26700000000000002,0.23399999999999999,0.20199999999999999,0.16800000000000001,0.14400000000000002,0.13800000000000001,0.125,0.11600000000000001]
[null,"Italy",null,null,null,0.26400000000000001,0.27100000000000002,0.28699999999999998,0.33299999999999996,0.34399999999999997,0.34100000000000003,0.33799999999999997,0.32899999999999996,0.311,0.28199999999999997,0.27200000000000002,0.27100000000000002,0.23499999999999999,0.24100000000000002,0.218,0.20399999999999999,0.21199999999999999,0.253,0.27899999999999997,0.29199999999999998,0.35299999999999998,0.4,0.42700000000000005,0.40299999999999997,0.37799999999999995,0.34700000000000003,0.32200000000000001,0.29199999999999998,0.26700000000000002]
[null,"Latvia",null,null,null,null,null,null,"","",0.27399999999999997,0.25800000000000001,0.23899999999999999,0.222,0.22899999999999998,0.20300000000000001,0.19600000000000001,0.2,0.151,0.13600000000000001,0.106,0.13600000000000001,0.33299999999999996,0.36200000000000004,0.31,0.28499999999999998,0.23199999999999998,0.19600000000000001,0.16300000000000001,0.17300000000000001,0.17,0.122,0.124,0.124]
[null,"Lithuania",null,null,null,null,null,null,"","",0.25,0.23800000000000002,0.26300000000000001,0.29699999999999999,0.314,0.23,0.251,0.218,0.158,0.1,8.4000000000000005E-2,0.13300000000000001,0.29600000000000004,0.35700000000000004,0.32600000000000001,0.26700000000000002,0.21899999999999997,0.193,0.16300000000000001,0.14499999999999999,0.13300000000000001,0.111,0.11900000000000001,0.186]
[null,"Luxembourg",null,3.7999999999999999E-2,3.1E-2,3.7999999999999999E-2,5.2000000000000005E-2,7.0999999999999994E-2,8.4000000000000005E-2,8.8000000000000009E-2,7.4999999999999997E-2,7.5999999999999998E-2,7.9000000000000001E-2,8.1000000000000003E-2,8.6999999999999994E-2,0.09,0.109,0.16899999999999998,0.13699999999999998,0.16200000000000001,0.152,0.17899999999999999,0.17199999999999999,0.14199999999999999,0.16800000000000001,0.188,0.155,0.22600000000000001,0.17300000000000001,0.18899999999999997,0.154,0.14199999999999999,0.17,0.22900000000000001]
[null,"Malta",null,null,null,null,null,null,"","",0.11800000000000001,0.12,0.12300000000000001,0.13300000000000001,0.153,0.14099999999999999,0.16399999999999998,0.16600000000000001,0.161,0.155,0.13500000000000001,0.11699999999999999,0.14499999999999999,0.13200000000000001,0.13300000000000001,0.13800000000000001,0.127,0.11699999999999999,0.11599999999999999,0.107,0.106,9.0999999999999998E-2,9.1999999999999998E-2,0.10100000000000001]
[null,"Netherlands",null,9.0999999999999998E-2,8.8000000000000009E-2,8.5000000000000006E-2,0.10400000000000001,0.111,0.12,0.113,9.8000000000000004E-2,8.6999999999999994E-2,7.0000000000000007E-2,5.7999999999999996E-2,4.5999999999999999E-2,0.05,6.3E-2,0.08,0.11800000000000001,0.1,9.4E-2,8.5999999999999993E-2,0.10199999999999999,0.111,0.1,0.11699999999999999,0.13200000000000001,0.127,0.113,0.10800000000000001,8.900000000000001E-2,7.2000000000000008E-2,6.7000000000000004E-2,6.8000000000000005E-2]
[null,"Poland",null,null,null,null,null,null,"","","",0.23399999999999999,0.311,0.35100000000000003,0.39500000000000002,0.42499999999999999,0.41899999999999998,0.39600000000000002,0.36899999999999999,0.29799999999999999,0.217,0.17300000000000001,0.20600000000000002,0.23699999999999999,0.25800000000000001,0.26500000000000001,0.27300000000000002,0.23899999999999999,0.20800000000000002,0.17699999999999999,0.14800000000000002,0.11699999999999999,9.9000000000000005E-2,7.2999999999999995E-2]
[null,"Portugal",null,0.129,0.11900000000000001,0.125,0.15,0.16899999999999998,0.16899999999999998,0.17,0.152,0.107,9.1999999999999998E-2,8.900000000000001E-2,9.4E-2,0.11699999999999999,0.14599999999999999,0.154,0.16200000000000001,0.16500000000000001,0.16699999999999998,0.16699999999999998,0.20300000000000001,0.22800000000000001,0.30299999999999999,0.379,0.38100000000000001,0.34799999999999998,0.32,0.28000000000000003,0.23899999999999999,0.20300000000000001,0.183,0.19700000000000001]
[null,"Romania",null,null,null,null,null,null,"","","",0.18899999999999997,0.20399999999999999,0.2,0.18600000000000003,0.23199999999999998,0.19600000000000001,0.21899999999999997,0.20199999999999999,0.214,0.20100000000000001,0.18600000000000003,0.20800000000000002,0.221,0.23899999999999999,0.22600000000000001,0.23699999999999999,0.24,0.217,0.20600000000000002,0.183,0.16200000000000001,0.16800000000000001,0.185]
[null,"Slovakia",null,null,null,null,null,null,"","",0.24199999999999999,0.251,0.33799999999999997,0.36899999999999999,0.39200000000000002,0.377,0.33399999999999996,0.33100000000000002,0.30099999999999999,0.26600000000000001,0.20300000000000001,0.19,0.27300000000000002,0.33600000000000002,0.33399999999999996,0.34,0.33700000000000002,0.29699999999999999,0.26500000000000001,0.222,0.18899999999999997,0.14899999999999999,0.161,0.151]
[null,"Slovenia",null,null,null,null,null,null,"","",0.16699999999999998,0.17499999999999999,0.17600000000000002,0.16300000000000001,0.17800000000000002,0.16500000000000001,0.17300000000000001,0.161,0.159,0.13900000000000001,0.10099999999999999,0.10400000000000001,0.13600000000000001,0.14699999999999999,0.157,0.20600000000000002,0.21600000000000003,0.20199999999999999,0.16300000000000001,0.152,0.11199999999999999,8.8000000000000009E-2,8.1000000000000003E-2,8.6999999999999994E-2]
[null,"Spain",null,0.30499999999999999,0.29199999999999998,0.32299999999999995,0.40700000000000003,0.42299999999999999,0.42299999999999999,0.41899999999999998,0.38900000000000001,0.35200000000000004,0.29399999999999998,0.26,0.21100000000000002,0.222,0.22699999999999998,0.22,0.19600000000000001,0.17899999999999999,0.18100000000000002,0.245,0.377,0.41499999999999998,0.46200000000000002,0.52900000000000003,0.55500000000000005,0.53200000000000003,0.48299999999999998,0.44400000000000001,0.38600000000000001,0.34299999999999997,0.32500000000000001,0.34799999999999998]
[null,"Sweden",null,4.4000000000000004E-2,7.5999999999999998E-2,0.13200000000000001,0.22,0.22,"",0.21199999999999999,0.20800000000000002,0.17300000000000001,0.155,0.11199999999999999,0.11699999999999999,0.128,0.13699999999999998,0.17,0.21899999999999997,0.215,0.193,0.20199999999999999,0.25,0.248,0.22800000000000001,0.23600000000000002,0.23499999999999999,0.22899999999999998,0.20399999999999999,0.18899999999999997,0.17899999999999999,0.17399999999999999,0.20100000000000001,0.223]
[null,"United Kingdom",null,0.10400000000000001,0.13900000000000001,0.16300000000000001,0.17499999999999999,0.16399999999999998,0.16500000000000001,0.157,0.14400000000000002,0.13500000000000001,0.13200000000000001,0.127,0.11800000000000001,0.12,0.122,0.12,0.127,0.13900000000000001,0.14300000000000002,0.15,0.191,0.19899999999999998,0.21299999999999999,0.21199999999999999,0.20699999999999999,0.17,0.14599999999999999,0.13,0.121,0.113,0.11199999999999999,0.111]
[]
[null,"Age group 25 to 74"]
[]
[null,"Country",null,"1990-01-01","1991-01-01","1992-01-01","1993-01-01","1994-01-01","1995-01-01","1996-01-01","1997-01-01","1998-01-01","1999-01-01","2000-01-01","2001-01-01","2002-01-01","2003-01-01","2004-01-01","2005-01-01","2006-01-01","2007-01-01","2008-01-01","2009-01-01","2010-01-01","2011-01-01","2012-01-01","2013-01-01","2014-01-01","2015-01-01","2016-01-01","2017-01-01","2018-01-01","2019-01-01","2020-01-01"]
[null,"Austria",null,null,null,null,null,3.5000000000000003E-2,3.9E-2,4.2999999999999997E-2,4.2000000000000003E-2,4.0999999999999995E-2,3.5000000000000003E-2,3.3000000000000002E-2,3.3000000000000002E-2,3.6000000000000004E-2,3.9E-2,4.7E-2,4.7E-2,4.4999999999999998E-2,4.0999999999999995E-2,3.4000000000000002E-2,4.4000000000000004E-2,4.0999999999999995E-2,3.9E-2,4.2000000000000003E-2,4.7E-2,4.9000000000000002E-2,0.05,5.2999999999999999E-2,4.9000000000000002E-2,4.2999999999999997E-2,0.04,4.4999999999999998E-2]
[null,"Belgium",null,5.4000000000000006E-2,5.4000000000000006E-2,0.06,7.0999999999999994E-2,8.1000000000000003E-2,8.1000000000000003E-2,8.199999999999999E-2,7.9000000000000001E-2,0.08,7.2000000000000008E-2,5.9000000000000004E-2,5.4000000000000006E-2,6.4000000000000001E-2,6.7000000000000004E-2,7.0000000000000007E-2,7.0999999999999994E-2,7.0000000000000007E-2,6.3E-2,5.9000000000000004E-2,6.6000000000000003E-2,7.0000000000000007E-2,0.06,6.4000000000000001E-2,7.0999999999999994E-2,7.2999999999999995E-2,7.2999999999999995E-2,6.8000000000000005E-2,6.0999999999999999E-2,5.2000000000000005E-2,4.5999999999999999E-2,4.4999999999999998E-2]
[null,"Bulgaria",null,null,null,null,null,null,"","","","","",0.14800000000000002,0.17899999999999999,0.161,0.122,0.107,8.900000000000001E-2,7.9000000000000001E-2,6.0999999999999999E-2,0.05,0.06,9.1999999999999998E-2,0.10099999999999999,0.11,0.11800000000000001,0.107,8.4000000000000005E-2,7.0999999999999994E-2,5.7999999999999996E-2,4.9000000000000002E-2,0.04,4.3999999999999997E-2]
[null,"Croatia",null,null,null,null,null,null,"","","","","",0.125,0.128,0.11900000000000001,0.113,0.111,0.10300000000000001,9.1999999999999998E-2,8.199999999999999E-2,6.9000000000000006E-2,7.4999999999999997E-2,9.5000000000000001E-2,0.11599999999999999,0.13699999999999998,0.14400000000000002,0.14599999999999999,0.13800000000000001,0.11199999999999999,9.6000000000000002E-2,7.0000000000000007E-2,5.7000000000000002E-2,6.3E-2]
[null,"Cyprus",null,null,null,null,null,null,"","",4.2000000000000003E-2,4.2999999999999997E-2,4.4999999999999998E-2,4.2000000000000003E-2,3.4000000000000002E-2,3.1E-2,3.7000000000000005E-2,4.0999999999999995E-2,4.2999999999999997E-2,3.9E-2,3.3000000000000002E-2,3.1E-2,4.4000000000000004E-2,5.0999999999999997E-2,6.4000000000000001E-2,0.10199999999999999,0.13600000000000001,0.14000000000000001,0.13200000000000001,0.115,9.9000000000000005E-2,7.2999999999999995E-2,6.3E-2,6.6000000000000003E-2]
[null,"Czech Republic",null,null,null,null,3.5000000000000003E-2,3.4000000000000002E-2,"","","",5.2999999999999999E-2,7.2000000000000008E-2,7.400000000000001E-2,6.9000000000000006E-2,6.2E-2,6.6000000000000003E-2,7.0000000000000007E-2,6.8000000000000005E-2,6.2E-2,4.8000000000000001E-2,3.9E-2,5.7999999999999996E-2,6.4000000000000001E-2,5.9000000000000004E-2,0.06,6.0999999999999999E-2,5.4000000000000006E-2,4.4999999999999998E-2,3.5000000000000003E-2,2.6000000000000002E-2,0.02,1.8000000000000002E-2,1.7000000000000001E-2]
[null,"Denmark",null,6.4000000000000001E-2,7.2000000000000008E-2,7.9000000000000001E-2,8.900000000000001E-2,7.2000000000000008E-2,6.6000000000000003E-2,6.0999999999999999E-2,5.0999999999999997E-2,4.9000000000000002E-2,4.9000000000000002E-2,4.2999999999999997E-2,0.04,4.0999999999999995E-2,4.8000000000000001E-2,5.0999999999999997E-2,4.2000000000000003E-2,3.2000000000000001E-2,3.2000000000000001E-2,2.6000000000000002E-2,5.0999999999999997E-2,6.4000000000000001E-2,6.2E-2,6.4000000000000001E-2,6.0999999999999999E-2,5.7000000000000002E-2,5.2999999999999999E-2,4.9000000000000002E-2,4.7E-2,4.2000000000000003E-2,4.2000000000000003E-2,0.04]
[null,"Estonia",null,null,null,null,null,null,"","",9.1999999999999998E-2,9.1999999999999998E-2,0.113,0.13400000000000001,0.11900000000000001,0.105,0.09,8.4000000000000005E-2,7.2000000000000008E-2,5.2000000000000005E-2,3.9E-2,4.5999999999999999E-2,0.11900000000000001,0.14899999999999999,0.11199999999999999,8.900000000000001E-2,7.5999999999999998E-2,6.7000000000000004E-2,5.5999999999999994E-2,6.2E-2,5.2000000000000005E-2,4.8000000000000001E-2,3.9E-2,4.5999999999999999E-2]
[null,"Finland",null,2.1000000000000001E-2,5.0999999999999997E-2,9.6000000000000002E-2,0.14099999999999999,0.14499999999999999,"",0.12,0.115,9.8000000000000004E-2,8.5999999999999993E-2,8.1000000000000003E-2,7.5999999999999998E-2,7.400000000000001E-2,7.2000000000000008E-2,7.2000000000000008E-2,6.8000000000000005E-2,6.2E-2,5.4000000000000006E-2,4.9000000000000002E-2,6.4000000000000001E-2,6.6000000000000003E-2,6.0999999999999999E-2,6.0999999999999999E-2,6.5000000000000002E-2,7.0000000000000007E-2,7.5999999999999998E-2,7.2999999999999995E-2,7.0999999999999994E-2,6.0999999999999999E-2,5.2999999999999999E-2,0.05]
[null,"France",null,5.2000000000000005E-2,5.2000000000000005E-2,5.7000000000000002E-2,6.0999999999999999E-2,6.3E-2,"","","","","","","","",7.2999999999999995E-2,7.4999999999999997E-2,7.4999999999999997E-2,7.2999999999999995E-2,6.7000000000000004E-2,6.0999999999999999E-2,7.400000000000001E-2,7.6999999999999999E-2,7.6999999999999999E-2,8.199999999999999E-2,8.8000000000000009E-2,8.900000000000001E-2,8.900000000000001E-2,8.5000000000000006E-2,8.1000000000000003E-2,7.8E-2,7.2999999999999995E-2,7.2999999999999995E-2]
[null,"Germany",null,null,5.5E-2,6.6000000000000003E-2,7.6999999999999999E-2,8.4000000000000005E-2,8.3000000000000004E-2,0.09,9.8000000000000004E-2,9.6000000000000002E-2,8.6999999999999994E-2,7.8E-2,0.08,8.5999999999999993E-2,9.6999999999999989E-2,0.105,0.106,9.8000000000000004E-2,8.199999999999999E-2,7.0999999999999994E-2,7.2999999999999995E-2,6.6000000000000003E-2,5.5E-2,5.0999999999999997E-2,4.9000000000000002E-2,4.7E-2,4.4000000000000004E-2,3.7999999999999999E-2,3.4000000000000002E-2,3.1E-2,2.8999999999999998E-2,3.5999999999999997E-2]
[null,"Greece",null,null,null,null,null,null,6.7000000000000004E-2,6.9000000000000006E-2,7.2999999999999995E-2,8.3000000000000004E-2,9.3000000000000013E-2,8.900000000000001E-2,8.5999999999999993E-2,8.4000000000000005E-2,7.9000000000000001E-2,8.8000000000000009E-2,8.4000000000000005E-2,7.4999999999999997E-2,7.2000000000000008E-2,6.6000000000000003E-2,8.4000000000000005E-2,0.11199999999999999,0.159,0.223,0.254,0.248,0.23399999999999999,0.222,0.20199999999999999,0.182,0.16399999999999998,0.16]
[null,"Hungary",null,null,null,null,null,null,"","",7.6999999999999999E-2,7.2999999999999995E-2,0.06,5.4000000000000006E-2,0.05,0.05,0.05,5.2000000000000005E-2,6.0999999999999999E-2,6.5000000000000002E-2,6.5000000000000002E-2,6.9000000000000006E-2,8.8000000000000009E-2,0.1,9.9000000000000005E-2,9.6999999999999989E-2,8.900000000000001E-2,6.7000000000000004E-2,0.06,4.4999999999999998E-2,3.6000000000000004E-2,3.2000000000000001E-2,2.7999999999999997E-2,3.2000000000000001E-2]
[null,"Ireland",null,0.11699999999999999,0.126,0.13,0.13100000000000001,0.122,0.10400000000000001,0.1,8.5999999999999993E-2,6.7000000000000004E-2,0.05,3.7999999999999999E-2,3.3000000000000002E-2,3.7000000000000005E-2,3.7999999999999999E-2,3.7000000000000005E-2,3.7000000000000005E-2,3.7999999999999999E-2,0.04,5.2999999999999999E-2,0.10300000000000001,0.12300000000000001,0.13200000000000001,0.13200000000000001,0.11900000000000001,0.10300000000000001,8.5999999999999993E-2,7.2000000000000008E-2,5.7000000000000002E-2,4.7E-2,0.04,4.1000000000000002E-2]
[null,"Italy",null,null,null,5.5E-2,6.6000000000000003E-2,7.4999999999999997E-2,0.08,8.3000000000000004E-2,8.5999999999999993E-2,8.8000000000000009E-2,8.6999999999999994E-2,8.1000000000000003E-2,7.4999999999999997E-2,7.0999999999999994E-2,6.8000000000000005E-2,6.5000000000000002E-2,6.3E-2,5.5E-2,4.9000000000000002E-2,5.5999999999999994E-2,6.4000000000000001E-2,6.9000000000000006E-2,6.9000000000000006E-2,8.900000000000001E-2,0.10300000000000001,0.107,0.10099999999999999,0.1,9.8000000000000004E-2,9.3000000000000013E-2,8.8000000000000009E-2,8.6999999999999994E-2]
[null,"Latvia",null,null,null,null,null,null,"","",0.124,0.12300000000000001,0.125,0.13200000000000001,0.125,0.114,0.106,0.106,9.3000000000000013E-2,6.0999999999999999E-2,5.4000000000000006E-2,6.9000000000000006E-2,0.154,0.17399999999999999,0.14599999999999999,0.13600000000000001,0.107,0.1,9.3000000000000013E-2,0.09,8.1000000000000003E-2,7.0999999999999994E-2,5.9000000000000004E-2,7.0000000000000007E-2]
[null,"Lithuania",null,null,null,null,null,null,"","",0.113,0.11900000000000001,0.127,0.14800000000000002,0.157,0.128,0.111,9.9000000000000005E-2,7.6999999999999999E-2,5.4000000000000006E-2,3.9E-2,0.05,0.122,0.161,0.13900000000000001,0.122,0.109,9.9000000000000005E-2,8.5000000000000006E-2,7.2999999999999995E-2,6.6000000000000003E-2,5.7999999999999996E-2,5.7999999999999996E-2,7.0000000000000007E-2]
[null,"Luxembourg",null,1.3000000000000001E-2,1.3999999999999999E-2,1.8000000000000002E-2,2.2000000000000002E-2,2.6000000000000002E-2,2.3E-2,2.3E-2,0.02,2.1000000000000001E-2,1.9E-2,1.9E-2,1.8000000000000002E-2,2.4E-2,3.1E-2,4.2000000000000003E-2,3.7999999999999999E-2,3.9E-2,3.3000000000000002E-2,0.04,4.0999999999999995E-2,3.7000000000000005E-2,4.0999999999999995E-2,4.2000000000000003E-2,5.2000000000000005E-2,4.8000000000000001E-2,5.7000000000000002E-2,5.2999999999999999E-2,4.7E-2,4.9000000000000002E-2,4.5999999999999999E-2,5.2999999999999999E-2]
[null,"Malta",null,null,null,null,null,null,"","",4.7E-2,4.7E-2,4.7E-2,4.7E-2,4.2999999999999997E-2,4.8000000000000001E-2,5.2000000000000005E-2,4.7E-2,4.7E-2,4.8000000000000001E-2,4.9000000000000002E-2,4.8000000000000001E-2,5.2999999999999999E-2,5.5999999999999994E-2,0.05,4.8000000000000001E-2,4.9000000000000002E-2,4.7E-2,4.4000000000000004E-2,3.7999999999999999E-2,3.1E-2,2.8999999999999998E-2,2.6000000000000002E-2,2.7E-2]
[null,"Netherlands",null,5.2999999999999999E-2,4.9000000000000002E-2,5.0999999999999997E-2,5.5999999999999994E-2,6.4000000000000001E-2,6.0999999999999999E-2,5.4000000000000006E-2,4.5999999999999999E-2,3.6000000000000004E-2,2.8999999999999998E-2,2.4E-2,1.8000000000000002E-2,2.3E-2,3.2000000000000001E-2,3.9E-2,4.8000000000000001E-2,4.0999999999999995E-2,3.2000000000000001E-2,2.7000000000000003E-2,3.2000000000000001E-2,3.9E-2,0.04,4.7E-2,6.0999999999999999E-2,6.5000000000000002E-2,6.0999999999999999E-2,5.0999999999999997E-2,4.0999999999999995E-2,3.2000000000000001E-2,2.7999999999999997E-2,2.5000000000000001E-2]
[null,"Poland",null,null,null,null,null,null,"","","",8.5999999999999993E-2,0.109,0.13400000000000001,0.14899999999999999,0.16500000000000001,0.16300000000000001,0.161,0.151,0.11800000000000001,8.1000000000000003E-2,5.9000000000000004E-2,6.8000000000000005E-2,8.1000000000000003E-2,0.08,8.5000000000000006E-2,8.8000000000000009E-2,7.6999999999999999E-2,6.4000000000000001E-2,5.2000000000000005E-2,4.0999999999999995E-2,3.2000000000000001E-2,2.7999999999999997E-2,2.8000000000000001E-2]
[null,"Portugal",null,3.7000000000000005E-2,3.4000000000000002E-2,3.2000000000000001E-2,4.4999999999999998E-2,5.7000000000000002E-2,5.7000000000000002E-2,5.7999999999999996E-2,5.5E-2,4.2000000000000003E-2,3.7999999999999999E-2,3.4000000000000002E-2,3.3000000000000002E-2,4.0999999999999995E-2,5.2999999999999999E-2,5.7000000000000002E-2,6.7000000000000004E-2,6.8000000000000005E-2,7.2000000000000008E-2,6.8000000000000005E-2,8.5999999999999993E-2,0.1,0.113,0.13900000000000001,0.14699999999999999,0.125,0.111,9.9000000000000005E-2,7.8E-2,6.0999999999999999E-2,5.5999999999999994E-2,5.8000000000000003E-2]
[null,"Romania",null,null,null,null,null,null,"","","",4.2999999999999997E-2,0.05,5.4000000000000006E-2,0.05,6.5000000000000002E-2,5.4000000000000006E-2,6.2E-2,5.5999999999999994E-2,5.7000000000000002E-2,4.9000000000000002E-2,4.4000000000000004E-2,5.4000000000000006E-2,5.5999999999999994E-2,5.7000000000000002E-2,5.4000000000000006E-2,5.7000000000000002E-2,5.5E-2,5.5999999999999994E-2,4.8000000000000001E-2,3.9E-2,3.3000000000000002E-2,0.03,3.7999999999999999E-2]
[null,"Slovakia",null,null,null,null,null,null,"","",9.8000000000000004E-2,0.10099999999999999,0.129,0.153,0.157,0.153,0.14899999999999999,0.16,0.14400000000000002,0.11699999999999999,0.1,8.4000000000000005E-2,0.10400000000000001,0.125,0.11800000000000001,0.122,0.125,0.11800000000000001,0.10199999999999999,8.6999999999999994E-2,7.2999999999999995E-2,5.9000000000000004E-2,5.0999999999999997E-2,4.9000000000000002E-2]
[null,"Slovenia",null,null,null,null,null,null,"","",5.2000000000000005E-2,5.7999999999999996E-2,5.9000000000000004E-2,5.5E-2,4.8000000000000001E-2,5.0999999999999997E-2,5.5E-2,5.0999999999999997E-2,5.4000000000000006E-2,5.0999999999999997E-2,4.2000000000000003E-2,3.7000000000000005E-2,5.0999999999999997E-2,6.5000000000000002E-2,7.4999999999999997E-2,7.9000000000000001E-2,9.1999999999999998E-2,0.09,8.4000000000000005E-2,7.4999999999999997E-2,6.2E-2,4.8000000000000001E-2,4.2000000000000003E-2,3.5999999999999997E-2]
[null,"Spain",null,0.11699999999999999,0.122,0.13600000000000001,0.16600000000000001,0.17899999999999999,0.19,0.184,0.17300000000000001,0.157,0.13400000000000001,0.11900000000000001,8.900000000000001E-2,9.8000000000000004E-2,9.9000000000000005E-2,9.5000000000000001E-2,7.6999999999999999E-2,7.2000000000000008E-2,7.0000000000000007E-2,9.6999999999999989E-2,0.157,0.17800000000000002,0.192,0.22500000000000001,0.23800000000000002,0.223,0.20199999999999999,0.17899999999999999,0.157,0.13900000000000001,0.128,0.13600000000000001]
[null,"Sweden",null,1.2E-2,2.3E-2,4.4000000000000004E-2,7.2000000000000008E-2,7.5999999999999998E-2,"",8.3000000000000004E-2,8.900000000000001E-2,7.9000000000000001E-2,6.5000000000000002E-2,4.9000000000000002E-2,0.04,4.0999999999999995E-2,4.7E-2,5.2000000000000005E-2,5.5999999999999994E-2,0.05,4.2999999999999997E-2,4.0999999999999995E-2,5.9000000000000004E-2,6.2E-2,5.5E-2,5.7000000000000002E-2,5.7000000000000002E-2,5.7000000000000002E-2,5.5999999999999994E-2,5.2999999999999999E-2,5.2000000000000005E-2,4.9000000000000002E-2,5.0999999999999997E-2,5.3999999999999999E-2]
[null,"United Kingdom",null,0.06,7.2999999999999995E-2,8.3000000000000004E-2,8.5999999999999993E-2,7.9000000000000001E-2,7.2999999999999995E-2,6.7000000000000004E-2,5.7999999999999996E-2,5.0999999999999997E-2,4.8000000000000001E-2,4.2999999999999997E-2,3.7999999999999999E-2,3.9E-2,3.7000000000000005E-2,3.4000000000000002E-2,3.3000000000000002E-2,3.7999999999999999E-2,3.6000000000000004E-2,3.9E-2,5.5999999999999994E-2,5.7999999999999996E-2,5.7999999999999996E-2,5.7000000000000002E-2,5.4000000000000006E-2,4.4000000000000004E-2,3.7999999999999999E-2,3.6000000000000004E-2,3.2000000000000001E-2,0.03,2.7000000000000003E-2,2.8000000000000001E-2]

{"sheet":"control","index":2,"n_rows":89,"n_cols":28,"rows_kept":89,"cut":false,"hidden":false,"merged":[]}
[]
[null,"Control"]
[]
[null,"Selection age group",3,"25 to 74",{"$f":"MATCH(D4,myAgeGroups,0)","v":3}]
[null,"Age group","15 to 74"]
[null,null,"15 to 24"]
[null,null,"25 to 74"]
[]
[null,"Selection country",26,"Spain",{"$f":"INDEX(myCountryList,mySelectedCountry)","v":"Spain"},{"$f":"COUNTA(myCountryList)","v":28}]
[]
[null,"Selection year",30,2019,{"$f":"MATCH(--mySelectedYearNumber,myYearsNumbers,0)","v":30},{"$f":"COUNTA(myYearList)","v":31}]
[null,"Years",{"$f":"calcs!$D$6","v":"1990-01-01"},{"$f":"YEAR(C12)","v":1990}]
[null,null,{"$f":"calcs!$E$6","v":"1991-01-01"},1991]
[null,null,{"$f":"calcs!$F$6","v":"1992-01-01"},1992]
[null,null,{"$f":"calcs!$G$6","v":"1993-01-01"},1993]
[null,null,{"$f":"calcs!$H$6","v":"1994-01-01"},1994]
[null,null,{"$f":"calcs!$I$6","v":"1995-01-01"},1995]
[null,null,{"$f":"calcs!$J$6","v":"1996-01-01"},1996]
[null,null,{"$f":"calcs!$K$6","v":"1997-01-01"},1997]
[null,null,{"$f":"calcs!$L$6","v":"1998-01-01"},1998]
[null,null,{"$f":"calcs!$M$6","v":"1999-01-01"},1999]
[null,null,{"$f":"calcs!$N$6","v":"2000-01-01"},2000]
[null,null,{"$f":"calcs!$O$6","v":"2001-01-01"},2001]
[null,null,{"$f":"calcs!$P$6","v":"2002-01-01"},2002]
[null,null,{"$f":"calcs!$Q$6","v":"2003-01-01"},2003]
[null,null,{"$f":"calcs!$R$6","v":"2004-01-01"},2004]
[null,null,{"$f":"calcs!$S$6","v":"2005-01-01"},2005]
[null,null,{"$f":"calcs!$T$6","v":"2006-01-01"},2006]
[null,null,{"$f":"calcs!$U$6","v":"2007-01-01"},2007]
[null,null,{"$f":"calcs!$V$6","v":"2008-01-01"},2008]
[null,null,{"$f":"calcs!$W$6","v":"2009-01-01"},2009]
[null,null,{"$f":"calcs!$X$6","v":"2010-01-01"},2010]
[null,null,{"$f":"calcs!$Y$6","v":"2011-01-01"},2011]
[null,null,{"$f":"calcs!$Z$6","v":"2012-01-01"},2012]
[null,null,{"$f":"calcs!$AA$6","v":"2013-01-01"},2013]
[null,null,{"$f":"calcs!$AB$6","v":"2014-01-01"},2014]
[null,null,{"$f":"calcs!$AC$6","v":"2015-01-01"},2015]
[null,null,{"$f":"calcs!$AD$6","v":"2016-01-01"},2016]
[null,null,{"$f":"calcs!$AE$6","v":"2017-01-01"},2017]
[null,null,{"$f":"calcs!$AF$6","v":"2018-01-01"},2018]
[null,null,{"$f":"calcs!$AG$6","v":"2019-01-01"},2019]
[null,null,{"$f":"calcs!$AH$6","v":"2020-01-01"},2020]
[]
[null,"Selected chart",1]
[]
[null,"Horizontal Offset",21]
[null,"Vertical Offset",18]
[]
[null,"Selected color scale",1]
[]
[null,"Color Scales",null,null,"Select a color scheme"]
[]
[null,null,"Threshold","RGB","Legend",1,{"$f":"F53+1","v":2},{"$f":"G53+1","v":3},4,5,6,7,8,9,10,11,12,13,14,15,16,17,18,19,20,21,22,23]
[null,null,null,8421504,"no data"]
[null,null,{"$f":"calcs!F173","v":0.02},3631104,{"$f":"calcs!G173","v":"0% to 2%"}]
[null,null,{"$f":"calcs!F174","v":0.04},5281818,{"$f":"calcs!G174","v":"2% to 4%"}]
[null,null,{"$f":"calcs!F175","v":0.06},6536550,{"$f":"calcs!G175","v":"4% to 6%"}]
[null,null,{"$f":"calcs!F176","v":0.08},7002534,{"$f":"calcs!G176","v":"6% to 8%"}]
[null,null,{"$f":"calcs!F177","v":0.1},9170905,{"$f":"calcs!G177","v":"8% to 10%"}]
[null,null,{"$f":"calcs!F178","v":0.12000000000000001},9167102,{"$f":"calcs!G178","v":"10% to 12%"}]
[null,null,{"$f":"calcs!F179","v":0.14000000000000001},6401789,{"$f":"calcs!G179","v":"12% to 14%"}]
[null,null,{"$f":"calcs!F180","v":0.16},4419060,{"$f":"calcs!G180","v":"14% to 16%"}]
[null,null,{"$f":"calcs!F181","v":1},2568407,{"$f":"calcs!G181","v":"16% or more"}]
[]
[null,"Color Scales",1,"Green Yellow Red"]
[null,null,2,"Green to Pink"]
[null,null,3,"Green to Purple"]
[null,null,4,"Green to Brown"]
[null,null,5,"Blue to Red"]
[null,null,6,"Blue to Red Brown"]
[null,null,7,"Brown to Purple"]
[null,null,8,"Brown Blue Green"]
[null,null,9,"Purple to Green"]
[null,null,10,"Pink to Green"]
[null,null,11,"Red to Blue"]
[null,null,12,"Red to Black"]
[null,null,13,"Red Yellow Blue"]
[null,null,14,"Spectral"]
[null,null,15,"Red Yellow Green"]
[null,null,16,"Light"]
[null,null,17,"Pairwise"]
[null,null,18,"Light to Dark Blue"]
[null,null,19,"Light to Dark Red"]
[null,null,20,"Light to Dark Brown"]
[null,null,21,"Light to Dark Green"]
[null,null,22,"Light to Dark Yellow"]
[null,null,23,"Light Grey to Black"]
[]
[null,null,null,null,"Recreate the shape index after you inserted a new map or added new shapes"]

{"sheet":"calcs","index":3,"n_rows":181,"n_cols":34,"rows_kept":181,"cut":false,"hidden":false,"merged":[]}
[]
[null,"Calculations"]
[]
[null,{"$f":"\"Age group data: \" & control!$D$4","v":"Age group data: 25 to 74"}]
[]
[null,null,"Country",{"$f":"data!D6","v":"1990-01-01"},{"$f":"data!E6","v":"1991-01-01"},{"$f":"data!F6","v":"1992-01-01"},{"$f":"data!G6","v":"1993-01-01"},{"$f":"data!H6","v":"1994-01-01"},{"$f":"data!I6","v":"1995-01-01"},{"$f":"data!J6","v":"1996-01-01"},{"$f":"data!K6","v":"1997-01-01"},{"$f":"data!L6","v":"1998-01-01"},{"$f":"data!M6","v":"1999-01-01"},{"$f":"data!N6","v":"2000-01-01"},{"$f":"data!O6","v":"2001-01-01"},{"$f":"data!P6","v":"2002-01-01"},{"$f":"data!Q6","v":"2003-01-01"},{"$f":"data!R6","v":"2004-01-01"},{"$f":"data!S6","v":"2005-01-01"},{"$f":"data!T6","v":"2006-01-01"},{"$f":"data!U6","v":"2007-01-01"},{"$f":"data!V6","v":"2008-01-01"},{"$f":"data!W6","v":"2009-01-01"},{"$f":"data!X6","v":"2010-01-01"},{"$f":"data!Y6","v":"2011-01-01"},{"$f":"data!Z6","v":"2012-01-01"},{"$f":"data!AA6","v":"2013-01-01"},{"$f":"data!AB6","v":"2014-01-01"},{"$f":"data!AC6","v":"2015-01-01"},{"$f":"data!AD6","v":"2016-01-01"},{"$f":"data!AE6","v":"2017-01-01"},{"$f":"data!AF6","v":"2018-01-01"},{"$f":"data!AG6","v":"2019-01-01"},{"$f":"data!AH6","v":"2020-01-01"}]
[null,null,{"$f":"data!B7","v":"Austria"},{"$f":"IF(ISBLANK(CHOOSE(mySelectedAgeGroup,data!D7,data!D39,data!D71)),\"\",CHOOSE(mySelectedAgeGroup,data!D7,data!D39,data!D71))","v":""},{"$f":"IF(ISBLANK(CHOOSE(mySelectedAgeGroup,data!E7,data!E39,data!E71)),\"\",CHOOSE(mySelectedAgeGroup,data!E7,data!E39,data!E71))","v":""},{"$f":"IF(ISBLANK(CHOOSE(mySelectedAgeGroup,data!F7,data!F39,data!F71)),\"\",CHOOSE(mySelectedAgeGroup,data!F7,data!F39,data!F71))","v":""},{"$f":"IF(ISBLANK(CHOOSE(mySelectedAgeGroup,data!G7,data!G39,data!G71)),\"\",CHOOSE(mySelectedAgeGroup,data!G7,data!G39,data!G71))","v":""},{"$f":"IF(ISBLANK(CHOOSE(mySelectedAgeGroup,data!H7,data!H39,data!H71)),\"\",CHOOSE(mySelectedAgeGroup,data!H7,data!H39,data!H71))","v":3.5000000000000003E-2},{"$f":"IF(ISBLANK(CHOOSE(mySelectedAgeGroup,data!I7,data!I39,data!I71)),\"\",CHOOSE(mySelectedAgeGroup,data!I7,data!I39,data!I71))","v":3.9E-2},{"$f":"IF(ISBLANK(CHOOSE(mySelectedAgeGroup,data!J7,data!J39,data!J71)),\"\",CHOOSE(mySelectedAgeGroup,data!J7,data!J39,data!J71))","v":4.2999999999999997E-2},{"$f":"IF(ISBLANK(CHOOSE(mySelectedAgeGroup,data!K7,data!K39,data!K71)),\"\",CHOOSE(mySelectedAgeGroup,data!K7,data!K39,data!K71))","v":4.2000000000000003E-2},{"$f":"IF(ISBLANK(CHOOSE(mySelectedAgeGroup,data!L7,data!L39,data!L71)),\"\",CHOOSE(mySelectedAgeGroup,data!L7,data!L39,data!L71))","v":4.0999999999999995E-2},{"$f":"IF(ISBLANK(CHOOSE(mySelectedAgeGroup,data!M7,data!M39,data!M71)),\"\",CHOOSE(mySelectedAgeGroup,data!M7,data!M39,data!M71))","v":3.5000000000000003E-2},{"$f":"IF(ISBLANK(CHOOSE(mySelectedAgeGroup,data!N7,data!N39,data!N71)),\"\",CHOOSE(mySelectedAgeGroup,data!N7,data!N39,data!N71))","v":3.3000000000000002E-2},{"$f":"IF(ISBLANK(CHOOSE(mySelectedAgeGroup,data!O7,data!O39,data!O71)),\"\",CHOOSE(mySelectedAgeGroup,data!O7,data!O39,data!O71))","v":3.3000000000000002E-2},{"$f":"IF(ISBLANK(CHOOSE(mySelectedAgeGroup,data!P7,data!P39,data!P71)),\"\",CHOOSE(mySelectedAgeGroup,data!P7,data!P39,data!P71))","v":3.6000000000000004E-2},{"$f":"IF(ISBLANK(CHOOSE(mySelectedAgeGroup,data!Q7,data!Q39,data!Q71)),\"\",CHOOSE(mySelectedAgeGroup,data!Q7,data!Q39,data!Q71))","v":3.9E-2},{"$f":"IF(ISBLANK(CHOOSE(mySelectedAgeGroup,data!R7,data!R39,data!R71)),\"\",CHOOSE(mySelectedAgeGroup,data!R7,data!R39,data!R71))","v":4.7E-2},{"$f":"IF(ISBLANK(CHOOSE(mySelectedAgeGroup,data!S7,data!S39,data!S71)),\"\",CHOOSE(mySelectedAgeGroup,data!S7,data!S39,data!S71))","v":4.7E-2},{"$f":"IF(ISBLANK(CHOOSE(mySelectedAgeGroup,data!T7,data!T39,data!T71)),\"\",CHOOSE(mySelectedAgeGroup,data!T7,data!T39,data!T71))","v":4.4999999999999998E-2},{"$f":"IF(ISBLANK(CHOOSE(mySelectedAgeGroup,data!U7,data!U39,data!U71)),\"\",CHOOSE(mySelectedAgeGroup,data!U7,data!U39,data!U71))","v":4.0999999999999995E-2},{"$f":"IF(ISBLANK(CHOOSE(mySelectedAgeGroup,data!V7,data!V39,data!V71)),\"\",CHOOSE(mySelectedAgeGroup,data!V7,data!V39,data!V71))","v":3.4000000000000002E-2},{"$f":"IF(ISBLANK(CHOOSE(mySelectedAgeGroup,data!W7,data!W39,data!W71)),\"\",CHOOSE(mySelectedAgeGroup,data!W7,data!W39,data!W71))","v":4.4000000000000004E-2},{"$f":"IF(ISBLANK(CHOOSE(mySelectedAgeGroup,data!X7,data!X39,data!X71)),\"\",CHOOSE(mySelectedAgeGroup,data!X7,data!X39,data!X71))","v":4.0999999999999995E-2},{"$f":"IF(ISBLANK(CHOOSE(mySelectedAgeGroup,data!Y7,data!Y39,data!Y71)),\"\",CHOOSE(mySelectedAgeGroup,data!Y7,data!Y39,data!Y71))","v":3.9E-2},{"$f":"IF(ISBLANK(CHOOSE(mySelectedAgeGroup,data!Z7,data!Z39,data!Z71)),\"\",CHOOSE(mySelectedAgeGroup,data!Z7,data!Z39,data!Z71))","v":4.2000000000000003E-2},{"$f":"IF(ISBLANK(CHOOSE(mySelectedAgeGroup,data!AA7,data!AA39,data!AA71)),\"\",CHOOSE(mySelectedAgeGroup,data!AA7,data!AA39,data!AA71))","v":4.7E-2},{"$f":"IF(ISBLANK(CHOOSE(mySelectedAgeGroup,data!AB7,data!AB39,data!AB71)),\"\",CHOOSE(mySelectedAgeGroup,data!AB7,data!AB39,data!AB71))","v":4.9000000000000002E-2},{"$f":"IF(ISBLANK(CHOOSE(mySelectedAgeGroup,data!AC7,data!AC39,data!AC71)),\"\",CHOOSE(mySelectedAgeGroup,data!AC7,data!AC39,data!AC71))","v":0.05},{"$f":"IF(ISBLANK(CHOOSE(mySelectedAgeGroup,data!AD7,data!AD39,data!AD71)),\"\",CHOOSE(mySelectedAgeGroup,data!AD7,data!AD39,data!AD71))","v":5.2999999999999999E-2},{"$f":"IF(ISBLANK(CHOOSE(mySelectedAgeGroup,data!AE7,data!AE39,data!AE71)),\"\",CHOOSE(mySelectedAgeGroup,data!AE7,data!AE39,data!AE71))","v":4.9000000000000002E-2},{"$f":"IF(ISBLANK(CHOOSE(mySelectedAgeGroup,data!AF7,data!AF39,data!AF71)),\"\",CHOOSE(mySelectedAgeGroup,data!AF7,data!AF39,data!AF71))","v":4.2999999999999997E-2},{"$f":"IF(ISBLANK(CHOOSE(mySelectedAgeGroup,data!AG7,data!AG39,data!AG71)),\"\",CHOOSE(mySelectedAgeGroup,data!AG7,data!AG39,data!AG71))","v":0.04},{"$f":"IF(ISBLANK(CHOOSE(mySelectedAgeGroup,data!AH7,data!AH39,data!AH71)),\"\",CHOOSE(mySelectedAgeGroup,data!AH7,data!AH39,data!AH71))","v":4.4999999999999998E-2}]
[null,null,{"$f":"data!B8","v":"Belgium"},{"$f":"IF(ISBLANK(CHOOSE(mySelectedAgeGroup,data!D8,data!D40,data!D72)),\"\",CHOOSE(mySelectedAgeGroup,data!D8,data!D40,data!D72))","v":5.4000000000000006E-2},{"$f":"IF(ISBLANK(CHOOSE(mySelectedAgeGroup,data!E8,data!E40,data!E72)),\"\",CHOOSE(mySelectedAgeGroup,data!E8,data!E40,data!E72))","v":5.4000000000000006E-2},{"$f":"IF(ISBLANK(CHOOSE(mySelectedAgeGroup,data!F8,data!F40,data!F72)),\"\",CHOOSE(mySelectedAgeGroup,data!F8,data!F40,data!F72))","v":0.06},{"$f":"IF(ISBLANK(CHOOSE(mySelectedAgeGroup,data!G8,data!G40,data!G72)),\"\",CHOOSE(mySelectedAgeGroup,data!G8,data!G40,data!G72))","v":7.0999999999999994E-2},{"$f":"IF(ISBLANK(CHOOSE(mySelectedAgeGroup,data!H8,data!H40,data!H72)),\"\",CHOOSE(mySelectedAgeGroup,data!H8,data!H40,data!H72))","v":8.1000000000000003E-2},{"$f":"IF(ISBLANK(CHOOSE(mySelectedAgeGroup,data!I8,data!I40,data!I72)),\"\",CHOOSE(mySelectedAgeGroup,data!I8,data!I40,data!I72))","v":8.1000000000000003E-2},{"$f":"IF(ISBLANK(CHOOSE(mySelectedAgeGroup,data!J8,data!J40,data!J72)),\"\",CHOOSE(mySelectedAgeGroup,data!J8,data!J40,data!J72))","v":8.199999999999999E-2},{"$f":"IF(ISBLANK(CHOOSE(mySelectedAgeGroup,data!K8,data!K40,data!K72)),\"\",CHOOSE(mySelectedAgeGroup,data!K8,data!K40,data!K72))","v":7.9000000000000001E-2},{"$f":"IF(ISBLANK(CHOOSE(mySelectedAgeGroup,data!L8,data!L40,data!L72)),\"\",CHOOSE(mySelectedAgeGroup,data!L8,data!L40,data!L72))","v":0.08},{"$f":"IF(ISBLANK(CHOOSE(mySelectedAgeGroup,data!M8,data!M40,data!M72)),\"\",CHOOSE(mySelectedAgeGroup,data!M8,data!M40,data!M72))","v":7.2000000000000008E-2},{"$f":"IF(ISBLANK(CHOOSE(mySelectedAgeGroup,data!N8,data!N40,data!N72)),\"\",CHOOSE(mySelectedAgeGroup,data!N8,data!N40,data!N72))","v":5.9000000000000004E-2},{"$f":"IF(ISBLANK(CHOOSE(mySelectedAgeGroup,data!O8,data!O40,data!O72)),\"\",CHOOSE(mySelectedAgeGroup,data!O8,data!O40,data!O72))","v":5.4000000000000006E-2},{"$f":"IF(ISBLANK(CHOOSE(mySelectedAgeGroup,data!P8,data!P40,data!P72)),\"\",CHOOSE(mySelectedAgeGroup,data!P8,data!P40,data!P72))","v":6.4000000000000001E-2},{"$f":"IF(ISBLANK(CHOOSE(mySelectedAgeGroup,data!Q8,data!Q40,data!Q72)),\"\",CHOOSE(mySelectedAgeGroup,data!Q8,data!Q40,data!Q72))","v":6.7000000000000004E-2},{"$f":"IF(ISBLANK(CHOOSE(mySelectedAgeGroup,data!R8,data!R40,data!R72)),\"\",CHOOSE(mySelectedAgeGroup,data!R8,data!R40,data!R72))","v":7.0000000000000007E-2},{"$f":"IF(ISBLANK(CHOOSE(mySelectedAgeGroup,data!S8,data!S40,data!S72)),\"\",CHOOSE(mySelectedAgeGroup,data!S8,data!S40,data!S72))","v":7.0999999999999994E-2},{"$f":"IF(ISBLANK(CHOOSE(mySelectedAgeGroup,data!T8,data!T40,data!T72)),\"\",CHOOSE(mySelectedAgeGroup,data!T8,data!T40,data!T72))","v":7.0000000000000007E-2},{"$f":"IF(ISBLANK(CHOOSE(mySelectedAgeGroup,data!U8,data!U40,data!U72)),\"\",CHOOSE(mySelectedAgeGroup,data!U8,data!U40,data!U72))","v":6.3E-2},{"$f":"IF(ISBLANK(CHOOSE(mySelectedAgeGroup,data!V8,data!V40,data!V72)),\"\",CHOOSE(mySelectedAgeGroup,data!V8,data!V40,data!V72))","v":5.9000000000000004E-2},{"$f":"IF(ISBLANK(CHOOSE(mySelectedAgeGroup,data!W8,data!W40,data!W72)),\"\",CHOOSE(mySelectedAgeGroup,data!W8,data!W40,data!W72))","v":6.6000000000000003E-2},{"$f":"IF(ISBLANK(CHOOSE(mySelectedAgeGroup,data!X8,data!X40,data!X72)),\"\",CHOOSE(mySelectedAgeGroup,data!X8,data!X40,data!X72))","v":7.0000000000000007E-2},{"$f":"IF(ISBLANK(CHOOSE(mySelectedAgeGroup,data!Y8,data!Y40,data!Y72)),\"\",CHOOSE(mySelectedAgeGroup,data!Y8,data!Y40,data!Y72))","v":0.06},{"$f":"IF(ISBLANK(CHOOSE(mySelectedAgeGroup,data!Z8,data!Z40,data!Z72)),\"\",CHOOSE(mySelectedAgeGroup,data!Z8,data!Z40,data!Z72))","v":6.4000000000000001E-2},{"$f":"IF(ISBLANK(CHOOSE(mySelectedAgeGroup,data!AA8,data!AA40,data!AA72)),\"\",CHOOSE(mySelectedAgeGroup,data!AA8,data!AA40,data!AA72))","v":7.0999999999999994E-2},{"$f":"IF(ISBLANK(CHOOSE(mySelectedAgeGroup,data!AB8,data!AB40,data!AB72)),\"\",CHOOSE(mySelectedAgeGroup,data!AB8,data!AB40,data!AB72))","v":7.2999999999999995E-2},{"$f":"IF(ISBLANK(CHOOSE(mySelectedAgeGroup,data!AC8,data!AC40,data!AC72)),\"\",CHOOSE(mySelectedAgeGroup,data!AC8,data!AC40,data!AC72))","v":7.2999999999999995E-2},{"$f":"IF(ISBLANK(CHOOSE(mySelectedAgeGroup,data!AD8,data!AD40,data!AD72)),\"\",CHOOSE(mySelectedAgeGroup,data!AD8,data!AD40,data!AD72))","v":6.8000000000000005E-2},{"$f":"IF(ISBLANK(CHOOSE(mySelectedAgeGroup,data!AE8,data!AE40,data!AE72)),\"\",CHOOSE(mySelectedAgeGroup,data!AE8,data!AE40,data!AE72))","v":6.0999999999999999E-2},{"$f":"IF(ISBLANK(CHOOSE(mySelectedAgeGroup,data!AF8,data!AF40,data!AF72)),\"\",CHOOSE(mySelectedAgeGroup,data!AF8,data!AF40,data!AF72))","v":5.2000000000000005E-2},{"$f":"IF(ISBLANK(CHOOSE(mySelectedAgeGroup,data!AG8,data!AG40,data!AG72)),\"\",CHOOSE(mySelectedAgeGroup,data!AG8,data!AG40,data!AG72))","v":4.5999999999999999E-2},{"$f":"IF(ISBLANK(CHOOSE(mySelectedAgeGroup,data!AH8,data!AH40,data!AH72)),\"\",CHOOSE(mySelectedAgeGroup,data!AH8,data!AH40,data!AH72))","v":4.4999999999999998E-2}]
[null,null,{"$f":"data!B9","v":"Bulgaria"},{"$f":"IF(ISBLANK(CHOOSE(mySelectedAgeGroup,data!D9,data!D41,data!D73)),\"\",CHOOSE(mySelectedAgeGroup,data!D9,data!D41,data!D73))","v":""},{"$f":"IF(ISBLANK(CHOOSE(mySelectedAgeGroup,data!E9,data!E41,data!E73)),\"\",CHOOSE(mySelectedAgeGroup,data!E9,data!E41,data!E73))","v":""},{"$f":"IF(ISBLANK(CHOOSE(mySelectedAgeGroup,data!F9,data!F41,data!F73)),\"\",CHOOSE(mySelectedAgeGroup,data!F9,data!F41,data!F73))","v":""},{"$f":"IF(ISBLANK(CHOOSE(mySelectedAgeGroup,data!G9,data!G41,data!G73)),\"\",CHOOSE(mySelectedAgeGroup,data!G9,data!G41,data!G73))","v":""},{"$f":"IF(ISBLANK(CHOOSE(mySelectedAgeGroup,data!H9,data!H41,data!H73)),\"\",CHOOSE(mySelectedAgeGroup,data!H9,data!H41,data!H73))","v":""},{"$f":"IF(ISBLANK(CHOOSE(mySelectedAgeGroup,data!I9,data!I41,data!I73)),\"\",CHOOSE(mySelectedAgeGroup,data!I9,data!I41,data!I73))","v":""},{"$f":"IF(ISBLANK(CHOOSE(mySelectedAgeGroup,data!J9,data!J41,data!J73)),\"\",CHOOSE(mySelectedAgeGroup,data!J9,data!J41,data!J73))","v":""},{"$f":"IF(ISBLANK(CHOOSE(mySelectedAgeGroup,data!K9,data!K41,data!K73)),\"\",CHOOSE(mySelectedAgeGroup,data!K9,data!K41,data!K73))","v":""},{"$f":"IF(ISBLANK(CHOOSE(mySelectedAgeGroup,data!L9,data!L41,data!L73)),\"\",CHOOSE(mySelectedAgeGroup,data!L9,data!L41,data!L73))","v":""},{"$f":"IF(ISBLANK(CHOOSE(mySelectedAgeGroup,data!M9,data!M41,data!M73)),\"\",CHOOSE(mySelectedAgeGroup,data!M9,data!M41,data!M73))","v":""},{"$f":"IF(ISBLANK(CHOOSE(mySelectedAgeGroup,data!N9,data!N41,data!N73)),\"\",CHOOSE(mySelectedAgeGroup,data!N9,data!N41,data!N73))","v":0.14800000000000002},{"$f":"IF(ISBLANK(CHOOSE(mySelectedAgeGroup,data!O9,data!O41,data!O73)),\"\",CHOOSE(mySelectedAgeGroup,data!O9,data!O41,data!O73))","v":0.17899999999999999},{"$f":"IF(ISBLANK(CHOOSE(mySelectedAgeGroup,data!P9,data!P41,data!P73)),\"\",CHOOSE(mySelectedAgeGroup,data!P9,data!P41,data!P73))","v":0.161},{"$f":"IF(ISBLANK(CHOOSE(mySelectedAgeGroup,data!Q9,data!Q41,data!Q73)),\"\",CHOOSE(mySelectedAgeGroup,data!Q9,data!Q41,data!Q73))","v":0.122},{"$f":"IF(ISBLANK(CHOOSE(mySelectedAgeGroup,data!R9,data!R41,data!R73)),\"\",CHOOSE(mySelectedAgeGroup,data!R9,data!R41,data!R73))","v":0.107},{"$f":"IF(ISBLANK(CHOOSE(mySelectedAgeGroup,data!S9,data!S41,data!S73)),\"\",CHOOSE(mySelectedAgeGroup,data!S9,data!S41,data!S73))","v":8.900000000000001E-2},{"$f":"IF(ISBLANK(CHOOSE(mySelectedAgeGroup,data!T9,data!T41,data!T73)),\"\",CHOOSE(mySelectedAgeGroup,data!T9,data!T41,data!T73))","v":7.9000000000000001E-2},{"$f":"IF(ISBLANK(CHOOSE(mySelectedAgeGroup,data!U9,data!U41,data!U73)),\"\",CHOOSE(mySelectedAgeGroup,data!U9,data!U41,data!U73))","v":6.0999999999999999E-2},{"$f":"IF(ISBLANK(CHOOSE(mySelectedAgeGroup,data!V9,data!V41,data!V73)),\"\",CHOOSE(mySelectedAgeGroup,data!V9,data!V41,data!V73))","v":0.05},{"$f":"IF(ISBLANK(CHOOSE(mySelectedAgeGroup,data!W9,data!W41,data!W73)),\"\",CHOOSE(mySelectedAgeGroup,data!W9,data!W41,data!W73))","v":0.06},{"$f":"IF(ISBLANK(CHOOSE(mySelectedAgeGroup,data!X9,data!X41,data!X73)),\"\",CHOOSE(mySelectedAgeGroup,data!X9,data!X41,data!X73))","v":9.1999999999999998E-2},{"$f":"IF(ISBLANK(CHOOSE(mySelectedAgeGroup,data!Y9,data!Y41,data!Y73)),\"\",CHOOSE(mySelectedAgeGroup,data!Y9,data!Y41,data!Y73))","v":0.10099999999999999},{"$f":"IF(ISBLANK(CHOOSE(mySelectedAgeGroup,data!Z9,data!Z41,data!Z73)),\"\",CHOOSE(mySelectedAgeGroup,data!Z9,data!Z41,data!Z73))","v":0.11},{"$f":"IF(ISBLANK(CHOOSE(mySelectedAgeGroup,data!AA9,data!AA41,data!AA73)),\"\",CHOOSE(mySelectedAgeGroup,data!AA9,data!AA41,data!AA73))","v":0.11800000000000001},{"$f":"IF(ISBLANK(CHOOSE(mySelectedAgeGroup,data!AB9,data!AB41,data!AB73)),\"\",CHOOSE(mySelectedAgeGroup,data!AB9,data!AB41,data!AB73))","v":0.107},{"$f":"IF(ISBLANK(CHOOSE(mySelectedAgeGroup,data!AC9,data!AC41,data!AC73)),\"\",CHOOSE(mySelectedAgeGroup,data!AC9,data!AC41,data!AC73))","v":8.4000000000000005E-2},{"$f":"IF(ISBLANK(CHOOSE(mySelectedAgeGroup,data!AD9,data!AD41,data!AD73)),\"\",CHOOSE(mySelectedAgeGroup,data!AD9,data!AD41,data!AD73))","v":7.0999999999999994E-2},{"$f":"IF(ISBLANK(CHOOSE(mySelectedAgeGroup,data!AE9,data!AE41,data!AE73)),\"\",CHOOSE(mySelectedAgeGroup,data!AE9,data!AE41,data!AE73))","v":5.7999999999999996E-2},{"$f":"IF(ISBLANK(CHOOSE(mySelectedAgeGroup,data!AF9,data!AF41,data!AF73)),\"\",CHOOSE(mySelectedAgeGroup,data!AF9,data!AF41,data!AF73))","v":4.9000000000000002E-2},{"$f":"IF(ISBLANK(CHOOSE(mySelectedAgeGroup,data!AG9,data!AG41,data!AG73)),\"\",CHOOSE(mySelectedAgeGroup,data!AG9,data!AG41,data!AG73))","v":0.04},{"$f":"IF(ISBLANK(CHOOSE(mySelectedAgeGroup,data!AH9,data!AH41,data!AH73)),\"\",CHOOSE(mySelectedAgeGroup,data!AH9,data!AH41,data!AH73))","v":4.3999999999999997E-2}]
[null,null,{"$f":"data!B10","v":"Croatia"},{"$f":"IF(ISBLANK(CHOOSE(mySelectedAgeGroup,data!D10,data!D42,data!D74)),\"\",CHOOSE(mySelectedAgeGroup,data!D10,data!D42,data!D74))","v":""},{"$f":"IF(ISBLANK(CHOOSE(mySelectedAgeGroup,data!E10,data!E42,data!E74)),\"\",CHOOSE(mySelectedAgeGroup,data!E10,data!E42,data!E74))","v":""},{"$f":"IF(ISBLANK(CHOOSE(mySelectedAgeGroup,data!F10,data!F42,data!F74)),\"\",CHOOSE(mySelectedAgeGroup,data!F10,data!F42,data!F74))","v":""},{"$f":"IF(ISBLANK(CHOOSE(mySelectedAgeGroup,data!G10,data!G42,data!G74)),\"\",CHOOSE(mySelectedAgeGroup,data!G10,data!G42,data!G74))","v":""},{"$f":"IF(ISBLANK(CHOOSE(mySelectedAgeGroup,data!H10,data!H42,data!H74)),\"\",CHOOSE(mySelectedAgeGroup,data!H10,data!H42,data!H74))","v":""},{"$f":"IF(ISBLANK(CHOOSE(mySelectedAgeGroup,data!I10,data!I42,data!I74)),\"\",CHOOSE(mySelectedAgeGroup,data!I10,data!I42,data!I74))","v":""},{"$f":"IF(ISBLANK(CHOOSE(mySelectedAgeGroup,data!J10,data!J42,data!J74)),\"\",CHOOSE(mySelectedAgeGroup,data!J10,data!J42,data!J74))","v":""},{"$f":"IF(ISBLANK(CHOOSE(mySelectedAgeGroup,data!K10,data!K42,data!K74)),\"\",CHOOSE(mySelectedAgeGroup,data!K10,data!K42,data!K74))","v":""},{"$f":"IF(ISBLANK(CHOOSE(mySelectedAgeGroup,data!L10,data!L42,data!L74)),\"\",CHOOSE(mySelectedAgeGroup,data!L10,data!L42,data!L74))","v":""},{"$f":"IF(ISBLANK(CHOOSE(mySelectedAgeGroup,data!M10,data!M42,data!M74)),\"\",CHOOSE(mySelectedAgeGroup,data!M10,data!M42,data!M74))","v":""},{"$f":"IF(ISBLANK(CHOOSE(mySelectedAgeGroup,data!N10,data!N42,data!N74)),\"\",CHOOSE(mySelectedAgeGroup,data!N10,data!N42,data!N74))","v":0.125},{"$f":"IF(ISBLANK(CHOOSE(mySelectedAgeGroup,data!O10,data!O42,data!O74)),\"\",CHOOSE(mySelectedAgeGroup,data!O10,data!O42,data!O74))","v":0.128},{"$f":"IF(ISBLANK(CHOOSE(mySelectedAgeGroup,data!P10,data!P42,data!P74)),\"\",CHOOSE(mySelectedAgeGroup,data!P10,data!P42,data!P74))","v":0.11900000000000001},{"$f":"IF(ISBLANK(CHOOSE(mySelectedAgeGroup,data!Q10,data!Q42,data!Q74)),\"\",CHOOSE(mySelectedAgeGroup,data!Q10,data!Q42,data!Q74))","v":0.113},{"$f":"IF(ISBLANK(CHOOSE(mySelectedAgeGroup,data!R10,data!R42,data!R74)),\"\",CHOOSE(mySelectedAgeGroup,data!R10,data!R42,data!R74))","v":0.111},{"$f":"IF(ISBLANK(CHOOSE(mySelectedAgeGroup,data!S10,data!S42,data!S74)),\"\",CHOOSE(mySelectedAgeGroup,data!S10,data!S42,data!S74))","v":0.10300000000000001},{"$f":"IF(ISBLANK(CHOOSE(mySelectedAgeGroup,data!T10,data!T42,data!T74)),\"\",CHOOSE(mySelectedAgeGroup,data!T10,data!T42,data!T74))","v":9.1999999999999998E-2},{"$f":"IF(ISBLANK(CHOOSE(mySelectedAgeGroup,data!U10,data!U42,data!U74)),\"\",CHOOSE(mySelectedAgeGroup,data!U10,data!U42,data!U74))","v":8.199999999999999E-2},{"$f":"IF(ISBLANK(CHOOSE(mySelectedAgeGroup,data!V10,data!V42,data!V74)),\"\",CHOOSE(mySelectedAgeGroup,data!V10,data!V42,data!V74))","v":6.9000000000000006E-2},{"$f":"IF(ISBLANK(CHOOSE(mySelectedAgeGroup,data!W10,data!W42,data!W74)),\"\",CHOOSE(mySelectedAgeGroup,data!W10,data!W42,data!W74))","v":7.4999999999999997E-2},{"$f":"IF(ISBLANK(CHOOSE(mySelectedAgeGroup,data!X10,data!X42,data!X74)),\"\",CHOOSE(mySelectedAgeGroup,data!X10,data!X42,data!X74))","v":9.5000000000000001E-2},{"$f":"IF(ISBLANK(CHOOSE(mySelectedAgeGroup,data!Y10,data!Y42,data!Y74)),\"\",CHOOSE(mySelectedAgeGroup,data!Y10,data!Y42,data!Y74))","v":0.11599999999999999},{"$f":"IF(ISBLANK(CHOOSE(mySelectedAgeGroup,data!Z10,data!Z42,data!Z74)),\"\",CHOOSE(mySelectedAgeGroup,data!Z10,data!Z42,data!Z74))","v":0.13699999999999998},{"$f":"IF(ISBLANK(CHOOSE(mySelectedAgeGroup,data!AA10,data!AA42,data!AA74)),\"\",CHOOSE(mySelectedAgeGroup,data!AA10,data!AA42,data!AA74))","v":0.14400000000000002},{"$f":"IF(ISBLANK(CHOOSE(mySelectedAgeGroup,data!AB10,data!AB42,data!AB74)),\"\",CHOOSE(mySelectedAgeGroup,data!AB10,data!AB42,data!AB74))","v":0.14599999999999999},{"$f":"IF(ISBLANK(CHOOSE(mySelectedAgeGroup,data!AC10,data!AC42,data!AC74)),\"\",CHOOSE(mySelectedAgeGroup,data!AC10,data!AC42,data!AC74))","v":0.13800000000000001},{"$f":"IF(ISBLANK(CHOOSE(mySelectedAgeGroup,data!AD10,data!AD42,data!AD74)),\"\",CHOOSE(mySelectedAgeGroup,data!AD10,data!AD42,data!AD74))","v":0.11199999999999999},{"$f":"IF(ISBLANK(CHOOSE(mySelectedAgeGroup,data!AE10,data!AE42,data!AE74)),\"\",CHOOSE(mySelectedAgeGroup,data!AE10,data!AE42,data!AE74))","v":9.6000000000000002E-2},{"$f":"IF(ISBLANK(CHOOSE(mySelectedAgeGroup,data!AF10,data!AF42,data!AF74)),\"\",CHOOSE(mySelectedAgeGroup,data!AF10,data!AF42,data!AF74))","v":7.0000000000000007E-2},{"$f":"IF(ISBLANK(CHOOSE(mySelectedAgeGroup,data!AG10,data!AG42,data!AG74)),\"\",CHOOSE(mySelectedAgeGroup,data!AG10,data!AG42,data!AG74))","v":5.7000000000000002E-2},{"$f":"IF(ISBLANK(CHOOSE(mySelectedAgeGroup,data!AH10,data!AH42,data!AH74)),\"\",CHOOSE(mySelectedAgeGroup,data!AH10,data!AH42,data!AH74))","v":6.3E-2}]
[null,null,{"$f":"data!B11","v":"Cyprus"},{"$f":"IF(ISBLANK(CHOOSE(mySelectedAgeGroup,data!D11,data!D43,data!D75)),\"\",CHOOSE(mySelectedAgeGroup,data!D11,data!D43,data!D75))","v":""},{"$f":"IF(ISBLANK(CHOOSE(mySelectedAgeGroup,data!E11,data!E43,data!E75)),\"\",CHOOSE(mySelectedAgeGroup,data!E11,data!E43,data!E75))","v":""},{"$f":"IF(ISBLANK(CHOOSE(mySelectedAgeGroup,data!F11,data!F43,data!F75)),\"\",CHOOSE(mySelectedAgeGroup,data!F11,data!F43,data!F75))","v":""},{"$f":"IF(ISBLANK(CHOOSE(mySelectedAgeGroup,data!G11,data!G43,data!G75)),\"\",CHOOSE(mySelectedAgeGroup,data!G11,data!G43,data!G75))","v":""},{"$f":"IF(ISBLANK(CHOOSE(mySelectedAgeGroup,data!H11,data!H43,data!H75)),\"\",CHOOSE(mySelectedAgeGroup,data!H11,data!H43,data!H75))","v":""},{"$f":"IF(ISBLANK(CHOOSE(mySelectedAgeGroup,data!I11,data!I43,data!I75)),\"\",CHOOSE(mySelectedAgeGroup,data!I11,data!I43,data!I75))","v":""},{"$f":"IF(ISBLANK(CHOOSE(mySelectedAgeGroup,data!J11,data!J43,data!J75)),\"\",CHOOSE(mySelectedAgeGroup,data!J11,data!J43,data!J75))","v":""},{"$f":"IF(ISBLANK(CHOOSE(mySelectedAgeGroup,data!K11,data!K43,data!K75)),\"\",CHOOSE(mySelectedAgeGroup,data!K11,data!K43,data!K75))","v":4.2000000000000003E-2},{"$f":"IF(ISBLANK(CHOOSE(mySelectedAgeGroup,data!L11,data!L43,data!L75)),\"\",CHOOSE(mySelectedAgeGroup,data!L11,data!L43,data!L75))","v":4.2999999999999997E-2},{"$f":"IF(ISBLANK(CHOOSE(mySelectedAgeGroup,data!M11,data!M43,data!M75)),\"\",CHOOSE(mySelectedAgeGroup,data!M11,data!M43,data!M75))","v":4.4999999999999998E-2},{"$f":"IF(ISBLANK(CHOOSE(mySelectedAgeGroup,data!N11,data!N43,data!N75)),\"\",CHOOSE(mySelectedAgeGroup,data!N11,data!N43,data!N75))","v":4.2000000000000003E-2},{"$f":"IF(ISBLANK(CHOOSE(mySelectedAgeGroup,data!O11,data!O43,data!O75)),\"\",CHOOSE(mySelectedAgeGroup,data!O11,data!O43,data!O75))","v":3.4000000000000002E-2},{"$f":"IF(ISBLANK(CHOOSE(mySelectedAgeGroup,data!P11,data!P43,data!P75)),\"\",CHOOSE(mySelectedAgeGroup,data!P11,data!P43,data!P75))","v":3.1E-2},{"$f":"IF(ISBLANK(CHOOSE(mySelectedAgeGroup,data!Q11,data!Q43,data!Q75)),\"\",CHOOSE(mySelectedAgeGroup,data!Q11,data!Q43,data!Q75))","v":3.7000000000000005E-2},{"$f":"IF(ISBLANK(CHOOSE(mySelectedAgeGroup,data!R11,data!R43,data!R75)),\"\",CHOOSE(mySelectedAgeGroup,data!R11,data!R43,data!R75))","v":4.0999999999999995E-2},{"$f":"IF(ISBLANK(CHOOSE(mySelectedAgeGroup,data!S11,data!S43,data!S75)),\"\",CHOOSE(mySelectedAgeGroup,data!S11,data!S43,data!S75))","v":4.2999999999999997E-2},{"$f":"IF(ISBLANK(CHOOSE(mySelectedAgeGroup,data!T11,data!T43,data!T75)),\"\",CHOOSE(mySelectedAgeGroup,data!T11,data!T43,data!T75))","v":3.9E-2},{"$f":"IF(ISBLANK(CHOOSE(mySelectedAgeGroup,data!U11,data!U43,data!U75)),\"\",CHOOSE(mySelectedAgeGroup,data!U11,data!U43,data!U75))","v":3.3000000000000002E-2},{"$f":"IF(ISBLANK(CHOOSE(mySelectedAgeGroup,data!V11,data!V43,data!V75)),\"\",CHOOSE(mySelectedAgeGroup,data!V11,data!V43,data!V75))","v":3.1E-2},{"$f":"IF(ISBLANK(CHOOSE(mySelectedAgeGroup,data!W11,data!W43,data!W75)),\"\",CHOOSE(mySelectedAgeGroup,data!W11,data!W43,data!W75))","v":4.4000000000000004E-2},{"$f":"IF(ISBLANK(CHOOSE(mySelectedAgeGroup,data!X11,data!X43,data!X75)),\"\",CHOOSE(mySelectedAgeGroup,data!X11,data!X43,data!X75))","v":5.0999999999999997E-2},{"$f":"IF(ISBLANK(CHOOSE(mySelectedAgeGroup,data!Y11,data!Y43,data!Y75)),\"\",CHOOSE(mySelectedAgeGroup,data!Y11,data!Y43,data!Y75))","v":6.4000000000000001E-2},{"$f":"IF(ISBLANK(CHOOSE(mySelectedAgeGroup,data!Z11,data!Z43,data!Z75)),\"\",CHOOSE(mySelectedAgeGroup,data!Z11,data!Z43,data!Z75))","v":0.10199999999999999},{"$f":"IF(ISBLANK(CHOOSE(mySelectedAgeGroup,data!AA11,data!AA43,data!AA75)),\"\",CHOOSE(mySelectedAgeGroup,data!AA11,data!AA43,data!AA75))","v":0.13600000000000001},{"$f":"IF(ISBLANK(CHOOSE(mySelectedAgeGroup,data!AB11,data!AB43,data!AB75)),\"\",CHOOSE(mySelectedAgeGroup,data!AB11,data!AB43,data!AB75))","v":0.14000000000000001},{"$f":"IF(ISBLANK(CHOOSE(mySelectedAgeGroup,data!AC11,data!AC43,data!AC75)),\"\",CHOOSE(mySelectedAgeGroup,data!AC11,data!AC43,data!AC75))","v":0.13200000000000001},{"$f":"IF(ISBLANK(CHOOSE(mySelectedAgeGroup,data!AD11,data!AD43,data!AD75)),\"\",CHOOSE(mySelectedAgeGroup,data!AD11,data!AD43,data!AD75))","v":0.115},{"$f":"IF(ISBLANK(CHOOSE(mySelectedAgeGroup,data!AE11,data!AE43,data!AE75)),\"\",CHOOSE(mySelectedAgeGroup,data!AE11,data!AE43,data!AE75))","v":9.9000000000000005E-2},{"$f":"IF(ISBLANK(CHOOSE(mySelectedAgeGroup,data!AF11,data!AF43,data!AF75)),\"\",CHOOSE(mySelectedAgeGroup,data!AF11,data!AF43,data!AF75))","v":7.2999999999999995E-2},{"$f":"IF(ISBLANK(CHOOSE(mySelectedAgeGroup,data!AG11,data!AG43,data!AG75)),\"\",CHOOSE(mySelectedAgeGroup,data!AG11,data!AG43,data!AG75))","v":6.3E-2},{"$f":"IF(ISBLANK(CHOOSE(mySelectedAgeGroup,data!AH11,data!AH43,data!AH75)),\"\",CHOOSE(mySelectedAgeGroup,data!AH11,data!AH43,data!AH75))","v":6.6000000000000003E-2}]
[null,null,{"$f":"data!B12","v":"Czech Republic"},{"$f":"IF(ISBLANK(CHOOSE(mySelectedAgeGroup,data!D12,data!D44,data!D76)),\"\",CHOOSE(mySelectedAgeGroup,data!D12,data!D44,data!D76))","v":""},{"$f":"IF(ISBLANK(CHOOSE(mySelectedAgeGroup,data!E12,data!E44,data!E76)),\"\",CHOOSE(mySelectedAgeGroup,data!E12,data!E44,data!E76))","v":""},{"$f":"IF(ISBLANK(CHOOSE(mySelectedAgeGroup,data!F12,data!F44,data!F76)),\"\",CHOOSE(mySelectedAgeGroup,data!F12,data!F44,data!F76))","v":""},{"$f":"IF(ISBLANK(CHOOSE(mySelectedAgeGroup,data!G12,data!G44,data!G76)),\"\",CHOOSE(mySelectedAgeGroup,data!G12,data!G44,data!G76))","v":3.5000000000000003E-2},{"$f":"IF(ISBLANK(CHOOSE(mySelectedAgeGroup,data!H12,data!H44,data!H76)),\"\",CHOOSE(mySelectedAgeGroup,data!H12,data!H44,data!H76))","v":3.4000000000000002E-2},{"$f":"IF(ISBLANK(CHOOSE(mySelectedAgeGroup,data!I12,data!I44,data!I76)),\"\",CHOOSE(mySelectedAgeGroup,data!I12,data!I44,data!I76))","v":""},{"$f":"IF(ISBLANK(CHOOSE(mySelectedAgeGroup,data!J12,data!J44,data!J76)),\"\",CHOOSE(mySelectedAgeGroup,data!J12,data!J44,data!J76))","v":""},{"$f":"IF(ISBLANK(CHOOSE(mySelectedAgeGroup,data!K12,data!K44,data!K76)),\"\",CHOOSE(mySelectedAgeGroup,data!K12,data!K44,data!K76))","v":""},{"$f":"IF(ISBLANK(CHOOSE(mySelectedAgeGroup,data!L12,data!L44,data!L76)),\"\",CHOOSE(mySelectedAgeGroup,data!L12,data!L44,data!L76))","v":5.2999999999999999E-2},{"$f":"IF(ISBLANK(CHOOSE(mySelectedAgeGroup,data!M12,data!M44,data!M76)),\"\",CHOOSE(mySelectedAgeGroup,data!M12,data!M44,data!M76))","v":7.2000000000000008E-2},{"$f":"IF(ISBLANK(CHOOSE(mySelectedAgeGroup,data!N12,data!N44,data!N76)),\"\",CHOOSE(mySelectedAgeGroup,data!N12,data!N44,data!N76))","v":7.400000000000001E-2},{"$f":"IF(ISBLANK(CHOOSE(mySelectedAgeGroup,data!O12,data!O44,data!O76)),\"\",CHOOSE(mySelectedAgeGroup,data!O12,data!O44,data!O76))","v":6.9000000000000006E-2},{"$f":"IF(ISBLANK(CHOOSE(mySelectedAgeGroup,data!P12,data!P44,data!P76)),\"\",CHOOSE(mySelectedAgeGroup,data!P12,data!P44,data!P76))","v":6.2E-2},{"$f":"IF(ISBLANK(CHOOSE(mySelectedAgeGroup,data!Q12,data!Q44,data!Q76)),\"\",CHOOSE(mySelectedAgeGroup,data!Q12,data!Q44,data!Q76))","v":6.6000000000000003E-2},{"$f":"IF(ISBLANK(CHOOSE(mySelectedAgeGroup,data!R12,data!R44,data!R76)),\"\",CHOOSE(mySelectedAgeGroup,data!R12,data!R44,data!R76))","v":7.0000000000000007E-2},{"$f":"IF(ISBLANK(CHOOSE(mySelectedAgeGroup,data!S12,data!S44,data!S76)),\"\",CHOOSE(mySelectedAgeGroup,data!S12,data!S44,data!S76))","v":6.8000000000000005E-2},{"$f":"IF(ISBLANK(CHOOSE(mySelectedAgeGroup,data!T12,data!T44,data!T76)),\"\",CHOOSE(mySelectedAgeGroup,data!T12,data!T44,data!T76))","v":6.2E-2},{"$f":"IF(ISBLANK(CHOOSE(mySelectedAgeGroup,data!U12,data!U44,data!U76)),\"\",CHOOSE(mySelectedAgeGroup,data!U12,data!U44,data!U76))","v":4.8000000000000001E-2},{"$f":"IF(ISBLANK(CHOOSE(mySelectedAgeGroup,data!V12,data!V44,data!V76)),\"\",CHOOSE(mySelectedAgeGroup,data!V12,data!V44,data!V76))","v":3.9E-2},{"$f":"IF(ISBLANK(CHOOSE(mySelectedAgeGroup,data!W12,data!W44,data!W76)),\"\",CHOOSE(mySelectedAgeGroup,data!W12,data!W44,data!W76))","v":5.7999999999999996E-2},{"$f":"IF(ISBLANK(CHOOSE(mySelectedAgeGroup,data!X12,data!X44,data!X76)),\"\",CHOOSE(mySelectedAgeGroup,data!X12,data!X44,data!X76))","v":6.4000000000000001E-2},{"$f":"IF(ISBLANK(CHOOSE(mySelectedAgeGroup,data!Y12,data!Y44,data!Y76)),\"\",CHOOSE(mySelectedAgeGroup,data!Y12,data!Y44,data!Y76))","v":5.9000000000000004E-2},{"$f":"IF(ISBLANK(CHOOSE(mySelectedAgeGroup,data!Z12,data!Z44,data!Z76)),\"\",CHOOSE(mySelectedAgeGroup,data!Z12,data!Z44,data!Z76))","v":0.06},{"$f":"IF(ISBLANK(CHOOSE(mySelectedAgeGroup,data!AA12,data!AA44,data!AA76)),\"\",CHOOSE(mySelectedAgeGroup,data!AA12,data!AA44,data!AA76))","v":6.0999999999999999E-2},{"$f":"IF(ISBLANK(CHOOSE(mySelectedAgeGroup,data!AB12,data!AB44,data!AB76)),\"\",CHOOSE(mySelectedAgeGroup,data!AB12,data!AB44,data!AB76))","v":5.4000000000000006E-2},{"$f":"IF(ISBLANK(CHOOSE(mySelectedAgeGroup,data!AC12,data!AC44,data!AC76)),\"\",CHOOSE(mySelectedAgeGroup,data!AC12,data!AC44,data!AC76))","v":4.4999999999999998E-2},{"$f":"IF(ISBLANK(CHOOSE(mySelectedAgeGroup,data!AD12,data!AD44,data!AD76)),\"\",CHOOSE(mySelectedAgeGroup,data!AD12,data!AD44,data!AD76))","v":3.5000000000000003E-2},{"$f":"IF(ISBLANK(CHOOSE(mySelectedAgeGroup,data!AE12,data!AE44,data!AE76)),\"\",CHOOSE(mySelectedAgeGroup,data!AE12,data!AE44,data!AE76))","v":2.6000000000000002E-2},{"$f":"IF(ISBLANK(CHOOSE(mySelectedAgeGroup,data!AF12,data!AF44,data!AF76)),\"\",CHOOSE(mySelectedAgeGroup,data!AF12,data!AF44,data!AF76))","v":0.02},{"$f":"IF(ISBLANK(CHOOSE(mySelectedAgeGroup,data!AG12,data!AG44,data!AG76)),\"\",CHOOSE(mySelectedAgeGroup,data!AG12,data!AG44,data!AG76))","v":1.8000000000000002E-2},{"$f":"IF(ISBLANK(CHOOSE(mySelectedAgeGroup,data!AH12,data!AH44,data!AH76)),\"\",CHOOSE(mySelectedAgeGroup,data!AH12,data!AH44,data!AH76))","v":1.7000000000000001E-2}]
[null,null,{"$f":"data!B13","v":"Denmark"},{"$f":"IF(ISBLANK(CHOOSE(mySelectedAgeGroup,data!D13,data!D45,data!D77)),\"\",CHOOSE(mySelectedAgeGroup,data!D13,data!D45,data!D77))","v":6.4000000000000001E-2},{"$f":"IF(ISBLANK(CHOOSE(mySelectedAgeGroup,data!E13,data!E45,data!E77)),\"\",CHOOSE(mySelectedAgeGroup,data!E13,data!E45,data!E77))","v":7.2000000000000008E-2},{"$f":"IF(ISBLANK(CHOOSE(mySelectedAgeGroup,data!F13,data!F45,data!F77)),\"\",CHOOSE(mySelectedAgeGroup,data!F13,data!F45,data!F77))","v":7.9000000000000001E-2},{"$f":"IF(ISBLANK(CHOOSE(mySelectedAgeGroup,data!G13,data!G45,data!G77)),\"\",CHOOSE(mySelectedAgeGroup,data!G13,data!G45,data!G77))","v":8.900000000000001E-2},{"$f":"IF(ISBLANK(CHOOSE(mySelectedAgeGroup,data!H13,data!H45,data!H77)),\"\",CHOOSE(mySelectedAgeGroup,data!H13,data!H45,data!H77))","v":7.2000000000000008E-2},{"$f":"IF(ISBLANK(CHOOSE(mySelectedAgeGroup,data!I13,data!I45,data!I77)),\"\",CHOOSE(mySelectedAgeGroup,data!I13,data!I45,data!I77))","v":6.6000000000000003E-2},{"$f":"IF(ISBLANK(CHOOSE(mySelectedAgeGroup,data!J13,data!J45,data!J77)),\"\",CHOOSE(mySelectedAgeGroup,data!J13,data!J45,data!J77))","v":6.0999999999999999E-2},{"$f":"IF(ISBLANK(CHOOSE(mySelectedAgeGroup,data!K13,data!K45,data!K77)),\"\",CHOOSE(mySelectedAgeGroup,data!K13,data!K45,data!K77))","v":5.0999999999999997E-2},{"$f":"IF(ISBLANK(CHOOSE(mySelectedAgeGroup,data!L13,data!L45,data!L77)),\"\",CHOOSE(mySelectedAgeGroup,data!L13,data!L45,data!L77))","v":4.9000000000000002E-2},{"$f":"IF(ISBLANK(CHOOSE(mySelectedAgeGroup,data!M13,data!M45,data!M77)),\"\",CHOOSE(mySelectedAgeGroup,data!M13,data!M45,data!M77))","v":4.9000000000000002E-2},{"$f":"IF(ISBLANK(CHOOSE(mySelectedAgeGroup,data!N13,data!N45,data!N77)),\"\",CHOOSE(mySelectedAgeGroup,data!N13,data!N45,data!N77))","v":4.2999999999999997E-2},{"$f":"IF(ISBLANK(CHOOSE(mySelectedAgeGroup,data!O13,data!O45,data!O77)),\"\",CHOOSE(mySelectedAgeGroup,data!O13,data!O45,data!O77))","v":0.04},{"$f":"IF(ISBLANK(CHOOSE(mySelectedAgeGroup,data!P13,data!P45,data!P77)),\"\",CHOOSE(mySelectedAgeGroup,data!P13,data!P45,data!P77))","v":4.0999999999999995E-2},{"$f":"IF(ISBLANK(CHOOSE(mySelectedAgeGroup,data!Q13,data!Q45,data!Q77)),\"\",CHOOSE(mySelectedAgeGroup,data!Q13,data!Q45,data!Q77))","v":4.8000000000000001E-2},{"$f":"IF(ISBLANK(CHOOSE(mySelectedAgeGroup,data!R13,data!R45,data!R77)),\"\",CHOOSE(mySelectedAgeGroup,data!R13,data!R45,data!R77))","v":5.0999999999999997E-2},{"$f":"IF(ISBLANK(CHOOSE(mySelectedAgeGroup,data!S13,data!S45,data!S77)),\"\",CHOOSE(mySelectedAgeGroup,data!S13,data!S45,data!S77))","v":4.2000000000000003E-2},{"$f":"IF(ISBLANK(CHOOSE(mySelectedAgeGroup,data!T13,data!T45,data!T77)),\"\",CHOOSE(mySelectedAgeGroup,data!T13,data!T45,data!T77))","v":3.2000000000000001E-2},{"$f":"IF(ISBLANK(CHOOSE(mySelectedAgeGroup,data!U13,data!U45,data!U77)),\"\",CHOOSE(mySelectedAgeGroup,data!U13,data!U45,data!U77))","v":3.2000000000000001E-2},{"$f":"IF(ISBLANK(CHOOSE(mySelectedAgeGroup,data!V13,data!V45,data!V77)),\"\",CHOOSE(mySelectedAgeGroup,data!V13,data!V45,data!V77))","v":2.6000000000000002E-2},{"$f":"IF(ISBLANK(CHOOSE(mySelectedAgeGroup,data!W13,data!W45,data!W77)),\"\",CHOOSE(mySelectedAgeGroup,data!W13,data!W45,data!W77))","v":5.0999999999999997E-2},{"$f":"IF(ISBLANK(CHOOSE(mySelectedAgeGroup,data!X13,data!X45,data!X77)),\"\",CHOOSE(mySelectedAgeGroup,data!X13,data!X45,data!X77))","v":6.4000000000000001E-2},{"$f":"IF(ISBLANK(CHOOSE(mySelectedAgeGroup,data!Y13,data!Y45,data!Y77)),\"\",CHOOSE(mySelectedAgeGroup,data!Y13,data!Y45,data!Y77))","v":6.2E-2},{"$f":"IF(ISBLANK(CHOOSE(mySelectedAgeGroup,data!Z13,data!Z45,data!Z77)),\"\",CHOOSE(mySelectedAgeGroup,data!Z13,data!Z45,data!Z77))","v":6.4000000000000001E-2},{"$f":"IF(ISBLANK(CHOOSE(mySelectedAgeGroup,data!AA13,data!AA45,data!AA77)),\"\",CHOOSE(mySelectedAgeGroup,data!AA13,data!AA45,data!AA77))","v":6.0999999999999999E-2},{"$f":"IF(ISBLANK(CHOOSE(mySelectedAgeGroup,data!AB13,data!AB45,data!AB77)),\"\",CHOOSE(mySelectedAgeGroup,data!AB13,data!AB45,data!AB77))","v":5.7000000000000002E-2},{"$f":"IF(ISBLANK(CHOOSE(mySelectedAgeGroup,data!AC13,data!AC45,data!AC77)),\"\",CHOOSE(mySelectedAgeGroup,data!AC13,data!AC45,data!AC77))","v":5.2999999999999999E-2},{"$f":"IF(ISBLANK(CHOOSE(mySelectedAgeGroup,data!AD13,data!AD45,data!AD77)),\"\",CHOOSE(mySelectedAgeGroup,data!AD13,data!AD45,data!AD77))","v":4.9000000000000002E-2},{"$f":"IF(ISBLANK(CHOOSE(mySelectedAgeGroup,data!AE13,data!AE45,data!AE77)),\"\",CHOOSE(mySelectedAgeGroup,data!AE13,data!AE45,data!AE77))","v":4.7E-2},{"$f":"IF(ISBLANK(CHOOSE(mySelectedAgeGroup,data!AF13,data!AF45,data!AF77)),\"\",CHOOSE(mySelectedAgeGroup,data!AF13,data!AF45,data!AF77))","v":4.2000000000000003E-2},{"$f":"IF(ISBLANK(CHOOSE(mySelectedAgeGroup,data!AG13,data!AG45,data!AG77)),\"\",CHOOSE(mySelectedAgeGroup,data!AG13,data!AG45,data!AG77))","v":4.2000000000000003E-2},{"$f":"IF(ISBLANK(CHOOSE(mySelectedAgeGroup,data!AH13,data!AH45,data!AH77)),\"\",CHOOSE(mySelectedAgeGroup,data!AH13,data!AH45,data!AH77))","v":0.04}]
[null,null,{"$f":"data!B14","v":"Estonia"},{"$f":"IF(ISBLANK(CHOOSE(mySelectedAgeGroup,data!D14,data!D46,data!D78)),\"\",CHOOSE(mySelectedAgeGroup,data!D14,data!D46,data!D78))","v":""},{"$f":"IF(ISBLANK(CHOOSE(mySelectedAgeGroup,data!E14,data!E46,data!E78)),\"\",CHOOSE(mySelectedAgeGroup,data!E14,data!E46,data!E78))","v":""},{"$f":"IF(ISBLANK(CHOOSE(mySelectedAgeGroup,data!F14,data!F46,data!F78)),\"\",CHOOSE(mySelectedAgeGroup,data!F14,data!F46,data!F78))","v":""},{"$f":"IF(ISBLANK(CHOOSE(mySelectedAgeGroup,data!G14,data!G46,data!G78)),\"\",CHOOSE(mySelectedAgeGroup,data!G14,data!G46,data!G78))","v":""},{"$f":"IF(ISBLANK(CHOOSE(mySelectedAgeGroup,data!H14,data!H46,data!H78)),\"\",CHOOSE(mySelectedAgeGroup,data!H14,data!H46,data!H78))","v":""},{"$f":"IF(ISBLANK(CHOOSE(mySelectedAgeGroup,data!I14,data!I46,data!I78)),\"\",CHOOSE(mySelectedAgeGroup,data!I14,data!I46,data!I78))","v":""},{"$f":"IF(ISBLANK(CHOOSE(mySelectedAgeGroup,data!J14,data!J46,data!J78)),\"\",CHOOSE(mySelectedAgeGroup,data!J14,data!J46,data!J78))","v":""},{"$f":"IF(ISBLANK(CHOOSE(mySelectedAgeGroup,data!K14,data!K46,data!K78)),\"\",CHOOSE(mySelectedAgeGroup,data!K14,data!K46,data!K78))","v":9.1999999999999998E-2},{"$f":"IF(ISBLANK(CHOOSE(mySelectedAgeGroup,data!L14,data!L46,data!L78)),\"\",CHOOSE(mySelectedAgeGroup,data!L14,data!L46,data!L78))","v":9.1999999999999998E-2},{"$f":"IF(ISBLANK(CHOOSE(mySelectedAgeGroup,data!M14,data!M46,data!M78)),\"\",CHOOSE(mySelectedAgeGroup,data!M14,data!M46,data!M78))","v":0.113},{"$f":"IF(ISBLANK(CHOOSE(mySelectedAgeGroup,data!N14,data!N46,data!N78)),\"\",CHOOSE(mySelectedAgeGroup,data!N14,data!N46,data!N78))","v":0.13400000000000001},{"$f":"IF(ISBLANK(CHOOSE(mySelectedAgeGroup,data!O14,data!O46,data!O78)),\"\",CHOOSE(mySelectedAgeGroup,data!O14,data!O46,data!O78))","v":0.11900000000000001},{"$f":"IF(ISBLANK(CHOOSE(mySelectedAgeGroup,data!P14,data!P46,data!P78)),\"\",CHOOSE(mySelectedAgeGroup,data!P14,data!P46,data!P78))","v":0.105},{"$f":"IF(ISBLANK(CHOOSE(mySelectedAgeGroup,data!Q14,data!Q46,data!Q78)),\"\",CHOOSE(mySelectedAgeGroup,data!Q14,data!Q46,data!Q78))","v":0.09},{"$f":"IF(ISBLANK(CHOOSE(mySelectedAgeGroup,data!R14,data!R46,data!R78)),\"\",CHOOSE(mySelectedAgeGroup,data!R14,data!R46,data!R78))","v":8.4000000000000005E-2},{"$f":"IF(ISBLANK(CHOOSE(mySelectedAgeGroup,data!S14,data!S46,data!S78)),\"\",CHOOSE(mySelectedAgeGroup,data!S14,data!S46,data!S78))","v":7.2000000000000008E-2},{"$f":"IF(ISBLANK(CHOOSE(mySelectedAgeGroup,data!T14,data!T46,data!T78)),\"\",CHOOSE(mySelectedAgeGroup,data!T14,data!T46,data!T78))","v":5.2000000000000005E-2},{"$f":"IF(ISBLANK(CHOOSE(mySelectedAgeGroup,data!U14,data!U46,data!U78)),\"\",CHOOSE(mySelectedAgeGroup,data!U14,data!U46,data!U78))","v":3.9E-2},{"$f":"IF(ISBLANK(CHOOSE(mySelectedAgeGroup,data!V14,data!V46,data!V78)),\"\",CHOOSE(mySelectedAgeGroup,data!V14,data!V46,data!V78))","v":4.5999999999999999E-2},{"$f":"IF(ISBLANK(CHOOSE(mySelectedAgeGroup,data!W14,data!W46,data!W78)),\"\",CHOOSE(mySelectedAgeGroup,data!W14,data!W46,data!W78))","v":0.11900000000000001},{"$f":"IF(ISBLANK(CHOOSE(mySelectedAgeGroup,data!X14,data!X46,data!X78)),\"\",CHOOSE(mySelectedAgeGroup,data!X14,data!X46,data!X78))","v":0.14899999999999999},{"$f":"IF(ISBLANK(CHOOSE(mySelectedAgeGroup,data!Y14,data!Y46,data!Y78)),\"\",CHOOSE(mySelectedAgeGroup,data!Y14,data!Y46,data!Y78))","v":0.11199999999999999},{"$f":"IF(ISBLANK(CHOOSE(mySelectedAgeGroup,data!Z14,data!Z46,data!Z78)),\"\",CHOOSE(mySelectedAgeGroup,data!Z14,data!Z46,data!Z78))","v":8.900000000000001E-2},{"$f":"IF(ISBLANK(CHOOSE(mySelectedAgeGroup,data!AA14,data!AA46,data!AA78)),\"\",CHOOSE(mySelectedAgeGroup,data!AA14,data!AA46,data!AA78))","v":7.5999999999999998E-2},{"$f":"IF(ISBLANK(CHOOSE(mySelectedAgeGroup,data!AB14,data!AB46,data!AB78)),\"\",CHOOSE(mySelectedAgeGroup,data!AB14,data!AB46,data!AB78))","v":6.7000000000000004E-2},{"$f":"IF(ISBLANK(CHOOSE(mySelectedAgeGroup,data!AC14,data!AC46,data!AC78)),\"\",CHOOSE(mySelectedAgeGroup,data!AC14,data!AC46,data!AC78))","v":5.5999999999999994E-2},{"$f":"IF(ISBLANK(CHOOSE(mySelectedAgeGroup,data!AD14,data!AD46,data!AD78)),\"\",CHOOSE(mySelectedAgeGroup,data!AD14,data!AD46,data!AD78))","v":6.2E-2},{"$f":"IF(ISBLANK(CHOOSE(mySelectedAgeGroup,data!AE14,data!AE46,data!AE78)),\"\",CHOOSE(mySelectedAgeGroup,data!AE14,data!AE46,data!AE78))","v":5.2000000000000005E-2},{"$f":"IF(ISBLANK(CHOOSE(mySelectedAgeGroup,data!AF14,data!AF46,data!AF78)),\"\",CHOOSE(mySelectedAgeGroup,data!AF14,data!AF46,data!AF78))","v":4.8000000000000001E-2},{"$f":"IF(ISBLANK(CHOOSE(mySelectedAgeGroup,data!AG14,data!AG46,data!AG78)),\"\",CHOOSE(mySelectedAgeGroup,data!AG14,data!AG46,data!AG78))","v":3.9E-2},{"$f":"IF(ISBLANK(CHOOSE(mySelectedAgeGroup,data!AH14,data!AH46,data!AH78)),\"\",CHOOSE(mySelectedAgeGroup,data!AH14,data!AH46,data!AH78))","v":4.5999999999999999E-2}]
[null,null,{"$f":"data!B15","v":"Finland"},{"$f":"IF(ISBLANK(CHOOSE(mySelectedAgeGroup,data!D15,data!D47,data!D79)),\"\",CHOOSE(mySelectedAgeGroup,data!D15,data!D47,data!D79))","v":2.1000000000000001E-2},{"$f":"IF(ISBLANK(CHOOSE(mySelectedAgeGroup,data!E15,data!E47,data!E79)),\"\",CHOOSE(mySelectedAgeGroup,data!E15,data!E47,data!E79))","v":5.0999999999999997E-2},{"$f":"IF(ISBLANK(CHOOSE(mySelectedAgeGroup,data!F15,data!F47,data!F79)),\"\",CHOOSE(mySelectedAgeGroup,data!F15,data!F47,data!F79))","v":9.6000000000000002E-2},{"$f":"IF(ISBLANK(CHOOSE(mySelectedAgeGroup,data!G15,data!G47,data!G79)),\"\",CHOOSE(mySelectedAgeGroup,data!G15,data!G47,data!G79))","v":0.14099999999999999},{"$f":"IF(ISBLANK(CHOOSE(mySelectedAgeGroup,data!H15,data!H47,data!H79)),\"\",CHOOSE(mySelectedAgeGroup,data!H15,data!H47,data!H79))","v":0.14499999999999999},{"$f":"IF(ISBLANK(CHOOSE(mySelectedAgeGroup,data!I15,data!I47,data!I79)),\"\",CHOOSE(mySelectedAgeGroup,data!I15,data!I47,data!I79))","v":""},{"$f":"IF(ISBLANK(CHOOSE(mySelectedAgeGroup,data!J15,data!J47,data!J79)),\"\",CHOOSE(mySelectedAgeGroup,data!J15,data!J47,data!J79))","v":0.12},{"$f":"IF(ISBLANK(CHOOSE(mySelectedAgeGroup,data!K15,data!K47,data!K79)),\"\",CHOOSE(mySelectedAgeGroup,data!K15,data!K47,data!K79))","v":0.115},{"$f":"IF(ISBLANK(CHOOSE(mySelectedAgeGroup,data!L15,data!L47,data!L79)),\"\",CHOOSE(mySelectedAgeGroup,data!L15,data!L47,data!L79))","v":9.8000000000000004E-2},{"$f":"IF(ISBLANK(CHOOSE(mySelectedAgeGroup,data!M15,data!M47,data!M79)),\"\",CHOOSE(mySelectedAgeGroup,data!M15,data!M47,data!M79))","v":8.5999999999999993E-2},{"$f":"IF(ISBLANK(CHOOSE(mySelectedAgeGroup,data!N15,data!N47,data!N79)),\"\",CHOOSE(mySelectedAgeGroup,data!N15,data!N47,data!N79))","v":8.1000000000000003E-2},{"$f":"IF(ISBLANK(CHOOSE(mySelectedAgeGroup,data!O15,data!O47,data!O79)),\"\",CHOOSE(mySelectedAgeGroup,data!O15,data!O47,data!O79))","v":7.5999999999999998E-2},{"$f":"IF(ISBLANK(CHOOSE(mySelectedAgeGroup,data!P15,data!P47,data!P79)),\"\",CHOOSE(mySelectedAgeGroup,data!P15,data!P47,data!P79))","v":7.400000000000001E-2},{"$f":"IF(ISBLANK(CHOOSE(mySelectedAgeGroup,data!Q15,data!Q47,data!Q79)),\"\",CHOOSE(mySelectedAgeGroup,data!Q15,data!Q47,data!Q79))","v":7.2000000000000008E-2},{"$f":"IF(ISBLANK(CHOOSE(mySelectedAgeGroup,data!R15,data!R47,data!R79)),\"\",CHOOSE(mySelectedAgeGroup,data!R15,data!R47,data!R79))","v":7.2000000000000008E-2},{"$f":"IF(ISBLANK(CHOOSE(mySelectedAgeGroup,data!S15,data!S47,data!S79)),\"\",CHOOSE(mySelectedAgeGroup,data!S15,data!S47,data!S79))","v":6.8000000000000005E-2},{"$f":"IF(ISBLANK(CHOOSE(mySelectedAgeGroup,data!T15,data!T47,data!T79)),\"\",CHOOSE(mySelectedAgeGroup,data!T15,data!T47,data!T79))","v":6.2E-2},{"$f":"IF(ISBLANK(CHOOSE(mySelectedAgeGroup,data!U15,data!U47,data!U79)),\"\",CHOOSE(mySelectedAgeGroup,data!U15,data!U47,data!U79))","v":5.4000000000000006E-2},{"$f":"IF(ISBLANK(CHOOSE(mySelectedAgeGroup,data!V15,data!V47,data!V79)),\"\",CHOOSE(mySelectedAgeGroup,data!V15,data!V47,data!V79))","v":4.9000000000000002E-2},{"$f":"IF(ISBLANK(CHOOSE(mySelectedAgeGroup,data!W15,data!W47,data!W79)),\"\",CHOOSE(mySelectedAgeGroup,data!W15,data!W47,data!W79))","v":6.4000000000000001E-2},{"$f":"IF(ISBLANK(CHOOSE(mySelectedAgeGroup,data!X15,data!X47,data!X79)),\"\",CHOOSE(mySelectedAgeGroup,data!X15,data!X47,data!X79))","v":6.6000000000000003E-2},{"$f":"IF(ISBLANK(CHOOSE(mySelectedAgeGroup,data!Y15,data!Y47,data!Y79)),\"\",CHOOSE(mySelectedAgeGroup,data!Y15,data!Y47,data!Y79))","v":6.0999999999999999E-2},{"$f":"IF(ISBLANK(CHOOSE(mySelectedAgeGroup,data!Z15,data!Z47,data!Z79)),\"\",CHOOSE(mySelectedAgeGroup,data!Z15,data!Z47,data!Z79))","v":6.0999999999999999E-2},{"$f":"IF(ISBLANK(CHOOSE(mySelectedAgeGroup,data!AA15,data!AA47,data!AA79)),\"\",CHOOSE(mySelectedAgeGroup,data!AA15,data!AA47,data!AA79))","v":6.5000000000000002E-2},{"$f":"IF(ISBLANK(CHOOSE(mySelectedAgeGroup,data!AB15,data!AB47,data!AB79)),\"\",CHOOSE(mySelectedAgeGroup,data!AB15,data!AB47,data!AB79))","v":7.0000000000000007E-2},{"$f":"IF(ISBLANK(CHOOSE(mySelectedAgeGroup,data!AC15,data!AC47,data!AC79)),\"\",CHOOSE(mySelectedAgeGroup,data!AC15,data!AC47,data!AC79))","v":7.5999999999999998E-2},{"$f":"IF(ISBLANK(CHOOSE(mySelectedAgeGroup,data!AD15,data!AD47,data!AD79)),\"\",CHOOSE(mySelectedAgeGroup,data!AD15,data!AD47,data!AD79))","v":7.2999999999999995E-2},{"$f":"IF(ISBLANK(CHOOSE(mySelectedAgeGroup,data!AE15,data!AE47,data!AE79)),\"\",CHOOSE(mySelectedAgeGroup,data!AE15,data!AE47,data!AE79))","v":7.0999999999999994E-2},{"$f":"IF(ISBLANK(CHOOSE(mySelectedAgeGroup,data!AF15,data!AF47,data!AF79)),\"\",CHOOSE(mySelectedAgeGroup,data!AF15,data!AF47,data!AF79))","v":6.0999999999999999E-2},{"$f":"IF(ISBLANK(CHOOSE(mySelectedAgeGroup,data!AG15,data!AG47,data!AG79)),\"\",CHOOSE(mySelectedAgeGroup,data!AG15,data!AG47,data!AG79))","v":5.2999999999999999E-2},{"$f":"IF(ISBLANK(CHOOSE(mySelectedAgeGroup,data!AH15,data!AH47,data!AH79)),\"\",CHOOSE(mySelectedAgeGroup,data!AH15,data!AH47,data!AH79))","v":0.05}]
[null,null,{"$f":"data!B16","v":"France"},{"$f":"IF(ISBLANK(CHOOSE(mySelectedAgeGroup,data!D16,data!D48,data!D80)),\"\",CHOOSE(mySelectedAgeGroup,data!D16,data!D48,data!D80))","v":5.2000000000000005E-2},{"$f":"IF(ISBLANK(CHOOSE(mySelectedAgeGroup,data!E16,data!E48,data!E80)),\"\",CHOOSE(mySelectedAgeGroup,data!E16,data!E48,data!E80))","v":5.2000000000000005E-2},{"$f":"IF(ISBLANK(CHOOSE(mySelectedAgeGroup,data!F16,data!F48,data!F80)),\"\",CHOOSE(mySelectedAgeGroup,data!F16,data!F48,data!F80))","v":5.7000000000000002E-2},{"$f":"IF(ISBLANK(CHOOSE(mySelectedAgeGroup,data!G16,data!G48,data!G80)),\"\",CHOOSE(mySelectedAgeGroup,data!G16,data!G48,data!G80))","v":6.0999999999999999E-2},{"$f":"IF(ISBLANK(CHOOSE(mySelectedAgeGroup,data!H16,data!H48,data!H80)),\"\",CHOOSE(mySelectedAgeGroup,data!H16,data!H48,data!H80))","v":6.3E-2},{"$f":"IF(ISBLANK(CHOOSE(mySelectedAgeGroup,data!I16,data!I48,data!I80)),\"\",CHOOSE(mySelectedAgeGroup,data!I16,data!I48,data!I80))","v":""},{"$f":"IF(ISBLANK(CHOOSE(mySelectedAgeGroup,data!J16,data!J48,data!J80)),\"\",CHOOSE(mySelectedAgeGroup,data!J16,data!J48,data!J80))","v":""},{"$f":"IF(ISBLANK(CHOOSE(mySelectedAgeGroup,data!K16,data!K48,data!K80)),\"\",CHOOSE(mySelectedAgeGroup,data!K16,data!K48,data!K80))","v":""},{"$f":"IF(ISBLANK(CHOOSE(mySelectedAgeGroup,data!L16,data!L48,data!L80)),\"\",CHOOSE(mySelectedAgeGroup,data!L16,data!L48,data!L80))","v":""},{"$f":"IF(ISBLANK(CHOOSE(mySelectedAgeGroup,data!M16,data!M48,data!M80)),\"\",CHOOSE(mySelectedAgeGroup,data!M16,data!M48,data!M80))","v":""},{"$f":"IF(ISBLANK(CHOOSE(mySelectedAgeGroup,data!N16,data!N48,data!N80)),\"\",CHOOSE(mySelectedAgeGroup,data!N16,data!N48,data!N80))","v":""},{"$f":"IF(ISBLANK(CHOOSE(mySelectedAgeGroup,data!O16,data!O48,data!O80)),\"\",CHOOSE(mySelectedAgeGroup,data!O16,data!O48,data!O80))","v":""},{"$f":"IF(ISBLANK(CHOOSE(mySelectedAgeGroup,data!P16,data!P48,data!P80)),\"\",CHOOSE(mySelectedAgeGroup,data!P16,data!P48,data!P80))","v":""},{"$f":"IF(ISBLANK(CHOOSE(mySelectedAgeGroup,data!Q16,data!Q48,data!Q80)),\"\",CHOOSE(mySelectedAgeGroup,data!Q16,data!Q48,data!Q80))","v":7.2999999999999995E-2},{"$f":"IF(ISBLANK(CHOOSE(mySelectedAgeGroup,data!R16,data!R48,data!R80)),\"\",CHOOSE(mySelectedAgeGroup,data!R16,data!R48,data!R80))","v":7.4999999999999997E-2},{"$f":"IF(ISBLANK(CHOOSE(mySelectedAgeGroup,data!S16,data!S48,data!S80)),\"\",CHOOSE(mySelectedAgeGroup,data!S16,data!S48,data!S80))","v":7.4999999999999997E-2},{"$f":"IF(ISBLANK(CHOOSE(mySelectedAgeGroup,data!T16,data!T48,data!T80)),\"\",CHOOSE(mySelectedAgeGroup,data!T16,data!T48,data!T80))","v":7.2999999999999995E-2},{"$f":"IF(ISBLANK(CHOOSE(mySelectedAgeGroup,data!U16,data!U48,data!U80)),\"\",CHOOSE(mySelectedAgeGroup,data!U16,data!U48,data!U80))","v":6.7000000000000004E-2},{"$f":"IF(ISBLANK(CHOOSE(mySelectedAgeGroup,data!V16,data!V48,data!V80)),\"\",CHOOSE(mySelectedAgeGroup,data!V16,data!V48,data!V80))","v":6.0999999999999999E-2},{"$f":"IF(ISBLANK(CHOOSE(mySelectedAgeGroup,data!W16,data!W48,data!W80)),\"\",CHOOSE(mySelectedAgeGroup,data!W16,data!W48,data!W80))","v":7.400000000000001E-2},{"$f":"IF(ISBLANK(CHOOSE(mySelectedAgeGroup,data!X16,data!X48,data!X80)),\"\",CHOOSE(mySelectedAgeGroup,data!X16,data!X48,data!X80))","v":7.6999999999999999E-2},{"$f":"IF(ISBLANK(CHOOSE(mySelectedAgeGroup,data!Y16,data!Y48,data!Y80)),\"\",CHOOSE(mySelectedAgeGroup,data!Y16,data!Y48,data!Y80))","v":7.6999999999999999E-2},{"$f":"IF(ISBLANK(CHOOSE(mySelectedAgeGroup,data!Z16,data!Z48,data!Z80)),\"\",CHOOSE(mySelectedAgeGroup,data!Z16,data!Z48,data!Z80))","v":8.199999999999999E-2},{"$f":"IF(ISBLANK(CHOOSE(mySelectedAgeGroup,data!AA16,data!AA48,data!AA80)),\"\",CHOOSE(mySelectedAgeGroup,data!AA16,data!AA48,data!AA80))","v":8.8000000000000009E-2},{"$f":"IF(ISBLANK(CHOOSE(mySelectedAgeGroup,data!AB16,data!AB48,data!AB80)),\"\",CHOOSE(mySelectedAgeGroup,data!AB16,data!AB48,data!AB80))","v":8.900000000000001E-2},{"$f":"IF(ISBLANK(CHOOSE(mySelectedAgeGroup,data!AC16,data!AC48,data!AC80)),\"\",CHOOSE(mySelectedAgeGroup,data!AC16,data!AC48,data!AC80))","v":8.900000000000001E-2},{"$f":"IF(ISBLANK(CHOOSE(mySelectedAgeGroup,data!AD16,data!AD48,data!AD80)),\"\",CHOOSE(mySelectedAgeGroup,data!AD16,data!AD48,data!AD80))","v":8.5000000000000006E-2},{"$f":"IF(ISBLANK(CHOOSE(mySelectedAgeGroup,data!AE16,data!AE48,data!AE80)),\"\",CHOOSE(mySelectedAgeGroup,data!AE16,data!AE48,data!AE80))","v":8.1000000000000003E-2},{"$f":"IF(ISBLANK(CHOOSE(mySelectedAgeGroup,data!AF16,data!AF48,data!AF80)),\"\",CHOOSE(mySelectedAgeGroup,data!AF16,data!AF48,data!AF80))","v":7.8E-2},{"$f":"IF(ISBLANK(CHOOSE(mySelectedAgeGroup,data!AG16,data!AG48,data!AG80)),\"\",CHOOSE(mySelectedAgeGroup,data!AG16,data!AG48,data!AG80))","v":7.2999999999999995E-2},{"$f":"IF(ISBLANK(CHOOSE(mySelectedAgeGroup,data!AH16,data!AH48,data!AH80)),\"\",CHOOSE(mySelectedAgeGroup,data!AH16,data!AH48,data!AH80))","v":7.2999999999999995E-2}]
[null,null,{"$f":"data!B17","v":"Germany"},{"$f":"IF(ISBLANK(CHOOSE(mySelectedAgeGroup,data!D17,data!D49,data!D81)),\"\",CHOOSE(mySelectedAgeGroup,data!D17,data!D49,data!D81))","v":""},{"$f":"IF(ISBLANK(CHOOSE(mySelectedAgeGroup,data!E17,data!E49,data!E81)),\"\",CHOOSE(mySelectedAgeGroup,data!E17,data!E49,data!E81))","v":5.5E-2},{"$f":"IF(ISBLANK(CHOOSE(mySelectedAgeGroup,data!F17,data!F49,data!F81)),\"\",CHOOSE(mySelectedAgeGroup,data!F17,data!F49,data!F81))","v":6.6000000000000003E-2},{"$f":"IF(ISBLANK(CHOOSE(mySelectedAgeGroup,data!G17,data!G49,data!G81)),\"\",CHOOSE(mySelectedAgeGroup,data!G17,data!G49,data!G81))","v":7.6999999999999999E-2},{"$f":"IF(ISBLANK(CHOOSE(mySelectedAgeGroup,data!H17,data!H49,data!H81)),\"\",CHOOSE(mySelectedAgeGroup,data!H17,data!H49,data!H81))","v":8.4000000000000005E-2},{"$f":"IF(ISBLANK(CHOOSE(mySelectedAgeGroup,data!I17,data!I49,data!I81)),\"\",CHOOSE(mySelectedAgeGroup,data!I17,data!I49,data!I81))","v":8.3000000000000004E-2},{"$f":"IF(ISBLANK(CHOOSE(mySelectedAgeGroup,data!J17,data!J49,data!J81)),\"\",CHOOSE(mySelectedAgeGroup,data!J17,data!J49,data!J81))","v":0.09},{"$f":"IF(ISBLANK(CHOOSE(mySelectedAgeGroup,data!K17,data!K49,data!K81)),\"\",CHOOSE(mySelectedAgeGroup,data!K17,data!K49,data!K81))","v":9.8000000000000004E-2},{"$f":"IF(ISBLANK(CHOOSE(mySelectedAgeGroup,data!L17,data!L49,data!L81)),\"\",CHOOSE(mySelectedAgeGroup,data!L17,data!L49,data!L81))","v":9.6000000000000002E-2},{"$f":"IF(ISBLANK(CHOOSE(mySelectedAgeGroup,data!M17,data!M49,data!M81)),\"\",CHOOSE(mySelectedAgeGroup,data!M17,data!M49,data!M81))","v":8.6999999999999994E-2},{"$f":"IF(ISBLANK(CHOOSE(mySelectedAgeGroup,data!N17,data!N49,data!N81)),\"\",CHOOSE(mySelectedAgeGroup,data!N17,data!N49,data!N81))","v":7.8E-2},{"$f":"IF(ISBLANK(CHOOSE(mySelectedAgeGroup,data!O17,data!O49,data!O81)),\"\",CHOOSE(mySelectedAgeGroup,data!O17,data!O49,data!O81))","v":0.08},{"$f":"IF(ISBLANK(CHOOSE(mySelectedAgeGroup,data!P17,data!P49,data!P81)),\"\",CHOOSE(mySelectedAgeGroup,data!P17,data!P49,data!P81))","v":8.5999999999999993E-2},{"$f":"IF(ISBLANK(CHOOSE(mySelectedAgeGroup,data!Q17,data!Q49,data!Q81)),\"\",CHOOSE(mySelectedAgeGroup,data!Q17,data!Q49,data!Q81))","v":9.6999999999999989E-2},{"$f":"IF(ISBLANK(CHOOSE(mySelectedAgeGroup,data!R17,data!R49,data!R81)),\"\",CHOOSE(mySelectedAgeGroup,data!R17,data!R49,data!R81))","v":0.105},{"$f":"IF(ISBLANK(CHOOSE(mySelectedAgeGroup,data!S17,data!S49,data!S81)),\"\",CHOOSE(mySelectedAgeGroup,data!S17,data!S49,data!S81))","v":0.106},{"$f":"IF(ISBLANK(CHOOSE(mySelectedAgeGroup,data!T17,data!T49,data!T81)),\"\",CHOOSE(mySelectedAgeGroup,data!T17,data!T49,data!T81))","v":9.8000000000000004E-2},{"$f":"IF(ISBLANK(CHOOSE(mySelectedAgeGroup,data!U17,data!U49,data!U81)),\"\",CHOOSE(mySelectedAgeGroup,data!U17,data!U49,data!U81))","v":8.199999999999999E-2},{"$f":"IF(ISBLANK(CHOOSE(mySelectedAgeGroup,data!V17,data!V49,data!V81)),\"\",CHOOSE(mySelectedAgeGroup,data!V17,data!V49,data!V81))","v":7.0999999999999994E-2},{"$f":"IF(ISBLANK(CHOOSE(mySelectedAgeGroup,data!W17,data!W49,data!W81)),\"\",CHOOSE(mySelectedAgeGroup,data!W17,data!W49,data!W81))","v":7.2999999999999995E-2},{"$f":"IF(ISBLANK(CHOOSE(mySelectedAgeGroup,data!X17,data!X49,data!X81)),\"\",CHOOSE(mySelectedAgeGroup,data!X17,data!X49,data!X81))","v":6.6000000000000003E-2},{"$f":"IF(ISBLANK(CHOOSE(mySelectedAgeGroup,data!Y17,data!Y49,data!Y81)),\"\",CHOOSE(mySelectedAgeGroup,data!Y17,data!Y49,data!Y81))","v":5.5E-2},{"$f":"IF(ISBLANK(CHOOSE(mySelectedAgeGroup,data!Z17,data!Z49,data!Z81)),\"\",CHOOSE(mySelectedAgeGroup,data!Z17,data!Z49,data!Z81))","v":5.0999999999999997E-2},{"$f":"IF(ISBLANK(CHOOSE(mySelectedAgeGroup,data!AA17,data!AA49,data!AA81)),\"\",CHOOSE(mySelectedAgeGroup,data!AA17,data!AA49,data!AA81))","v":4.9000000000000002E-2},{"$f":"IF(ISBLANK(CHOOSE(mySelectedAgeGroup,data!AB17,data!AB49,data!AB81)),\"\",CHOOSE(mySelectedAgeGroup,data!AB17,data!AB49,data!AB81))","v":4.7E-2},{"$f":"IF(ISBLANK(CHOOSE(mySelectedAgeGroup,data!AC17,data!AC49,data!AC81)),\"\",CHOOSE(mySelectedAgeGroup,data!AC17,data!AC49,data!AC81))","v":4.4000000000000004E-2},{"$f":"IF(ISBLANK(CHOOSE(mySelectedAgeGroup,data!AD17,data!AD49,data!AD81)),\"\",CHOOSE(mySelectedAgeGroup,data!AD17,data!AD49,data!AD81))","v":3.7999999999999999E-2},{"$f":"IF(ISBLANK(CHOOSE(mySelectedAgeGroup,data!AE17,data!AE49,data!AE81)),\"\",CHOOSE(mySelectedAgeGroup,data!AE17,data!AE49,data!AE81))","v":3.4000000000000002E-2},{"$f":"IF(ISBLANK(CHOOSE(mySelectedAgeGroup,data!AF17,data!AF49,data!AF81)),\"\",CHOOSE(mySelectedAgeGroup,data!AF17,data!AF49,data!AF81))","v":3.1E-2},{"$f":"IF(ISBLANK(CHOOSE(mySelectedAgeGroup,data!AG17,data!AG49,data!AG81)),\"\",CHOOSE(mySelectedAgeGroup,data!AG17,data!AG49,data!AG81))","v":2.8999999999999998E-2},{"$f":"IF(ISBLANK(CHOOSE(mySelectedAgeGroup,data!AH17,data!AH49,data!AH81)),\"\",CHOOSE(mySelectedAgeGroup,data!AH17,data!AH49,data!AH81))","v":3.5999999999999997E-2}]
[null,null,{"$f":"data!B18","v":"Greece"},{"$f":"IF(ISBLANK(CHOOSE(mySelectedAgeGroup,data!D18,data!D50,data!D82)),\"\",CHOOSE(mySelectedAgeGroup,data!D18,data!D50,data!D82))","v":""},{"$f":"IF(ISBLANK(CHOOSE(mySelectedAgeGroup,data!E18,data!E50,data!E82)),\"\",CHOOSE(mySelectedAgeGroup,data!E18,data!E50,data!E82))","v":""},{"$f":"IF(ISBLANK(CHOOSE(mySelectedAgeGroup,data!F18,data!F50,data!F82)),\"\",CHOOSE(mySelectedAgeGroup,data!F18,data!F50,data!F82))","v":""},{"$f":"IF(ISBLANK(CHOOSE(mySelectedAgeGroup,data!G18,data!G50,data!G82)),\"\",CHOOSE(mySelectedAgeGroup,data!G18,data!G50,data!G82))","v":""},{"$f":"IF(ISBLANK(CHOOSE(mySelectedAgeGroup,data!H18,data!H50,data!H82)),\"\",CHOOSE(mySelectedAgeGroup,data!H18,data!H50,data!H82))","v":""},{"$f":"IF(ISBLANK(CHOOSE(mySelectedAgeGroup,data!I18,data!I50,data!I82)),\"\",CHOOSE(mySelectedAgeGroup,data!I18,data!I50,data!I82))","v":6.7000000000000004E-2},{"$f":"IF(ISBLANK(CHOOSE(mySelectedAgeGroup,data!J18,data!J50,data!J82)),\"\",CHOOSE(mySelectedAgeGroup,data!J18,data!J50,data!J82))","v":6.9000000000000006E-2},{"$f":"IF(ISBLANK(CHOOSE(mySelectedAgeGroup,data!K18,data!K50,data!K82)),\"\",CHOOSE(mySelectedAgeGroup,data!K18,data!K50,data!K82))","v":7.2999999999999995E-2},{"$f":"IF(ISBLANK(CHOOSE(mySelectedAgeGroup,data!L18,data!L50,data!L82)),\"\",CHOOSE(mySelectedAgeGroup,data!L18,data!L50,data!L82))","v":8.3000000000000004E-2},{"$f":"IF(ISBLANK(CHOOSE(mySelectedAgeGroup,data!M18,data!M50,data!M82)),\"\",CHOOSE(mySelectedAgeGroup,data!M18,data!M50,data!M82))","v":9.3000000000000013E-2},{"$f":"IF(ISBLANK(CHOOSE(mySelectedAgeGroup,data!N18,data!N50,data!N82)),\"\",CHOOSE(mySelectedAgeGroup,data!N18,data!N50,data!N82))","v":8.900000000000001E-2},{"$f":"IF(ISBLANK(CHOOSE(mySelectedAgeGroup,data!O18,data!O50,data!O82)),\"\",CHOOSE(mySelectedAgeGroup,data!O18,data!O50,data!O82))","v":8.5999999999999993E-2},{"$f":"IF(ISBLANK(CHOOSE(mySelectedAgeGroup,data!P18,data!P50,data!P82)),\"\",CHOOSE(mySelectedAgeGroup,data!P18,data!P50,data!P82))","v":8.4000000000000005E-2},{"$f":"IF(ISBLANK(CHOOSE(mySelectedAgeGroup,data!Q18,data!Q50,data!Q82)),\"\",CHOOSE(mySelectedAgeGroup,data!Q18,data!Q50,data!Q82))","v":7.9000000000000001E-2},{"$f":"IF(ISBLANK(CHOOSE(mySelectedAgeGroup,data!R18,data!R50,data!R82)),\"\",CHOOSE(mySelectedAgeGroup,data!R18,data!R50,data!R82))","v":8.8000000000000009E-2},{"$f":"IF(ISBLANK(CHOOSE(mySelectedAgeGroup,data!S18,data!S50,data!S82)),\"\",CHOOSE(mySelectedAgeGroup,data!S18,data!S50,data!S82))","v":8.4000000000000005E-2},{"$f":"IF(ISBLANK(CHOOSE(mySelectedAgeGroup,data!T18,data!T50,data!T82)),\"\",CHOOSE(mySelectedAgeGroup,data!T18,data!T50,data!T82))","v":7.4999999999999997E-2},{"$f":"IF(ISBLANK(CHOOSE(mySelectedAgeGroup,data!U18,data!U50,data!U82)),\"\",CHOOSE(mySelectedAgeGroup,data!U18,data!U50,data!U82))","v":7.2000000000000008E-2},{"$f":"IF(ISBLANK(CHOOSE(mySelectedAgeGroup,data!V18,data!V50,data!V82)),\"\",CHOOSE(mySelectedAgeGroup,data!V18,data!V50,data!V82))","v":6.6000000000000003E-2},{"$f":"IF(ISBLANK(CHOOSE(mySelectedAgeGroup,data!W18,data!W50,data!W82)),\"\",CHOOSE(mySelectedAgeGroup,data!W18,data!W50,data!W82))","v":8.4000000000000005E-2},{"$f":"IF(ISBLANK(CHOOSE(mySelectedAgeGroup,data!X18,data!X50,data!X82)),\"\",CHOOSE(mySelectedAgeGroup,data!X18,data!X50,data!X82))","v":0.11199999999999999},{"$f":"IF(ISBLANK(CHOOSE(mySelectedAgeGroup,data!Y18,data!Y50,data!Y82)),\"\",CHOOSE(mySelectedAgeGroup,data!Y18,data!Y50,data!Y82))","v":0.159},{"$f":"IF(ISBLANK(CHOOSE(mySelectedAgeGroup,data!Z18,data!Z50,data!Z82)),\"\",CHOOSE(mySelectedAgeGroup,data!Z18,data!Z50,data!Z82))","v":0.223},{"$f":"IF(ISBLANK(CHOOSE(mySelectedAgeGroup,data!AA18,data!AA50,data!AA82)),\"\",CHOOSE(mySelectedAgeGroup,data!AA18,data!AA50,data!AA82))","v":0.254},{"$f":"IF(ISBLANK(CHOOSE(mySelectedAgeGroup,data!AB18,data!AB50,data!AB82)),\"\",CHOOSE(mySelectedAgeGroup,data!AB18,data!AB50,data!AB82))","v":0.248},{"$f":"IF(ISBLANK(CHOOSE(mySelectedAgeGroup,data!AC18,data!AC50,data!AC82)),\"\",CHOOSE(mySelectedAgeGroup,data!AC18,data!AC50,data!AC82))","v":0.23399999999999999},{"$f":"IF(ISBLANK(CHOOSE(mySelectedAgeGroup,data!AD18,data!AD50,data!AD82)),\"\",CHOOSE(mySelectedAgeGroup,data!AD18,data!AD50,data!AD82))","v":0.222},{"$f":"IF(ISBLANK(CHOOSE(mySelectedAgeGroup,data!AE18,data!AE50,data!AE82)),\"\",CHOOSE(mySelectedAgeGroup,data!AE18,data!AE50,data!AE82))","v":0.20199999999999999},{"$f":"IF(ISBLANK(CHOOSE(mySelectedAgeGroup,data!AF18,data!AF50,data!AF82)),\"\",CHOOSE(mySelectedAgeGroup,data!AF18,data!AF50,data!AF82))","v":0.182},{"$f":"IF(ISBLANK(CHOOSE(mySelectedAgeGroup,data!AG18,data!AG50,data!AG82)),\"\",CHOOSE(mySelectedAgeGroup,data!AG18,data!AG50,data!AG82))","v":0.16399999999999998},{"$f":"IF(ISBLANK(CHOOSE(mySelectedAgeGroup,data!AH18,data!AH50,data!AH82)),\"\",CHOOSE(mySelectedAgeGroup,data!AH18,data!AH50,data!AH82))","v":0.16}]
[null,null,{"$f":"data!B19","v":"Hungary"},{"$f":"IF(ISBLANK(CHOOSE(mySelectedAgeGroup,data!D19,data!D51,data!D83)),\"\",CHOOSE(mySelectedAgeGroup,data!D19,data!D51,data!D83))","v":""},{"$f":"IF(ISBLANK(CHOOSE(mySelectedAgeGroup,data!E19,data!E51,data!E83)),\"\",CHOOSE(mySelectedAgeGroup,data!E19,data!E51,data!E83))","v":""},{"$f":"IF(ISBLANK(CHOOSE(mySelectedAgeGroup,data!F19,data!F51,data!F83)),\"\",CHOOSE(mySelectedAgeGroup,data!F19,data!F51,data!F83))","v":""},{"$f":"IF(ISBLANK(CHOOSE(mySelectedAgeGroup,data!G19,data!G51,data!G83)),\"\",CHOOSE(mySelectedAgeGroup,data!G19,data!G51,data!G83))","v":""},{"$f":"IF(ISBLANK(CHOOSE(mySelectedAgeGroup,data!H19,data!H51,data!H83)),\"\",CHOOSE(mySelectedAgeGroup,data!H19,data!H51,data!H83))","v":""},{"$f":"IF(ISBLANK(CHOOSE(mySelectedAgeGroup,data!I19,data!I51,data!I83)),\"\",CHOOSE(mySelectedAgeGroup,data!I19,data!I51,data!I83))","v":""},{"$f":"IF(ISBLANK(CHOOSE(mySelectedAgeGroup,data!J19,data!J51,data!J83)),\"\",CHOOSE(mySelectedAgeGroup,data!J19,data!J51,data!J83))","v":""},{"$f":"IF(ISBLANK(CHOOSE(mySelectedAgeGroup,data!K19,data!K51,data!K83)),\"\",CHOOSE(mySelectedAgeGroup,data!K19,data!K51,data!K83))","v":7.6999999999999999E-2},{"$f":"IF(ISBLANK(CHOOSE(mySelectedAgeGroup,data!L19,data!L51,data!L83)),\"\",CHOOSE(mySelectedAgeGroup,data!L19,data!L51,data!L83))","v":7.2999999999999995E-2},{"$f":"IF(ISBLANK(CHOOSE(mySelectedAgeGroup,data!M19,data!M51,data!M83)),\"\",CHOOSE(mySelectedAgeGroup,data!M19,data!M51,data!M83))","v":0.06},{"$f":"IF(ISBLANK(CHOOSE(mySelectedAgeGroup,data!N19,data!N51,data!N83)),\"\",CHOOSE(mySelectedAgeGroup,data!N19,data!N51,data!N83))","v":5.4000000000000006E-2},{"$f":"IF(ISBLANK(CHOOSE(mySelectedAgeGroup,data!O19,data!O51,data!O83)),\"\",CHOOSE(mySelectedAgeGroup,data!O19,data!O51,data!O83))","v":0.05},{"$f":"IF(ISBLANK(CHOOSE(mySelectedAgeGroup,data!P19,data!P51,data!P83)),\"\",CHOOSE(mySelectedAgeGroup,data!P19,data!P51,data!P83))","v":0.05},{"$f":"IF(ISBLANK(CHOOSE(mySelectedAgeGroup,data!Q19,data!Q51,data!Q83)),\"\",CHOOSE(mySelectedAgeGroup,data!Q19,data!Q51,data!Q83))","v":0.05},{"$f":"IF(ISBLANK(CHOOSE(mySelectedAgeGroup,data!R19,data!R51,data!R83)),\"\",CHOOSE(mySelectedAgeGroup,data!R19,data!R51,data!R83))","v":5.2000000000000005E-2},{"$f":"IF(ISBLANK(CHOOSE(mySelectedAgeGroup,data!S19,data!S51,data!S83)),\"\",CHOOSE(mySelectedAgeGroup,data!S19,data!S51,data!S83))","v":6.0999999999999999E-2},{"$f":"IF(ISBLANK(CHOOSE(mySelectedAgeGroup,data!T19,data!T51,data!T83)),\"\",CHOOSE(mySelectedAgeGroup,data!T19,data!T51,data!T83))","v":6.5000000000000002E-2},{"$f":"IF(ISBLANK(CHOOSE(mySelectedAgeGroup,data!U19,data!U51,data!U83)),\"\",CHOOSE(mySelectedAgeGroup,data!U19,data!U51,data!U83))","v":6.5000000000000002E-2},{"$f":"IF(ISBLANK(CHOOSE(mySelectedAgeGroup,data!V19,data!V51,data!V83)),\"\",CHOOSE(mySelectedAgeGroup,data!V19,data!V51,data!V83))","v":6.9000000000000006E-2},{"$f":"IF(ISBLANK(CHOOSE(mySelectedAgeGroup,data!W19,data!W51,data!W83)),\"\",CHOOSE(mySelectedAgeGroup,data!W19,data!W51,data!W83))","v":8.8000000000000009E-2},{"$f":"IF(ISBLANK(CHOOSE(mySelectedAgeGroup,data!X19,data!X51,data!X83)),\"\",CHOOSE(mySelectedAgeGroup,data!X19,data!X51,data!X83))","v":0.1},{"$f":"IF(ISBLANK(CHOOSE(mySelectedAgeGroup,data!Y19,data!Y51,data!Y83)),\"\",CHOOSE(mySelectedAgeGroup,data!Y19,data!Y51,data!Y83))","v":9.9000000000000005E-2},{"$f":"IF(ISBLANK(CHOOSE(mySelectedAgeGroup,data!Z19,data!Z51,data!Z83)),\"\",CHOOSE(mySelectedAgeGroup,data!Z19,data!Z51,data!Z83))","v":9.6999999999999989E-2},{"$f":"IF(ISBLANK(CHOOSE(mySelectedAgeGroup,data!AA19,data!AA51,data!AA83)),\"\",CHOOSE(mySelectedAgeGroup,data!AA19,data!AA51,data!AA83))","v":8.900000000000001E-2},{"$f":"IF(ISBLANK(CHOOSE(mySelectedAgeGroup,data!AB19,data!AB51,data!AB83)),\"\",CHOOSE(mySelectedAgeGroup,data!AB19,data!AB51,data!AB83))","v":6.7000000000000004E-2},{"$f":"IF(ISBLANK(CHOOSE(mySelectedAgeGroup,data!AC19,data!AC51,data!AC83)),\"\",CHOOSE(mySelectedAgeGroup,data!AC19,data!AC51,data!AC83))","v":0.06},{"$f":"IF(ISBLANK(CHOOSE(mySelectedAgeGroup,data!AD19,data!AD51,data!AD83)),\"\",CHOOSE(mySelectedAgeGroup,data!AD19,data!AD51,data!AD83))","v":4.4999999999999998E-2},{"$f":"IF(ISBLANK(CHOOSE(mySelectedAgeGroup,data!AE19,data!AE51,data!AE83)),\"\",CHOOSE(mySelectedAgeGroup,data!AE19,data!AE51,data!AE83))","v":3.6000000000000004E-2},{"$f":"IF(ISBLANK(CHOOSE(mySelectedAgeGroup,data!AF19,data!AF51,data!AF83)),\"\",CHOOSE(mySelectedAgeGroup,data!AF19,data!AF51,data!AF83))","v":3.2000000000000001E-2},{"$f":"IF(ISBLANK(CHOOSE(mySelectedAgeGroup,data!AG19,data!AG51,data!AG83)),\"\",CHOOSE(mySelectedAgeGroup,data!AG19,data!AG51,data!AG83))","v":2.7999999999999997E-2},{"$f":"IF(ISBLANK(CHOOSE(mySelectedAgeGroup,data!AH19,data!AH51,data!AH83)),\"\",CHOOSE(mySelectedAgeGroup,data!AH19,data!AH51,data!AH83))","v":3.2000000000000001E-2}]
[null,null,{"$f":"data!B20","v":"Ireland"},{"$f":"IF(ISBLANK(CHOOSE(mySelectedAgeGroup,data!D20,data!D52,data!D84)),\"\",CHOOSE(mySelectedAgeGroup,data!D20,data!D52,data!D84))","v":0.11699999999999999},{"$f":"IF(ISBLANK(CHOOSE(mySelectedAgeGroup,data!E20,data!E52,data!E84)),\"\",CHOOSE(mySelectedAgeGroup,data!E20,data!E52,data!E84))","v":0.126},{"$f":"IF(ISBLANK(CHOOSE(mySelectedAgeGroup,data!F20,data!F52,data!F84)),\"\",CHOOSE(mySelectedAgeGroup,data!F20,data!F52,data!F84))","v":0.13},{"$f":"IF(ISBLANK(CHOOSE(mySelectedAgeGroup,data!G20,data!G52,data!G84)),\"\",CHOOSE(mySelectedAgeGroup,data!G20,data!G52,data!G84))","v":0.13100000000000001},{"$f":"IF(ISBLANK(CHOOSE(mySelectedAgeGroup,data!H20,data!H52,data!H84)),\"\",CHOOSE(mySelectedAgeGroup,data!H20,data!H52,data!H84))","v":0.122},{"$f":"IF(ISBLANK(CHOOSE(mySelectedAgeGroup,data!I20,data!I52,data!I84)),\"\",CHOOSE(mySelectedAgeGroup,data!I20,data!I52,data!I84))","v":0.10400000000000001},{"$f":"IF(ISBLANK(CHOOSE(mySelectedAgeGroup,data!J20,data!J52,data!J84)),\"\",CHOOSE(mySelectedAgeGroup,data!J20,data!J52,data!J84))","v":0.1},{"$f":"IF(ISBLANK(CHOOSE(mySelectedAgeGroup,data!K20,data!K52,data!K84)),\"\",CHOOSE(mySelectedAgeGroup,data!K20,data!K52,data!K84))","v":8.5999999999999993E-2},{"$f":"IF(ISBLANK(CHOOSE(mySelectedAgeGroup,data!L20,data!L52,data!L84)),\"\",CHOOSE(mySelectedAgeGroup,data!L20,data!L52,data!L84))","v":6.7000000000000004E-2},{"$f":"IF(ISBLANK(CHOOSE(mySelectedAgeGroup,data!M20,data!M52,data!M84)),\"\",CHOOSE(mySelectedAgeGroup,data!M20,data!M52,data!M84))","v":0.05},{"$f":"IF(ISBLANK(CHOOSE(mySelectedAgeGroup,data!N20,data!N52,data!N84)),\"\",CHOOSE(mySelectedAgeGroup,data!N20,data!N52,data!N84))","v":3.7999999999999999E-2},{"$f":"IF(ISBLANK(CHOOSE(mySelectedAgeGroup,data!O20,data!O52,data!O84)),\"\",CHOOSE(mySelectedAgeGroup,data!O20,data!O52,data!O84))","v":3.3000000000000002E-2},{"$f":"IF(ISBLANK(CHOOSE(mySelectedAgeGroup,data!P20,data!P52,data!P84)),\"\",CHOOSE(mySelectedAgeGroup,data!P20,data!P52,data!P84))","v":3.7000000000000005E-2},{"$f":"IF(ISBLANK(CHOOSE(mySelectedAgeGroup,data!Q20,data!Q52,data!Q84)),\"\",CHOOSE(mySelectedAgeGroup,data!Q20,data!Q52,data!Q84))","v":3.7999999999999999E-2},{"$f":"IF(ISBLANK(CHOOSE(mySelectedAgeGroup,data!R20,data!R52,data!R84)),\"\",CHOOSE(mySelectedAgeGroup,data!R20,data!R52,data!R84))","v":3.7000000000000005E-2},{"$f":"IF(ISBLANK(CHOOSE(mySelectedAgeGroup,data!S20,data!S52,data!S84)),\"\",CHOOSE(mySelectedAgeGroup,data!S20,data!S52,data!S84))","v":3.7000000000000005E-2},{"$f":"IF(ISBLANK(CHOOSE(mySelectedAgeGroup,data!T20,data!T52,data!T84)),\"\",CHOOSE(mySelectedAgeGroup,data!T20,data!T52,data!T84))","v":3.7999999999999999E-2},{"$f":"IF(ISBLANK(CHOOSE(mySelectedAgeGroup,data!U20,data!U52,data!U84)),\"\",CHOOSE(mySelectedAgeGroup,data!U20,data!U52,data!U84))","v":0.04},{"$f":"IF(ISBLANK(CHOOSE(mySelectedAgeGroup,data!V20,data!V52,data!V84)),\"\",CHOOSE(mySelectedAgeGroup,data!V20,data!V52,data!V84))","v":5.2999999999999999E-2},{"$f":"IF(ISBLANK(CHOOSE(mySelectedAgeGroup,data!W20,data!W52,data!W84)),\"\",CHOOSE(mySelectedAgeGroup,data!W20,data!W52,data!W84))","v":0.10300000000000001},{"$f":"IF(ISBLANK(CHOOSE(mySelectedAgeGroup,data!X20,data!X52,data!X84)),\"\",CHOOSE(mySelectedAgeGroup,data!X20,data!X52,data!X84))","v":0.12300000000000001},{"$f":"IF(ISBLANK(CHOOSE(mySelectedAgeGroup,data!Y20,data!Y52,data!Y84)),\"\",CHOOSE(mySelectedAgeGroup,data!Y20,data!Y52,data!Y84))","v":0.13200000000000001},{"$f":"IF(ISBLANK(CHOOSE(mySelectedAgeGroup,data!Z20,data!Z52,data!Z84)),\"\",CHOOSE(mySelectedAgeGroup,data!Z20,data!Z52,data!Z84))","v":0.13200000000000001},{"$f":"IF(ISBLANK(CHOOSE(mySelectedAgeGroup,data!AA20,data!AA52,data!AA84)),\"\",CHOOSE(mySelectedAgeGroup,data!AA20,data!AA52,data!AA84))","v":0.11900000000000001},{"$f":"IF(ISBLANK(CHOOSE(mySelectedAgeGroup,data!AB20,data!AB52,data!AB84)),\"\",CHOOSE(mySelectedAgeGroup,data!AB20,data!AB52,data!AB84))","v":0.10300000000000001},{"$f":"IF(ISBLANK(CHOOSE(mySelectedAgeGroup,data!AC20,data!AC52,data!AC84)),\"\",CHOOSE(mySelectedAgeGroup,data!AC20,data!AC52,data!AC84))","v":8.5999999999999993E-2},{"$f":"IF(ISBLANK(CHOOSE(mySelectedAgeGroup,data!AD20,data!AD52,data!AD84)),\"\",CHOOSE(mySelectedAgeGroup,data!AD20,data!AD52,data!AD84))","v":7.2000000000000008E-2},{"$f":"IF(ISBLANK(CHOOSE(mySelectedAgeGroup,data!AE20,data!AE52,data!AE84)),\"\",CHOOSE(mySelectedAgeGroup,data!AE20,data!AE52,data!AE84))","v":5.7000000000000002E-2},{"$f":"IF(ISBLANK(CHOOSE(mySelectedAgeGroup,data!AF20,data!AF52,data!AF84)),\"\",CHOOSE(mySelectedAgeGroup,data!AF20,data!AF52,data!AF84))","v":4.7E-2},{"$f":"IF(ISBLANK(CHOOSE(mySelectedAgeGroup,data!AG20,data!AG52,data!AG84)),\"\",CHOOSE(mySelectedAgeGroup,data!AG20,data!AG52,data!AG84))","v":0.04},{"$f":"IF(ISBLANK(CHOOSE(mySelectedAgeGroup,data!AH20,data!AH52,data!AH84)),\"\",CHOOSE(mySelectedAgeGroup,data!AH20,data!AH52,data!AH84))","v":4.1000000000000002E-2}]
[null,null,{"$f":"data!B21","v":"Italy"},{"$f":"IF(ISBLANK(CHOOSE(mySelectedAgeGroup,data!D21,data!D53,data!D85)),\"\",CHOOSE(mySelectedAgeGroup,data!D21,data!D53,data!D85))","v":""},{"$f":"IF(ISBLANK(CHOOSE(mySelectedAgeGroup,data!E21,data!E53,data!E85)),\"\",CHOOSE(mySelectedAgeGroup,data!E21,data!E53,data!E85))","v":""},{"$f":"IF(ISBLANK(CHOOSE(mySelectedAgeGroup,data!F21,data!F53,data!F85)),\"\",CHOOSE(mySelectedAgeGroup,data!F21,data!F53,data!F85))","v":5.5E-2},{"$f":"IF(ISBLANK(CHOOSE(mySelectedAgeGroup,data!G21,data!G53,data!G85)),\"\",CHOOSE(mySelectedAgeGroup,data!G21,data!G53,data!G85))","v":6.6000000000000003E-2},{"$f":"IF(ISBLANK(CHOOSE(mySelectedAgeGroup,data!H21,data!H53,data!H85)),\"\",CHOOSE(mySelectedAgeGroup,data!H21,data!H53,data!H85))","v":7.4999999999999997E-2},{"$f":"IF(ISBLANK(CHOOSE(mySelectedAgeGroup,data!I21,data!I53,data!I85)),\"\",CHOOSE(mySelectedAgeGroup,data!I21,data!I53,data!I85))","v":0.08},{"$f":"IF(ISBLANK(CHOOSE(mySelectedAgeGroup,data!J21,data!J53,data!J85)),\"\",CHOOSE(mySelectedAgeGroup,data!J21,data!J53,data!J85))","v":8.3000000000000004E-2},{"$f":"IF(ISBLANK(CHOOSE(mySelectedAgeGroup,data!K21,data!K53,data!K85)),\"\",CHOOSE(mySelectedAgeGroup,data!K21,data!K53,data!K85))","v":8.5999999999999993E-2},{"$f":"IF(ISBLANK(CHOOSE(mySelectedAgeGroup,data!L21,data!L53,data!L85)),\"\",CHOOSE(mySelectedAgeGroup,data!L21,data!L53,data!L85))","v":8.8000000000000009E-2},{"$f":"IF(ISBLANK(CHOOSE(mySelectedAgeGroup,data!M21,data!M53,data!M85)),\"\",CHOOSE(mySelectedAgeGroup,data!M21,data!M53,data!M85))","v":8.6999999999999994E-2},{"$f":"IF(ISBLANK(CHOOSE(mySelectedAgeGroup,data!N21,data!N53,data!N85)),\"\",CHOOSE(mySelectedAgeGroup,data!N21,data!N53,data!N85))","v":8.1000000000000003E-2},{"$f":"IF(ISBLANK(CHOOSE(mySelectedAgeGroup,data!O21,data!O53,data!O85)),\"\",CHOOSE(mySelectedAgeGroup,data!O21,data!O53,data!O85))","v":7.4999999999999997E-2},{"$f":"IF(ISBLANK(CHOOSE(mySelectedAgeGroup,data!P21,data!P53,data!P85)),\"\",CHOOSE(mySelectedAgeGroup,data!P21,data!P53,data!P85))","v":7.0999999999999994E-2},{"$f":"IF(ISBLANK(CHOOSE(mySelectedAgeGroup,data!Q21,data!Q53,data!Q85)),\"\",CHOOSE(mySelectedAgeGroup,data!Q21,data!Q53,data!Q85))","v":6.8000000000000005E-2},{"$f":"IF(ISBLANK(CHOOSE(mySelectedAgeGroup,data!R21,data!R53,data!R85)),\"\",CHOOSE(mySelectedAgeGroup,data!R21,data!R53,data!R85))","v":6.5000000000000002E-2},{"$f":"IF(ISBLANK(CHOOSE(mySelectedAgeGroup,data!S21,data!S53,data!S85)),\"\",CHOOSE(mySelectedAgeGroup,data!S21,data!S53,data!S85))","v":6.3E-2},{"$f":"IF(ISBLANK(CHOOSE(mySelectedAgeGroup,data!T21,data!T53,data!T85)),\"\",CHOOSE(mySelectedAgeGroup,data!T21,data!T53,data!T85))","v":5.5E-2},{"$f":"IF(ISBLANK(CHOOSE(mySelectedAgeGroup,data!U21,data!U53,data!U85)),\"\",CHOOSE(mySelectedAgeGroup,data!U21,data!U53,data!U85))","v":4.9000000000000002E-2},{"$f":"IF(ISBLANK(CHOOSE(mySelectedAgeGroup,data!V21,data!V53,data!V85)),\"\",CHOOSE(mySelectedAgeGroup,data!V21,data!V53,data!V85))","v":5.5999999999999994E-2},{"$f":"IF(ISBLANK(CHOOSE(mySelectedAgeGroup,data!W21,data!W53,data!W85)),\"\",CHOOSE(mySelectedAgeGroup,data!W21,data!W53,data!W85))","v":6.4000000000000001E-2},{"$f":"IF(ISBLANK(CHOOSE(mySelectedAgeGroup,data!X21,data!X53,data!X85)),\"\",CHOOSE(mySelectedAgeGroup,data!X21,data!X53,data!X85))","v":6.9000000000000006E-2},{"$f":"IF(ISBLANK(CHOOSE(mySelectedAgeGroup,data!Y21,data!Y53,data!Y85)),\"\",CHOOSE(mySelectedAgeGroup,data!Y21,data!Y53,data!Y85))","v":6.9000000000000006E-2},{"$f":"IF(ISBLANK(CHOOSE(mySelectedAgeGroup,data!Z21,data!Z53,data!Z85)),\"\",CHOOSE(mySelectedAgeGroup,data!Z21,data!Z53,data!Z85))","v":8.900000000000001E-2},{"$f":"IF(ISBLANK(CHOOSE(mySelectedAgeGroup,data!AA21,data!AA53,data!AA85)),\"\",CHOOSE(mySelectedAgeGroup,data!AA21,data!AA53,data!AA85))","v":0.10300000000000001},{"$f":"IF(ISBLANK(CHOOSE(mySelectedAgeGroup,data!AB21,data!AB53,data!AB85)),\"\",CHOOSE(mySelectedAgeGroup,data!AB21,data!AB53,data!AB85))","v":0.107},{"$f":"IF(ISBLANK(CHOOSE(mySelectedAgeGroup,data!AC21,data!AC53,data!AC85)),\"\",CHOOSE(mySelectedAgeGroup,data!AC21,data!AC53,data!AC85))","v":0.10099999999999999},{"$f":"IF(ISBLANK(CHOOSE(mySelectedAgeGroup,data!AD21,data!AD53,data!AD85)),\"\",CHOOSE(mySelectedAgeGroup,data!AD21,data!AD53,data!AD85))","v":0.1},{"$f":"IF(ISBLANK(CHOOSE(mySelectedAgeGroup,data!AE21,data!AE53,data!AE85)),\"\",CHOOSE(mySelectedAgeGroup,data!AE21,data!AE53,data!AE85))","v":9.8000000000000004E-2},{"$f":"IF(ISBLANK(CHOOSE(mySelectedAgeGroup,data!AF21,data!AF53,data!AF85)),\"\",CHOOSE(mySelectedAgeGroup,data!AF21,data!AF53,data!AF85))","v":9.3000000000000013E-2},{"$f":"IF(ISBLANK(CHOOSE(mySelectedAgeGroup,data!AG21,data!AG53,data!AG85)),\"\",CHOOSE(mySelectedAgeGroup,data!AG21,data!AG53,data!AG85))","v":8.8000000000000009E-2},{"$f":"IF(ISBLANK(CHOOSE(mySelectedAgeGroup,data!AH21,data!AH53,data!AH85)),\"\",CHOOSE(mySelectedAgeGroup,data!AH21,data!AH53,data!AH85))","v":8.6999999999999994E-2}]
[null,null,{"$f":"data!B22","v":"Latvia"},{"$f":"IF(ISBLANK(CHOOSE(mySelectedAgeGroup,data!D22,data!D54,data!D86)),\"\",CHOOSE(mySelectedAgeGroup,data!D22,data!D54,data!D86))","v":""},{"$f":"IF(ISBLANK(CHOOSE(mySelectedAgeGroup,data!E22,data!E54,data!E86)),\"\",CHOOSE(mySelectedAgeGroup,data!E22,data!E54,data!E86))","v":""},{"$f":"IF(ISBLANK(CHOOSE(mySelectedAgeGroup,data!F22,data!F54,data!F86)),\"\",CHOOSE(mySelectedAgeGroup,data!F22,data!F54,data!F86))","v":""},{"$f":"IF(ISBLANK(CHOOSE(mySelectedAgeGroup,data!G22,data!G54,data!G86)),\"\",CHOOSE(mySelectedAgeGroup,data!G22,data!G54,data!G86))","v":""},{"$f":"IF(ISBLANK(CHOOSE(mySelectedAgeGroup,data!H22,data!H54,data!H86)),\"\",CHOOSE(mySelectedAgeGroup,data!H22,data!H54,data!H86))","v":""},{"$f":"IF(ISBLANK(CHOOSE(mySelectedAgeGroup,data!I22,data!I54,data!I86)),\"\",CHOOSE(mySelectedAgeGroup,data!I22,data!I54,data!I86))","v":""},{"$f":"IF(ISBLANK(CHOOSE(mySelectedAgeGroup,data!J22,data!J54,data!J86)),\"\",CHOOSE(mySelectedAgeGroup,data!J22,data!J54,data!J86))","v":""},{"$f":"IF(ISBLANK(CHOOSE(mySelectedAgeGroup,data!K22,data!K54,data!K86)),\"\",CHOOSE(mySelectedAgeGroup,data!K22,data!K54,data!K86))","v":0.124},{"$f":"IF(ISBLANK(CHOOSE(mySelectedAgeGroup,data!L22,data!L54,data!L86)),\"\",CHOOSE(mySelectedAgeGroup,data!L22,data!L54,data!L86))","v":0.12300000000000001},{"$f":"IF(ISBLANK(CHOOSE(mySelectedAgeGroup,data!M22,data!M54,data!M86)),\"\",CHOOSE(mySelectedAgeGroup,data!M22,data!M54,data!M86))","v":0.125},{"$f":"IF(ISBLANK(CHOOSE(mySelectedAgeGroup,data!N22,data!N54,data!N86)),\"\",CHOOSE(mySelectedAgeGroup,data!N22,data!N54,data!N86))","v":0.13200000000000001},{"$f":"IF(ISBLANK(CHOOSE(mySelectedAgeGroup,data!O22,data!O54,data!O86)),\"\",CHOOSE(mySelectedAgeGroup,data!O22,data!O54,data!O86))","v":0.125},{"$f":"IF(ISBLANK(CHOOSE(mySelectedAgeGroup,data!P22,data!P54,data!P86)),\"\",CHOOSE(mySelectedAgeGroup,data!P22,data!P54,data!P86))","v":0.114},{"$f":"IF(ISBLANK(CHOOSE(mySelectedAgeGroup,data!Q22,data!Q54,data!Q86)),\"\",CHOOSE(mySelectedAgeGroup,data!Q22,data!Q54,data!Q86))","v":0.106},{"$f":"IF(ISBLANK(CHOOSE(mySelectedAgeGroup,data!R22,data!R54,data!R86)),\"\",CHOOSE(mySelectedAgeGroup,data!R22,data!R54,data!R86))","v":0.106},{"$f":"IF(ISBLANK(CHOOSE(mySelectedAgeGroup,data!S22,data!S54,data!S86)),\"\",CHOOSE(mySelectedAgeGroup,data!S22,data!S54,data!S86))","v":9.3000000000000013E-2},{"$f":"IF(ISBLANK(CHOOSE(mySelectedAgeGroup,data!T22,data!T54,data!T86)),\"\",CHOOSE(mySelectedAgeGroup,data!T22,data!T54,data!T86))","v":6.0999999999999999E-2},{"$f":"IF(ISBLANK(CHOOSE(mySelectedAgeGroup,data!U22,data!U54,data!U86)),\"\",CHOOSE(mySelectedAgeGroup,data!U22,data!U54,data!U86))","v":5.4000000000000006E-2},{"$f":"IF(ISBLANK(CHOOSE(mySelectedAgeGroup,data!V22,data!V54,data!V86)),\"\",CHOOSE(mySelectedAgeGroup,data!V22,data!V54,data!V86))","v":6.9000000000000006E-2},{"$f":"IF(ISBLANK(CHOOSE(mySelectedAgeGroup,data!W22,data!W54,data!W86)),\"\",CHOOSE(mySelectedAgeGroup,data!W22,data!W54,data!W86))","v":0.154},{"$f":"IF(ISBLANK(CHOOSE(mySelectedAgeGroup,data!X22,data!X54,data!X86)),\"\",CHOOSE(mySelectedAgeGroup,data!X22,data!X54,data!X86))","v":0.17399999999999999},{"$f":"IF(ISBLANK(CHOOSE(mySelectedAgeGroup,data!Y22,data!Y54,data!Y86)),\"\",CHOOSE(mySelectedAgeGroup,data!Y22,data!Y54,data!Y86))","v":0.14599999999999999},{"$f":"IF(ISBLANK(CHOOSE(mySelectedAgeGroup,data!Z22,data!Z54,data!Z86)),\"\",CHOOSE(mySelectedAgeGroup,data!Z22,data!Z54,data!Z86))","v":0.13600000000000001},{"$f":"IF(ISBLANK(CHOOSE(mySelectedAgeGroup,data!AA22,data!AA54,data!AA86)),\"\",CHOOSE(mySelectedAgeGroup,data!AA22,data!AA54,data!AA86))","v":0.107},{"$f":"IF(ISBLANK(CHOOSE(mySelectedAgeGroup,data!AB22,data!AB54,data!AB86)),\"\",CHOOSE(mySelectedAgeGroup,data!AB22,data!AB54,data!AB86))","v":0.1},{"$f":"IF(ISBLANK(CHOOSE(mySelectedAgeGroup,data!AC22,data!AC54,data!AC86)),\"\",CHOOSE(mySelectedAgeGroup,data!AC22,data!AC54,data!AC86))","v":9.3000000000000013E-2},{"$f":"IF(ISBLANK(CHOOSE(mySelectedAgeGroup,data!AD22,data!AD54,data!AD86)),\"\",CHOOSE(mySelectedAgeGroup,data!AD22,data!AD54,data!AD86))","v":0.09},{"$f":"IF(ISBLANK(CHOOSE(mySelectedAgeGroup,data!AE22,data!AE54,data!AE86)),\"\",CHOOSE(mySelectedAgeGroup,data!AE22,data!AE54,data!AE86))","v":8.1000000000000003E-2},{"$f":"IF(ISBLANK(CHOOSE(mySelectedAgeGroup,data!AF22,data!AF54,data!AF86)),\"\",CHOOSE(mySelectedAgeGroup,data!AF22,data!AF54,data!AF86))","v":7.0999999999999994E-2},{"$f":"IF(ISBLANK(CHOOSE(mySelectedAgeGroup,data!AG22,data!AG54,data!AG86)),\"\",CHOOSE(mySelectedAgeGroup,data!AG22,data!AG54,data!AG86))","v":5.9000000000000004E-2},{"$f":"IF(ISBLANK(CHOOSE(mySelectedAgeGroup,data!AH22,data!AH54,data!AH86)),\"\",CHOOSE(mySelectedAgeGroup,data!AH22,data!AH54,data!AH86))","v":7.0000000000000007E-2}]
[null,null,{"$f":"data!B23","v":"Lithuania"},{"$f":"IF(ISBLANK(CHOOSE(mySelectedAgeGroup,data!D23,data!D55,data!D87)),\"\",CHOOSE(mySelectedAgeGroup,data!D23,data!D55,data!D87))","v":""},{"$f":"IF(ISBLANK(CHOOSE(mySelectedAgeGroup,data!E23,data!E55,data!E87)),\"\",CHOOSE(mySelectedAgeGroup,data!E23,data!E55,data!E87))","v":""},{"$f":"IF(ISBLANK(CHOOSE(mySelectedAgeGroup,data!F23,data!F55,data!F87)),\"\",CHOOSE(mySelectedAgeGroup,data!F23,data!F55,data!F87))","v":""},{"$f":"IF(ISBLANK(CHOOSE(mySelectedAgeGroup,data!G23,data!G55,data!G87)),\"\",CHOOSE(mySelectedAgeGroup,data!G23,data!G55,data!G87))","v":""},{"$f":"IF(ISBLANK(CHOOSE(mySelectedAgeGroup,data!H23,data!H55,data!H87)),\"\",CHOOSE(mySelectedAgeGroup,data!H23,data!H55,data!H87))","v":""},{"$f":"IF(ISBLANK(CHOOSE(mySelectedAgeGroup,data!I23,data!I55,data!I87)),\"\",CHOOSE(mySelectedAgeGroup,data!I23,data!I55,data!I87))","v":""},{"$f":"IF(ISBLANK(CHOOSE(mySelectedAgeGroup,data!J23,data!J55,data!J87)),\"\",CHOOSE(mySelectedAgeGroup,data!J23,data!J55,data!J87))","v":""},{"$f":"IF(ISBLANK(CHOOSE(mySelectedAgeGroup,data!K23,data!K55,data!K87)),\"\",CHOOSE(mySelectedAgeGroup,data!K23,data!K55,data!K87))","v":0.113},{"$f":"IF(ISBLANK(CHOOSE(mySelectedAgeGroup,data!L23,data!L55,data!L87)),\"\",CHOOSE(mySelectedAgeGroup,data!L23,data!L55,data!L87))","v":0.11900000000000001},{"$f":"IF(ISBLANK(CHOOSE(mySelectedAgeGroup,data!M23,data!M55,data!M87)),\"\",CHOOSE(mySelectedAgeGroup,data!M23,data!M55,data!M87))","v":0.127},{"$f":"IF(ISBLANK(CHOOSE(mySelectedAgeGroup,data!N23,data!N55,data!N87)),\"\",CHOOSE(mySelectedAgeGroup,data!N23,data!N55,data!N87))","v":0.14800000000000002},{"$f":"IF(ISBLANK(CHOOSE(mySelectedAgeGroup,data!O23,data!O55,data!O87)),\"\",CHOOSE(mySelectedAgeGroup,data!O23,data!O55,data!O87))","v":0.157},{"$f":"IF(ISBLANK(CHOOSE(mySelectedAgeGroup,data!P23,data!P55,data!P87)),\"\",CHOOSE(mySelectedAgeGroup,data!P23,data!P55,data!P87))","v":0.128},{"$f":"IF(ISBLANK(CHOOSE(mySelectedAgeGroup,data!Q23,data!Q55,data!Q87)),\"\",CHOOSE(mySelectedAgeGroup,data!Q23,data!Q55,data!Q87))","v":0.111},{"$f":"IF(ISBLANK(CHOOSE(mySelectedAgeGroup,data!R23,data!R55,data!R87)),\"\",CHOOSE(mySelectedAgeGroup,data!R23,data!R55,data!R87))","v":9.9000000000000005E-2},{"$f":"IF(ISBLANK(CHOOSE(mySelectedAgeGroup,data!S23,data!S55,data!S87)),\"\",CHOOSE(mySelectedAgeGroup,data!S23,data!S55,data!S87))","v":7.6999999999999999E-2},{"$f":"IF(ISBLANK(CHOOSE(mySelectedAgeGroup,data!T23,data!T55,data!T87)),\"\",CHOOSE(mySelectedAgeGroup,data!T23,data!T55,data!T87))","v":5.4000000000000006E-2},{"$f":"IF(ISBLANK(CHOOSE(mySelectedAgeGroup,data!U23,data!U55,data!U87)),\"\",CHOOSE(mySelectedAgeGroup,data!U23,data!U55,data!U87))","v":3.9E-2},{"$f":"IF(ISBLANK(CHOOSE(mySelectedAgeGroup,data!V23,data!V55,data!V87)),\"\",CHOOSE(mySelectedAgeGroup,data!V23,data!V55,data!V87))","v":0.05},{"$f":"IF(ISBLANK(CHOOSE(mySelectedAgeGroup,data!W23,data!W55,data!W87)),\"\",CHOOSE(mySelectedAgeGroup,data!W23,data!W55,data!W87))","v":0.122},{"$f":"IF(ISBLANK(CHOOSE(mySelectedAgeGroup,data!X23,data!X55,data!X87)),\"\",CHOOSE(mySelectedAgeGroup,data!X23,data!X55,data!X87))","v":0.161},{"$f":"IF(ISBLANK(CHOOSE(mySelectedAgeGroup,data!Y23,data!Y55,data!Y87)),\"\",CHOOSE(mySelectedAgeGroup,data!Y23,data!Y55,data!Y87))","v":0.13900000000000001},{"$f":"IF(ISBLANK(CHOOSE(mySelectedAgeGroup,data!Z23,data!Z55,data!Z87)),\"\",CHOOSE(mySelectedAgeGroup,data!Z23,data!Z55,data!Z87))","v":0.122},{"$f":"IF(ISBLANK(CHOOSE(mySelectedAgeGroup,data!AA23,data!AA55,data!AA87)),\"\",CHOOSE(mySelectedAgeGroup,data!AA23,data!AA55,data!AA87))","v":0.109},{"$f":"IF(ISBLANK(CHOOSE(mySelectedAgeGroup,data!AB23,data!AB55,data!AB87)),\"\",CHOOSE(mySelectedAgeGroup,data!AB23,data!AB55,data!AB87))","v":9.9000000000000005E-2},{"$f":"IF(ISBLANK(CHOOSE(mySelectedAgeGroup,data!AC23,data!AC55,data!AC87)),\"\",CHOOSE(mySelectedAgeGroup,data!AC23,data!AC55,data!AC87))","v":8.5000000000000006E-2},{"$f":"IF(ISBLANK(CHOOSE(mySelectedAgeGroup,data!AD23,data!AD55,data!AD87)),\"\",CHOOSE(mySelectedAgeGroup,data!AD23,data!AD55,data!AD87))","v":7.2999999999999995E-2},{"$f":"IF(ISBLANK(CHOOSE(mySelectedAgeGroup,data!AE23,data!AE55,data!AE87)),\"\",CHOOSE(mySelectedAgeGroup,data!AE23,data!AE55,data!AE87))","v":6.6000000000000003E-2},{"$f":"IF(ISBLANK(CHOOSE(mySelectedAgeGroup,data!AF23,data!AF55,data!AF87)),\"\",CHOOSE(mySelectedAgeGroup,data!AF23,data!AF55,data!AF87))","v":5.7999999999999996E-2},{"$f":"IF(ISBLANK(CHOOSE(mySelectedAgeGroup,data!AG23,data!AG55,data!AG87)),\"\",CHOOSE(mySelectedAgeGroup,data!AG23,data!AG55,data!AG87))","v":5.7999999999999996E-2},{"$f":"IF(ISBLANK(CHOOSE(mySelectedAgeGroup,data!AH23,data!AH55,data!AH87)),\"\",CHOOSE(mySelectedAgeGroup,data!AH23,data!AH55,data!AH87))","v":7.0000000000000007E-2}]
[null,null,{"$f":"data!B24","v":"Luxembourg"},{"$f":"IF(ISBLANK(CHOOSE(mySelectedAgeGroup,data!D24,data!D56,data!D88)),\"\",CHOOSE(mySelectedAgeGroup,data!D24,data!D56,data!D88))","v":1.3000000000000001E-2},{"$f":"IF(ISBLANK(CHOOSE(mySelectedAgeGroup,data!E24,data!E56,data!E88)),\"\",CHOOSE(mySelectedAgeGroup,data!E24,data!E56,data!E88))","v":1.3999999999999999E-2},{"$f":"IF(ISBLANK(CHOOSE(mySelectedAgeGroup,data!F24,data!F56,data!F88)),\"\",CHOOSE(mySelectedAgeGroup,data!F24,data!F56,data!F88))","v":1.8000000000000002E-2},{"$f":"IF(ISBLANK(CHOOSE(mySelectedAgeGroup,data!G24,data!G56,data!G88)),\"\",CHOOSE(mySelectedAgeGroup,data!G24,data!G56,data!G88))","v":2.2000000000000002E-2},{"$f":"IF(ISBLANK(CHOOSE(mySelectedAgeGroup,data!H24,data!H56,data!H88)),\"\",CHOOSE(mySelectedAgeGroup,data!H24,data!H56,data!H88))","v":2.6000000000000002E-2},{"$f":"IF(ISBLANK(CHOOSE(mySelectedAgeGroup,data!I24,data!I56,data!I88)),\"\",CHOOSE(mySelectedAgeGroup,data!I24,data!I56,data!I88))","v":2.3E-2},{"$f":"IF(ISBLANK(CHOOSE(mySelectedAgeGroup,data!J24,data!J56,data!J88)),\"\",CHOOSE(mySelectedAgeGroup,data!J24,data!J56,data!J88))","v":2.3E-2},{"$f":"IF(ISBLANK(CHOOSE(mySelectedAgeGroup,data!K24,data!K56,data!K88)),\"\",CHOOSE(mySelectedAgeGroup,data!K24,data!K56,data!K88))","v":0.02},{"$f":"IF(ISBLANK(CHOOSE(mySelectedAgeGroup,data!L24,data!L56,data!L88)),\"\",CHOOSE(mySelectedAgeGroup,data!L24,data!L56,data!L88))","v":2.1000000000000001E-2},{"$f":"IF(ISBLANK(CHOOSE(mySelectedAgeGroup,data!M24,data!M56,data!M88)),\"\",CHOOSE(mySelectedAgeGroup,data!M24,data!M56,data!M88))","v":1.9E-2},{"$f":"IF(ISBLANK(CHOOSE(mySelectedAgeGroup,data!N24,data!N56,data!N88)),\"\",CHOOSE(mySelectedAgeGroup,data!N24,data!N56,data!N88))","v":1.9E-2},{"$f":"IF(ISBLANK(CHOOSE(mySelectedAgeGroup,data!O24,data!O56,data!O88)),\"\",CHOOSE(mySelectedAgeGroup,data!O24,data!O56,data!O88))","v":1.8000000000000002E-2},{"$f":"IF(ISBLANK(CHOOSE(mySelectedAgeGroup,data!P24,data!P56,data!P88)),\"\",CHOOSE(mySelectedAgeGroup,data!P24,data!P56,data!P88))","v":2.4E-2},{"$f":"IF(ISBLANK(CHOOSE(mySelectedAgeGroup,data!Q24,data!Q56,data!Q88)),\"\",CHOOSE(mySelectedAgeGroup,data!Q24,data!Q56,data!Q88))","v":3.1E-2},{"$f":"IF(ISBLANK(CHOOSE(mySelectedAgeGroup,data!R24,data!R56,data!R88)),\"\",CHOOSE(mySelectedAgeGroup,data!R24,data!R56,data!R88))","v":4.2000000000000003E-2},{"$f":"IF(ISBLANK(CHOOSE(mySelectedAgeGroup,data!S24,data!S56,data!S88)),\"\",CHOOSE(mySelectedAgeGroup,data!S24,data!S56,data!S88))","v":3.7999999999999999E-2},{"$f":"IF(ISBLANK(CHOOSE(mySelectedAgeGroup,data!T24,data!T56,data!T88)),\"\",CHOOSE(mySelectedAgeGroup,data!T24,data!T56,data!T88))","v":3.9E-2},{"$f":"IF(ISBLANK(CHOOSE(mySelectedAgeGroup,data!U24,data!U56,data!U88)),\"\",CHOOSE(mySelectedAgeGroup,data!U24,data!U56,data!U88))","v":3.3000000000000002E-2},{"$f":"IF(ISBLANK(CHOOSE(mySelectedAgeGroup,data!V24,data!V56,data!V88)),\"\",CHOOSE(mySelectedAgeGroup,data!V24,data!V56,data!V88))","v":0.04},{"$f":"IF(ISBLANK(CHOOSE(mySelectedAgeGroup,data!W24,data!W56,data!W88)),\"\",CHOOSE(mySelectedAgeGroup,data!W24,data!W56,data!W88))","v":4.0999999999999995E-2},{"$f":"IF(ISBLANK(CHOOSE(mySelectedAgeGroup,data!X24,data!X56,data!X88)),\"\",CHOOSE(mySelectedAgeGroup,data!X24,data!X56,data!X88))","v":3.7000000000000005E-2},{"$f":"IF(ISBLANK(CHOOSE(mySelectedAgeGroup,data!Y24,data!Y56,data!Y88)),\"\",CHOOSE(mySelectedAgeGroup,data!Y24,data!Y56,data!Y88))","v":4.0999999999999995E-2},{"$f":"IF(ISBLANK(CHOOSE(mySelectedAgeGroup,data!Z24,data!Z56,data!Z88)),\"\",CHOOSE(mySelectedAgeGroup,data!Z24,data!Z56,data!Z88))","v":4.2000000000000003E-2},{"$f":"IF(ISBLANK(CHOOSE(mySelectedAgeGroup,data!AA24,data!AA56,data!AA88)),\"\",CHOOSE(mySelectedAgeGroup,data!AA24,data!AA56,data!AA88))","v":5.2000000000000005E-2},{"$f":"IF(ISBLANK(CHOOSE(mySelectedAgeGroup,data!AB24,data!AB56,data!AB88)),\"\",CHOOSE(mySelectedAgeGroup,data!AB24,data!AB56,data!AB88))","v":4.8000000000000001E-2},{"$f":"IF(ISBLANK(CHOOSE(mySelectedAgeGroup,data!AC24,data!AC56,data!AC88)),\"\",CHOOSE(mySelectedAgeGroup,data!AC24,data!AC56,data!AC88))","v":5.7000000000000002E-2},{"$f":"IF(ISBLANK(CHOOSE(mySelectedAgeGroup,data!AD24,data!AD56,data!AD88)),\"\",CHOOSE(mySelectedAgeGroup,data!AD24,data!AD56,data!AD88))","v":5.2999999999999999E-2},{"$f":"IF(ISBLANK(CHOOSE(mySelectedAgeGroup,data!AE24,data!AE56,data!AE88)),\"\",CHOOSE(mySelectedAgeGroup,data!AE24,data!AE56,data!AE88))","v":4.7E-2},{"$f":"IF(ISBLANK(CHOOSE(mySelectedAgeGroup,data!AF24,data!AF56,data!AF88)),\"\",CHOOSE(mySelectedAgeGroup,data!AF24,data!AF56,data!AF88))","v":4.9000000000000002E-2},{"$f":"IF(ISBLANK(CHOOSE(mySelectedAgeGroup,data!AG24,data!AG56,data!AG88)),\"\",CHOOSE(mySelectedAgeGroup,data!AG24,data!AG56,data!AG88))","v":4.5999999999999999E-2},{"$f":"IF(ISBLANK(CHOOSE(mySelectedAgeGroup,data!AH24,data!AH56,data!AH88)),\"\",CHOOSE(mySelectedAgeGroup,data!AH24,data!AH56,data!AH88))","v":5.2999999999999999E-2}]
[null,null,{"$f":"data!B25","v":"Malta"},{"$f":"IF(ISBLANK(CHOOSE(mySelectedAgeGroup,data!D25,data!D57,data!D89)),\"\",CHOOSE(mySelectedAgeGroup,data!D25,data!D57,data!D89))","v":""},{"$f":"IF(ISBLANK(CHOOSE(mySelectedAgeGroup,data!E25,data!E57,data!E89)),\"\",CHOOSE(mySelectedAgeGroup,data!E25,data!E57,data!E89))","v":""},{"$f":"IF(ISBLANK(CHOOSE(mySelectedAgeGroup,data!F25,data!F57,data!F89)),\"\",CHOOSE(mySelectedAgeGroup,data!F25,data!F57,data!F89))","v":""},{"$f":"IF(ISBLANK(CHOOSE(mySelectedAgeGroup,data!G25,data!G57,data!G89)),\"\",CHOOSE(mySelectedAgeGroup,data!G25,data!G57,data!G89))","v":""},{"$f":"IF(ISBLANK(CHOOSE(mySelectedAgeGroup,data!H25,data!H57,data!H89)),\"\",CHOOSE(mySelectedAgeGroup,data!H25,data!H57,data!H89))","v":""},{"$f":"IF(ISBLANK(CHOOSE(mySelectedAgeGroup,data!I25,data!I57,data!I89)),\"\",CHOOSE(mySelectedAgeGroup,data!I25,data!I57,data!I89))","v":""},{"$f":"IF(ISBLANK(CHOOSE(mySelectedAgeGroup,data!J25,data!J57,data!J89)),\"\",CHOOSE(mySelectedAgeGroup,data!J25,data!J57,data!J89))","v":""},{"$f":"IF(ISBLANK(CHOOSE(mySelectedAgeGroup,data!K25,data!K57,data!K89)),\"\",CHOOSE(mySelectedAgeGroup,data!K25,data!K57,data!K89))","v":4.7E-2},{"$f":"IF(ISBLANK(CHOOSE(mySelectedAgeGroup,data!L25,data!L57,data!L89)),\"\",CHOOSE(mySelectedAgeGroup,data!L25,data!L57,data!L89))","v":4.7E-2},{"$f":"IF(ISBLANK(CHOOSE(mySelectedAgeGroup,data!M25,data!M57,data!M89)),\"\",CHOOSE(mySelectedAgeGroup,data!M25,data!M57,data!M89))","v":4.7E-2},{"$f":"IF(ISBLANK(CHOOSE(mySelectedAgeGroup,data!N25,data!N57,data!N89)),\"\",CHOOSE(mySelectedAgeGroup,data!N25,data!N57,data!N89))","v":4.7E-2},{"$f":"IF(ISBLANK(CHOOSE(mySelectedAgeGroup,data!O25,data!O57,data!O89)),\"\",CHOOSE(mySelectedAgeGroup,data!O25,data!O57,data!O89))","v":4.2999999999999997E-2},{"$f":"IF(ISBLANK(CHOOSE(mySelectedAgeGroup,data!P25,data!P57,data!P89)),\"\",CHOOSE(mySelectedAgeGroup,data!P25,data!P57,data!P89))","v":4.8000000000000001E-2},{"$f":"IF(ISBLANK(CHOOSE(mySelectedAgeGroup,data!Q25,data!Q57,data!Q89)),\"\",CHOOSE(mySelectedAgeGroup,data!Q25,data!Q57,data!Q89))","v":5.2000000000000005E-2},{"$f":"IF(ISBLANK(CHOOSE(mySelectedAgeGroup,data!R25,data!R57,data!R89)),\"\",CHOOSE(mySelectedAgeGroup,data!R25,data!R57,data!R89))","v":4.7E-2},{"$f":"IF(ISBLANK(CHOOSE(mySelectedAgeGroup,data!S25,data!S57,data!S89)),\"\",CHOOSE(mySelectedAgeGroup,data!S25,data!S57,data!S89))","v":4.7E-2},{"$f":"IF(ISBLANK(CHOOSE(mySelectedAgeGroup,data!T25,data!T57,data!T89)),\"\",CHOOSE(mySelectedAgeGroup,data!T25,data!T57,data!T89))","v":4.8000000000000001E-2},{"$f":"IF(ISBLANK(CHOOSE(mySelectedAgeGroup,data!U25,data!U57,data!U89)),\"\",CHOOSE(mySelectedAgeGroup,data!U25,data!U57,data!U89))","v":4.9000000000000002E-2},{"$f":"IF(ISBLANK(CHOOSE(mySelectedAgeGroup,data!V25,data!V57,data!V89)),\"\",CHOOSE(mySelectedAgeGroup,data!V25,data!V57,data!V89))","v":4.8000000000000001E-2},{"$f":"IF(ISBLANK(CHOOSE(mySelectedAgeGroup,data!W25,data!W57,data!W89)),\"\",CHOOSE(mySelectedAgeGroup,data!W25,data!W57,data!W89))","v":5.2999999999999999E-2},{"$f":"IF(ISBLANK(CHOOSE(mySelectedAgeGroup,data!X25,data!X57,data!X89)),\"\",CHOOSE(mySelectedAgeGroup,data!X25,data!X57,data!X89))","v":5.5999999999999994E-2},{"$f":"IF(ISBLANK(CHOOSE(mySelectedAgeGroup,data!Y25,data!Y57,data!Y89)),\"\",CHOOSE(mySelectedAgeGroup,data!Y25,data!Y57,data!Y89))","v":0.05},{"$f":"IF(ISBLANK(CHOOSE(mySelectedAgeGroup,data!Z25,data!Z57,data!Z89)),\"\",CHOOSE(mySelectedAgeGroup,data!Z25,data!Z57,data!Z89))","v":4.8000000000000001E-2},{"$f":"IF(ISBLANK(CHOOSE(mySelectedAgeGroup,data!AA25,data!AA57,data!AA89)),\"\",CHOOSE(mySelectedAgeGroup,data!AA25,data!AA57,data!AA89))","v":4.9000000000000002E-2},{"$f":"IF(ISBLANK(CHOOSE(mySelectedAgeGroup,data!AB25,data!AB57,data!AB89)),\"\",CHOOSE(mySelectedAgeGroup,data!AB25,data!AB57,data!AB89))","v":4.7E-2},{"$f":"IF(ISBLANK(CHOOSE(mySelectedAgeGroup,data!AC25,data!AC57,data!AC89)),\"\",CHOOSE(mySelectedAgeGroup,data!AC25,data!AC57,data!AC89))","v":4.4000000000000004E-2},{"$f":"IF(ISBLANK(CHOOSE(mySelectedAgeGroup,data!AD25,data!AD57,data!AD89)),\"\",CHOOSE(mySelectedAgeGroup,data!AD25,data!AD57,data!AD89))","v":3.7999999999999999E-2},{"$f":"IF(ISBLANK(CHOOSE(mySelectedAgeGroup,data!AE25,data!AE57,data!AE89)),\"\",CHOOSE(mySelectedAgeGroup,data!AE25,data!AE57,data!AE89))","v":3.1E-2},{"$f":"IF(ISBLANK(CHOOSE(mySelectedAgeGroup,data!AF25,data!AF57,data!AF89)),\"\",CHOOSE(mySelectedAgeGroup,data!AF25,data!AF57,data!AF89))","v":2.8999999999999998E-2},{"$f":"IF(ISBLANK(CHOOSE(mySelectedAgeGroup,data!AG25,data!AG57,data!AG89)),\"\",CHOOSE(mySelectedAgeGroup,data!AG25,data!AG57,data!AG89))","v":2.6000000000000002E-2},{"$f":"IF(ISBLANK(CHOOSE(mySelectedAgeGroup,data!AH25,data!AH57,data!AH89)),\"\",CHOOSE(mySelectedAgeGroup,data!AH25,data!AH57,data!AH89))","v":2.7E-2}]
[null,null,{"$f":"data!B26","v":"Netherlands"},{"$f":"IF(ISBLANK(CHOOSE(mySelectedAgeGroup,data!D26,data!D58,data!D90)),\"\",CHOOSE(mySelectedAgeGroup,data!D26,data!D58,data!D90))","v":5.2999999999999999E-2},{"$f":"IF(ISBLANK(CHOOSE(mySelectedAgeGroup,data!E26,data!E58,data!E90)),\"\",CHOOSE(mySelectedAgeGroup,data!E26,data!E58,data!E90))","v":4.9000000000000002E-2},{"$f":"IF(ISBLANK(CHOOSE(mySelectedAgeGroup,data!F26,data!F58,data!F90)),\"\",CHOOSE(mySelectedAgeGroup,data!F26,data!F58,data!F90))","v":5.0999999999999997E-2},{"$f":"IF(ISBLANK(CHOOSE(mySelectedAgeGroup,data!G26,data!G58,data!G90)),\"\",CHOOSE(mySelectedAgeGroup,data!G26,data!G58,data!G90))","v":5.5999999999999994E-2},{"$f":"IF(ISBLANK(CHOOSE(mySelectedAgeGroup,data!H26,data!H58,data!H90)),\"\",CHOOSE(mySelectedAgeGroup,data!H26,data!H58,data!H90))","v":6.4000000000000001E-2},{"$f":"IF(ISBLANK(CHOOSE(mySelectedAgeGroup,data!I26,data!I58,data!I90)),\"\",CHOOSE(mySelectedAgeGroup,data!I26,data!I58,data!I90))","v":6.0999999999999999E-2},{"$f":"IF(ISBLANK(CHOOSE(mySelectedAgeGroup,data!J26,data!J58,data!J90)),\"\",CHOOSE(mySelectedAgeGroup,data!J26,data!J58,data!J90))","v":5.4000000000000006E-2},{"$f":"IF(ISBLANK(CHOOSE(mySelectedAgeGroup,data!K26,data!K58,data!K90)),\"\",CHOOSE(mySelectedAgeGroup,data!K26,data!K58,data!K90))","v":4.5999999999999999E-2},{"$f":"IF(ISBLANK(CHOOSE(mySelectedAgeGroup,data!L26,data!L58,data!L90)),\"\",CHOOSE(mySelectedAgeGroup,data!L26,data!L58,data!L90))","v":3.6000000000000004E-2},{"$f":"IF(ISBLANK(CHOOSE(mySelectedAgeGroup,data!M26,data!M58,data!M90)),\"\",CHOOSE(mySelectedAgeGroup,data!M26,data!M58,data!M90))","v":2.8999999999999998E-2},{"$f":"IF(ISBLANK(CHOOSE(mySelectedAgeGroup,data!N26,data!N58,data!N90)),\"\",CHOOSE(mySelectedAgeGroup,data!N26,data!N58,data!N90))","v":2.4E-2},{"$f":"IF(ISBLANK(CHOOSE(mySelectedAgeGroup,data!O26,data!O58,data!O90)),\"\",CHOOSE(mySelectedAgeGroup,data!O26,data!O58,data!O90))","v":1.8000000000000002E-2},{"$f":"IF(ISBLANK(CHOOSE(mySelectedAgeGroup,data!P26,data!P58,data!P90)),\"\",CHOOSE(mySelectedAgeGroup,data!P26,data!P58,data!P90))","v":2.3E-2},{"$f":"IF(ISBLANK(CHOOSE(mySelectedAgeGroup,data!Q26,data!Q58,data!Q90)),\"\",CHOOSE(mySelectedAgeGroup,data!Q26,data!Q58,data!Q90))","v":3.2000000000000001E-2},{"$f":"IF(ISBLANK(CHOOSE(mySelectedAgeGroup,data!R26,data!R58,data!R90)),\"\",CHOOSE(mySelectedAgeGroup,data!R26,data!R58,data!R90))","v":3.9E-2},{"$f":"IF(ISBLANK(CHOOSE(mySelectedAgeGroup,data!S26,data!S58,data!S90)),\"\",CHOOSE(mySelectedAgeGroup,data!S26,data!S58,data!S90))","v":4.8000000000000001E-2},{"$f":"IF(ISBLANK(CHOOSE(mySelectedAgeGroup,data!T26,data!T58,data!T90)),\"\",CHOOSE(mySelectedAgeGroup,data!T26,data!T58,data!T90))","v":4.0999999999999995E-2},{"$f":"IF(ISBLANK(CHOOSE(mySelectedAgeGroup,data!U26,data!U58,data!U90)),\"\",CHOOSE(mySelectedAgeGroup,data!U26,data!U58,data!U90))","v":3.2000000000000001E-2},{"$f":"IF(ISBLANK(CHOOSE(mySelectedAgeGroup,data!V26,data!V58,data!V90)),\"\",CHOOSE(mySelectedAgeGroup,data!V26,data!V58,data!V90))","v":2.7000000000000003E-2},{"$f":"IF(ISBLANK(CHOOSE(mySelectedAgeGroup,data!W26,data!W58,data!W90)),\"\",CHOOSE(mySelectedAgeGroup,data!W26,data!W58,data!W90))","v":3.2000000000000001E-2},{"$f":"IF(ISBLANK(CHOOSE(mySelectedAgeGroup,data!X26,data!X58,data!X90)),\"\",CHOOSE(mySelectedAgeGroup,data!X26,data!X58,data!X90))","v":3.9E-2},{"$f":"IF(ISBLANK(CHOOSE(mySelectedAgeGroup,data!Y26,data!Y58,data!Y90)),\"\",CHOOSE(mySelectedAgeGroup,data!Y26,data!Y58,data!Y90))","v":0.04},{"$f":"IF(ISBLANK(CHOOSE(mySelectedAgeGroup,data!Z26,data!Z58,data!Z90)),\"\",CHOOSE(mySelectedAgeGroup,data!Z26,data!Z58,data!Z90))","v":4.7E-2},{"$f":"IF(ISBLANK(CHOOSE(mySelectedAgeGroup,data!AA26,data!AA58,data!AA90)),\"\",CHOOSE(mySelectedAgeGroup,data!AA26,data!AA58,data!AA90))","v":6.0999999999999999E-2},{"$f":"IF(ISBLANK(CHOOSE(mySelectedAgeGroup,data!AB26,data!AB58,data!AB90)),\"\",CHOOSE(mySelectedAgeGroup,data!AB26,data!AB58,data!AB90))","v":6.5000000000000002E-2},{"$f":"IF(ISBLANK(CHOOSE(mySelectedAgeGroup,data!AC26,data!AC58,data!AC90)),\"\",CHOOSE(mySelectedAgeGroup,data!AC26,data!AC58,data!AC90))","v":6.0999999999999999E-2},{"$f":"IF(ISBLANK(CHOOSE(mySelectedAgeGroup,data!AD26,data!AD58,data!AD90)),\"\",CHOOSE(mySelectedAgeGroup,data!AD26,data!AD58,data!AD90))","v":5.0999999999999997E-2},{"$f":"IF(ISBLANK(CHOOSE(mySelectedAgeGroup,data!AE26,data!AE58,data!AE90)),\"\",CHOOSE(mySelectedAgeGroup,data!AE26,data!AE58,data!AE90))","v":4.0999999999999995E-2},{"$f":"IF(ISBLANK(CHOOSE(mySelectedAgeGroup,data!AF26,data!AF58,data!AF90)),\"\",CHOOSE(mySelectedAgeGroup,data!AF26,data!AF58,data!AF90))","v":3.2000000000000001E-2},{"$f":"IF(ISBLANK(CHOOSE(mySelectedAgeGroup,data!AG26,data!AG58,data!AG90)),\"\",CHOOSE(mySelectedAgeGroup,data!AG26,data!AG58,data!AG90))","v":2.7999999999999997E-2},{"$f":"IF(ISBLANK(CHOOSE(mySelectedAgeGroup,data!AH26,data!AH58,data!AH90)),\"\",CHOOSE(mySelectedAgeGroup,data!AH26,data!AH58,data!AH90))","v":2.5000000000000001E-2}]
[null,null,{"$f":"data!B27","v":"Poland"},{"$f":"IF(ISBLANK(CHOOSE(mySelectedAgeGroup,data!D27,data!D59,data!D91)),\"\",CHOOSE(mySelectedAgeGroup,data!D27,data!D59,data!D91))","v":""},{"$f":"IF(ISBLANK(CHOOSE(mySelectedAgeGroup,data!E27,data!E59,data!E91)),\"\",CHOOSE(mySelectedAgeGroup,data!E27,data!E59,data!E91))","v":""},{"$f":"IF(ISBLANK(CHOOSE(mySelectedAgeGroup,data!F27,data!F59,data!F91)),\"\",CHOOSE(mySelectedAgeGroup,data!F27,data!F59,data!F91))","v":""},{"$f":"IF(ISBLANK(CHOOSE(mySelectedAgeGroup,data!G27,data!G59,data!G91)),\"\",CHOOSE(mySelectedAgeGroup,data!G27,data!G59,data!G91))","v":""},{"$f":"IF(ISBLANK(CHOOSE(mySelectedAgeGroup,data!H27,data!H59,data!H91)),\"\",CHOOSE(mySelectedAgeGroup,data!H27,data!H59,data!H91))","v":""},{"$f":"IF(ISBLANK(CHOOSE(mySelectedAgeGroup,data!I27,data!I59,data!I91)),\"\",CHOOSE(mySelectedAgeGroup,data!I27,data!I59,data!I91))","v":""},{"$f":"IF(ISBLANK(CHOOSE(mySelectedAgeGroup,data!J27,data!J59,data!J91)),\"\",CHOOSE(mySelectedAgeGroup,data!J27,data!J59,data!J91))","v":""},{"$f":"IF(ISBLANK(CHOOSE(mySelectedAgeGroup,data!K27,data!K59,data!K91)),\"\",CHOOSE(mySelectedAgeGroup,data!K27,data!K59,data!K91))","v":""},{"$f":"IF(ISBLANK(CHOOSE(mySelectedAgeGroup,data!L27,data!L59,data!L91)),\"\",CHOOSE(mySelectedAgeGroup,data!L27,data!L59,data!L91))","v":8.5999999999999993E-2},{"$f":"IF(ISBLANK(CHOOSE(mySelectedAgeGroup,data!M27,data!M59,data!M91)),\"\",CHOOSE(mySelectedAgeGroup,data!M27,data!M59,data!M91))","v":0.109},{"$f":"IF(ISBLANK(CHOOSE(mySelectedAgeGroup,data!N27,data!N59,data!N91)),\"\",CHOOSE(mySelectedAgeGroup,data!N27,data!N59,data!N91))","v":0.13400000000000001},{"$f":"IF(ISBLANK(CHOOSE(mySelectedAgeGroup,data!O27,data!O59,data!O91)),\"\",CHOOSE(mySelectedAgeGroup,data!O27,data!O59,data!O91))","v":0.14899999999999999},{"$f":"IF(ISBLANK(CHOOSE(mySelectedAgeGroup,data!P27,data!P59,data!P91)),\"\",CHOOSE(mySelectedAgeGroup,data!P27,data!P59,data!P91))","v":0.16500000000000001},{"$f":"IF(ISBLANK(CHOOSE(mySelectedAgeGroup,data!Q27,data!Q59,data!Q91)),\"\",CHOOSE(mySelectedAgeGroup,data!Q27,data!Q59,data!Q91))","v":0.16300000000000001},{"$f":"IF(ISBLANK(CHOOSE(mySelectedAgeGroup,data!R27,data!R59,data!R91)),\"\",CHOOSE(mySelectedAgeGroup,data!R27,data!R59,data!R91))","v":0.161},{"$f":"IF(ISBLANK(CHOOSE(mySelectedAgeGroup,data!S27,data!S59,data!S91)),\"\",CHOOSE(mySelectedAgeGroup,data!S27,data!S59,data!S91))","v":0.151},{"$f":"IF(ISBLANK(CHOOSE(mySelectedAgeGroup,data!T27,data!T59,data!T91)),\"\",CHOOSE(mySelectedAgeGroup,data!T27,data!T59,data!T91))","v":0.11800000000000001},{"$f":"IF(ISBLANK(CHOOSE(mySelectedAgeGroup,data!U27,data!U59,data!U91)),\"\",CHOOSE(mySelectedAgeGroup,data!U27,data!U59,data!U91))","v":8.1000000000000003E-2},{"$f":"IF(ISBLANK(CHOOSE(mySelectedAgeGroup,data!V27,data!V59,data!V91)),\"\",CHOOSE(mySelectedAgeGroup,data!V27,data!V59,data!V91))","v":5.9000000000000004E-2},{"$f":"IF(ISBLANK(CHOOSE(mySelectedAgeGroup,data!W27,data!W59,data!W91)),\"\",CHOOSE(mySelectedAgeGroup,data!W27,data!W59,data!W91))","v":6.8000000000000005E-2},{"$f":"IF(ISBLANK(CHOOSE(mySelectedAgeGroup,data!X27,data!X59,data!X91)),\"\",CHOOSE(mySelectedAgeGroup,data!X27,data!X59,data!X91))","v":8.1000000000000003E-2},{"$f":"IF(ISBLANK(CHOOSE(mySelectedAgeGroup,data!Y27,data!Y59,data!Y91)),\"\",CHOOSE(mySelectedAgeGroup,data!Y27,data!Y59,data!Y91))","v":0.08},{"$f":"IF(ISBLANK(CHOOSE(mySelectedAgeGroup,data!Z27,data!Z59,data!Z91)),\"\",CHOOSE(mySelectedAgeGroup,data!Z27,data!Z59,data!Z91))","v":8.5000000000000006E-2},{"$f":"IF(ISBLANK(CHOOSE(mySelectedAgeGroup,data!AA27,data!AA59,data!AA91)),\"\",CHOOSE(mySelectedAgeGroup,data!AA27,data!AA59,data!AA91))","v":8.8000000000000009E-2},{"$f":"IF(ISBLANK(CHOOSE(mySelectedAgeGroup,data!AB27,data!AB59,data!AB91)),\"\",CHOOSE(mySelectedAgeGroup,data!AB27,data!AB59,data!AB91))","v":7.6999999999999999E-2},{"$f":"IF(ISBLANK(CHOOSE(mySelectedAgeGroup,data!AC27,data!AC59,data!AC91)),\"\",CHOOSE(mySelectedAgeGroup,data!AC27,data!AC59,data!AC91))","v":6.4000000000000001E-2},{"$f":"IF(ISBLANK(CHOOSE(mySelectedAgeGroup,data!AD27,data!AD59,data!AD91)),\"\",CHOOSE(mySelectedAgeGroup,data!AD27,data!AD59,data!AD91))","v":5.2000000000000005E-2},{"$f":"IF(ISBLANK(CHOOSE(mySelectedAgeGroup,data!AE27,data!AE59,data!AE91)),\"\",CHOOSE(mySelectedAgeGroup,data!AE27,data!AE59,data!AE91))","v":4.0999999999999995E-2},{"$f":"IF(ISBLANK(CHOOSE(mySelectedAgeGroup,data!AF27,data!AF59,data!AF91)),\"\",CHOOSE(mySelectedAgeGroup,data!AF27,data!AF59,data!AF91))","v":3.2000000000000001E-2},{"$f":"IF(ISBLANK(CHOOSE(mySelectedAgeGroup,data!AG27,data!AG59,data!AG91)),\"\",CHOOSE(mySelectedAgeGroup,data!AG27,data!AG59,data!AG91))","v":2.7999999999999997E-2},{"$f":"IF(ISBLANK(CHOOSE(mySelectedAgeGroup,data!AH27,data!AH59,data!AH91)),\"\",CHOOSE(mySelectedAgeGroup,data!AH27,data!AH59,data!AH91))","v":2.8000000000000001E-2}]
[null,null,{"$f":"data!B28","v":"Portugal"},{"$f":"IF(ISBLANK(CHOOSE(mySelectedAgeGroup,data!D28,data!D60,data!D92)),\"\",CHOOSE(mySelectedAgeGroup,data!D28,data!D60,data!D92))","v":3.7000000000000005E-2},{"$f":"IF(ISBLANK(CHOOSE(mySelectedAgeGroup,data!E28,data!E60,data!E92)),\"\",CHOOSE(mySelectedAgeGroup,data!E28,data!E60,data!E92))","v":3.4000000000000002E-2},{"$f":"IF(ISBLANK(CHOOSE(mySelectedAgeGroup,data!F28,data!F60,data!F92)),\"\",CHOOSE(mySelectedAgeGroup,data!F28,data!F60,data!F92))","v":3.2000000000000001E-2},{"$f":"IF(ISBLANK(CHOOSE(mySelectedAgeGroup,data!G28,data!G60,data!G92)),\"\",CHOOSE(mySelectedAgeGroup,data!G28,data!G60,data!G92))","v":4.4999999999999998E-2},{"$f":"IF(ISBLANK(CHOOSE(mySelectedAgeGroup,data!H28,data!H60,data!H92)),\"\",CHOOSE(mySelectedAgeGroup,data!H28,data!H60,data!H92))","v":5.7000000000000002E-2},{"$f":"IF(ISBLANK(CHOOSE(mySelectedAgeGroup,data!I28,data!I60,data!I92)),\"\",CHOOSE(mySelectedAgeGroup,data!I28,data!I60,data!I92))","v":5.7000000000000002E-2},{"$f":"IF(ISBLANK(CHOOSE(mySelectedAgeGroup,data!J28,data!J60,data!J92)),\"\",CHOOSE(mySelectedAgeGroup,data!J28,data!J60,data!J92))","v":5.7999999999999996E-2},{"$f":"IF(ISBLANK(CHOOSE(mySelectedAgeGroup,data!K28,data!K60,data!K92)),\"\",CHOOSE(mySelectedAgeGroup,data!K28,data!K60,data!K92))","v":5.5E-2},{"$f":"IF(ISBLANK(CHOOSE(mySelectedAgeGroup,data!L28,data!L60,data!L92)),\"\",CHOOSE(mySelectedAgeGroup,data!L28,data!L60,data!L92))","v":4.2000000000000003E-2},{"$f":"IF(ISBLANK(CHOOSE(mySelectedAgeGroup,data!M28,data!M60,data!M92)),\"\",CHOOSE(mySelectedAgeGroup,data!M28,data!M60,data!M92))","v":3.7999999999999999E-2},{"$f":"IF(ISBLANK(CHOOSE(mySelectedAgeGroup,data!N28,data!N60,data!N92)),\"\",CHOOSE(mySelectedAgeGroup,data!N28,data!N60,data!N92))","v":3.4000000000000002E-2},{"$f":"IF(ISBLANK(CHOOSE(mySelectedAgeGroup,data!O28,data!O60,data!O92)),\"\",CHOOSE(mySelectedAgeGroup,data!O28,data!O60,data!O92))","v":3.3000000000000002E-2},{"$f":"IF(ISBLANK(CHOOSE(mySelectedAgeGroup,data!P28,data!P60,data!P92)),\"\",CHOOSE(mySelectedAgeGroup,data!P28,data!P60,data!P92))","v":4.0999999999999995E-2},{"$f":"IF(ISBLANK(CHOOSE(mySelectedAgeGroup,data!Q28,data!Q60,data!Q92)),\"\",CHOOSE(mySelectedAgeGroup,data!Q28,data!Q60,data!Q92))","v":5.2999999999999999E-2},{"$f":"IF(ISBLANK(CHOOSE(mySelectedAgeGroup,data!R28,data!R60,data!R92)),\"\",CHOOSE(mySelectedAgeGroup,data!R28,data!R60,data!R92))","v":5.7000000000000002E-2},{"$f":"IF(ISBLANK(CHOOSE(mySelectedAgeGroup,data!S28,data!S60,data!S92)),\"\",CHOOSE(mySelectedAgeGroup,data!S28,data!S60,data!S92))","v":6.7000000000000004E-2},{"$f":"IF(ISBLANK(CHOOSE(mySelectedAgeGroup,data!T28,data!T60,data!T92)),\"\",CHOOSE(mySelectedAgeGroup,data!T28,data!T60,data!T92))","v":6.8000000000000005E-2},{"$f":"IF(ISBLANK(CHOOSE(mySelectedAgeGroup,data!U28,data!U60,data!U92)),\"\",CHOOSE(mySelectedAgeGroup,data!U28,data!U60,data!U92))","v":7.2000000000000008E-2},{"$f":"IF(ISBLANK(CHOOSE(mySelectedAgeGroup,data!V28,data!V60,data!V92)),\"\",CHOOSE(mySelectedAgeGroup,data!V28,data!V60,data!V92))","v":6.8000000000000005E-2},{"$f":"IF(ISBLANK(CHOOSE(mySelectedAgeGroup,data!W28,data!W60,data!W92)),\"\",CHOOSE(mySelectedAgeGroup,data!W28,data!W60,data!W92))","v":8.5999999999999993E-2},{"$f":"IF(ISBLANK(CHOOSE(mySelectedAgeGroup,data!X28,data!X60,data!X92)),\"\",CHOOSE(mySelectedAgeGroup,data!X28,data!X60,data!X92))","v":0.1},{"$f":"IF(ISBLANK(CHOOSE(mySelectedAgeGroup,data!Y28,data!Y60,data!Y92)),\"\",CHOOSE(mySelectedAgeGroup,data!Y28,data!Y60,data!Y92))","v":0.113},{"$f":"IF(ISBLANK(CHOOSE(mySelectedAgeGroup,data!Z28,data!Z60,data!Z92)),\"\",CHOOSE(mySelectedAgeGroup,data!Z28,data!Z60,data!Z92))","v":0.13900000000000001},{"$f":"IF(ISBLANK(CHOOSE(mySelectedAgeGroup,data!AA28,data!AA60,data!AA92)),\"\",CHOOSE(mySelectedAgeGroup,data!AA28,data!AA60,data!AA92))","v":0.14699999999999999},{"$f":"IF(ISBLANK(CHOOSE(mySelectedAgeGroup,data!AB28,data!AB60,data!AB92)),\"\",CHOOSE(mySelectedAgeGroup,data!AB28,data!AB60,data!AB92))","v":0.125},{"$f":"IF(ISBLANK(CHOOSE(mySelectedAgeGroup,data!AC28,data!AC60,data!AC92)),\"\",CHOOSE(mySelectedAgeGroup,data!AC28,data!AC60,data!AC92))","v":0.111},{"$f":"IF(ISBLANK(CHOOSE(mySelectedAgeGroup,data!AD28,data!AD60,data!AD92)),\"\",CHOOSE(mySelectedAgeGroup,data!AD28,data!AD60,data!AD92))","v":9.9000000000000005E-2},{"$f":"IF(ISBLANK(CHOOSE(mySelectedAgeGroup,data!AE28,data!AE60,data!AE92)),\"\",CHOOSE(mySelectedAgeGroup,data!AE28,data!AE60,data!AE92))","v":7.8E-2},{"$f":"IF(ISBLANK(CHOOSE(mySelectedAgeGroup,data!AF28,data!AF60,data!AF92)),\"\",CHOOSE(mySelectedAgeGroup,data!AF28,data!AF60,data!AF92))","v":6.0999999999999999E-2},{"$f":"IF(ISBLANK(CHOOSE(mySelectedAgeGroup,data!AG28,data!AG60,data!AG92)),\"\",CHOOSE(mySelectedAgeGroup,data!AG28,data!AG60,data!AG92))","v":5.5999999999999994E-2},{"$f":"IF(ISBLANK(CHOOSE(mySelectedAgeGroup,data!AH28,data!AH60,data!AH92)),\"\",CHOOSE(mySelectedAgeGroup,data!AH28,data!AH60,data!AH92))","v":5.8000000000000003E-2}]
[null,null,{"$f":"data!B29","v":"Romania"},{"$f":"IF(ISBLANK(CHOOSE(mySelectedAgeGroup,data!D29,data!D61,data!D93)),\"\",CHOOSE(mySelectedAgeGroup,data!D29,data!D61,data!D93))","v":""},{"$f":"IF(ISBLANK(CHOOSE(mySelectedAgeGroup,data!E29,data!E61,data!E93)),\"\",CHOOSE(mySelectedAgeGroup,data!E29,data!E61,data!E93))","v":""},{"$f":"IF(ISBLANK(CHOOSE(mySelectedAgeGroup,data!F29,data!F61,data!F93)),\"\",CHOOSE(mySelectedAgeGroup,data!F29,data!F61,data!F93))","v":""},{"$f":"IF(ISBLANK(CHOOSE(mySelectedAgeGroup,data!G29,data!G61,data!G93)),\"\",CHOOSE(mySelectedAgeGroup,data!G29,data!G61,data!G93))","v":""},{"$f":"IF(ISBLANK(CHOOSE(mySelectedAgeGroup,data!H29,data!H61,data!H93)),\"\",CHOOSE(mySelectedAgeGroup,data!H29,data!H61,data!H93))","v":""},{"$f":"IF(ISBLANK(CHOOSE(mySelectedAgeGroup,data!I29,data!I61,data!I93)),\"\",CHOOSE(mySelectedAgeGroup,data!I29,data!I61,data!I93))","v":""},{"$f":"IF(ISBLANK(CHOOSE(mySelectedAgeGroup,data!J29,data!J61,data!J93)),\"\",CHOOSE(mySelectedAgeGroup,data!J29,data!J61,data!J93))","v":""},{"$f":"IF(ISBLANK(CHOOSE(mySelectedAgeGroup,data!K29,data!K61,data!K93)),\"\",CHOOSE(mySelectedAgeGroup,data!K29,data!K61,data!K93))","v":""},{"$f":"IF(ISBLANK(CHOOSE(mySelectedAgeGroup,data!L29,data!L61,data!L93)),\"\",CHOOSE(mySelectedAgeGroup,data!L29,data!L61,data!L93))","v":4.2999999999999997E-2},{"$f":"IF(ISBLANK(CHOOSE(mySelectedAgeGroup,data!M29,data!M61,data!M93)),\"\",CHOOSE(mySelectedAgeGroup,data!M29,data!M61,data!M93))","v":0.05},{"$f":"IF(ISBLANK(CHOOSE(mySelectedAgeGroup,data!N29,data!N61,data!N93)),\"\",CHOOSE(mySelectedAgeGroup,data!N29,data!N61,data!N93))","v":5.4000000000000006E-2},{"$f":"IF(ISBLANK(CHOOSE(mySelectedAgeGroup,data!O29,data!O61,data!O93)),\"\",CHOOSE(mySelectedAgeGroup,data!O29,data!O61,data!O93))","v":0.05},{"$f":"IF(ISBLANK(CHOOSE(mySelectedAgeGroup,data!P29,data!P61,data!P93)),\"\",CHOOSE(mySelectedAgeGroup,data!P29,data!P61,data!P93))","v":6.5000000000000002E-2},{"$f":"IF(ISBLANK(CHOOSE(mySelectedAgeGroup,data!Q29,data!Q61,data!Q93)),\"\",CHOOSE(mySelectedAgeGroup,data!Q29,data!Q61,data!Q93))","v":5.4000000000000006E-2},{"$f":"IF(ISBLANK(CHOOSE(mySelectedAgeGroup,data!R29,data!R61,data!R93)),\"\",CHOOSE(mySelectedAgeGroup,data!R29,data!R61,data!R93))","v":6.2E-2},{"$f":"IF(ISBLANK(CHOOSE(mySelectedAgeGroup,data!S29,data!S61,data!S93)),\"\",CHOOSE(mySelectedAgeGroup,data!S29,data!S61,data!S93))","v":5.5999999999999994E-2},{"$f":"IF(ISBLANK(CHOOSE(mySelectedAgeGroup,data!T29,data!T61,data!T93)),\"\",CHOOSE(mySelectedAgeGroup,data!T29,data!T61,data!T93))","v":5.7000000000000002E-2},{"$f":"IF(ISBLANK(CHOOSE(mySelectedAgeGroup,data!U29,data!U61,data!U93)),\"\",CHOOSE(mySelectedAgeGroup,data!U29,data!U61,data!U93))","v":4.9000000000000002E-2},{"$f":"IF(ISBLANK(CHOOSE(mySelectedAgeGroup,data!V29,data!V61,data!V93)),\"\",CHOOSE(mySelectedAgeGroup,data!V29,data!V61,data!V93))","v":4.4000000000000004E-2},{"$f":"IF(ISBLANK(CHOOSE(mySelectedAgeGroup,data!W29,data!W61,data!W93)),\"\",CHOOSE(mySelectedAgeGroup,data!W29,data!W61,data!W93))","v":5.4000000000000006E-2},{"$f":"IF(ISBLANK(CHOOSE(mySelectedAgeGroup,data!X29,data!X61,data!X93)),\"\",CHOOSE(mySelectedAgeGroup,data!X29,data!X61,data!X93))","v":5.5999999999999994E-2},{"$f":"IF(ISBLANK(CHOOSE(mySelectedAgeGroup,data!Y29,data!Y61,data!Y93)),\"\",CHOOSE(mySelectedAgeGroup,data!Y29,data!Y61,data!Y93))","v":5.7000000000000002E-2},{"$f":"IF(ISBLANK(CHOOSE(mySelectedAgeGroup,data!Z29,data!Z61,data!Z93)),\"\",CHOOSE(mySelectedAgeGroup,data!Z29,data!Z61,data!Z93))","v":5.4000000000000006E-2},{"$f":"IF(ISBLANK(CHOOSE(mySelectedAgeGroup,data!AA29,data!AA61,data!AA93)),\"\",CHOOSE(mySelectedAgeGroup,data!AA29,data!AA61,data!AA93))","v":5.7000000000000002E-2},{"$f":"IF(ISBLANK(CHOOSE(mySelectedAgeGroup,data!AB29,data!AB61,data!AB93)),\"\",CHOOSE(mySelectedAgeGroup,data!AB29,data!AB61,data!AB93))","v":5.5E-2},{"$f":"IF(ISBLANK(CHOOSE(mySelectedAgeGroup,data!AC29,data!AC61,data!AC93)),\"\",CHOOSE(mySelectedAgeGroup,data!AC29,data!AC61,data!AC93))","v":5.5999999999999994E-2},{"$f":"IF(ISBLANK(CHOOSE(mySelectedAgeGroup,data!AD29,data!AD61,data!AD93)),\"\",CHOOSE(mySelectedAgeGroup,data!AD29,data!AD61,data!AD93))","v":4.8000000000000001E-2},{"$f":"IF(ISBLANK(CHOOSE(mySelectedAgeGroup,data!AE29,data!AE61,data!AE93)),\"\",CHOOSE(mySelectedAgeGroup,data!AE29,data!AE61,data!AE93))","v":3.9E-2},{"$f":"IF(ISBLANK(CHOOSE(mySelectedAgeGroup,data!AF29,data!AF61,data!AF93)),\"\",CHOOSE(mySelectedAgeGroup,data!AF29,data!AF61,data!AF93))","v":3.3000000000000002E-2},{"$f":"IF(ISBLANK(CHOOSE(mySelectedAgeGroup,data!AG29,data!AG61,data!AG93)),\"\",CHOOSE(mySelectedAgeGroup,data!AG29,data!AG61,data!AG93))","v":0.03},{"$f":"IF(ISBLANK(CHOOSE(mySelectedAgeGroup,data!AH29,data!AH61,data!AH93)),\"\",CHOOSE(mySelectedAgeGroup,data!AH29,data!AH61,data!AH93))","v":3.7999999999999999E-2}]
[null,null,{"$f":"data!B30","v":"Slovakia"},{"$f":"IF(ISBLANK(CHOOSE(mySelectedAgeGroup,data!D30,data!D62,data!D94)),\"\",CHOOSE(mySelectedAgeGroup,data!D30,data!D62,data!D94))","v":""},{"$f":"IF(ISBLANK(CHOOSE(mySelectedAgeGroup,data!E30,data!E62,data!E94)),\"\",CHOOSE(mySelectedAgeGroup,data!E30,data!E62,data!E94))","v":""},{"$f":"IF(ISBLANK(CHOOSE(mySelectedAgeGroup,data!F30,data!F62,data!F94)),\"\",CHOOSE(mySelectedAgeGroup,data!F30,data!F62,data!F94))","v":""},{"$f":"IF(ISBLANK(CHOOSE(mySelectedAgeGroup,data!G30,data!G62,data!G94)),\"\",CHOOSE(mySelectedAgeGroup,data!G30,data!G62,data!G94))","v":""},{"$f":"IF(ISBLANK(CHOOSE(mySelectedAgeGroup,data!H30,data!H62,data!H94)),\"\",CHOOSE(mySelectedAgeGroup,data!H30,data!H62,data!H94))","v":""},{"$f":"IF(ISBLANK(CHOOSE(mySelectedAgeGroup,data!I30,data!I62,data!I94)),\"\",CHOOSE(mySelectedAgeGroup,data!I30,data!I62,data!I94))","v":""},{"$f":"IF(ISBLANK(CHOOSE(mySelectedAgeGroup,data!J30,data!J62,data!J94)),\"\",CHOOSE(mySelectedAgeGroup,data!J30,data!J62,data!J94))","v":""},{"$f":"IF(ISBLANK(CHOOSE(mySelectedAgeGroup,data!K30,data!K62,data!K94)),\"\",CHOOSE(mySelectedAgeGroup,data!K30,data!K62,data!K94))","v":9.8000000000000004E-2},{"$f":"IF(ISBLANK(CHOOSE(mySelectedAgeGroup,data!L30,data!L62,data!L94)),\"\",CHOOSE(mySelectedAgeGroup,data!L30,data!L62,data!L94))","v":0.10099999999999999},{"$f":"IF(ISBLANK(CHOOSE(mySelectedAgeGroup,data!M30,data!M62,data!M94)),\"\",CHOOSE(mySelectedAgeGroup,data!M30,data!M62,data!M94))","v":0.129},{"$f":"IF(ISBLANK(CHOOSE(mySelectedAgeGroup,data!N30,data!N62,data!N94)),\"\",CHOOSE(mySelectedAgeGroup,data!N30,data!N62,data!N94))","v":0.153},{"$f":"IF(ISBLANK(CHOOSE(mySelectedAgeGroup,data!O30,data!O62,data!O94)),\"\",CHOOSE(mySelectedAgeGroup,data!O30,data!O62,data!O94))","v":0.157},{"$f":"IF(ISBLANK(CHOOSE(mySelectedAgeGroup,data!P30,data!P62,data!P94)),\"\",CHOOSE(mySelectedAgeGroup,data!P30,data!P62,data!P94))","v":0.153},{"$f":"IF(ISBLANK(CHOOSE(mySelectedAgeGroup,data!Q30,data!Q62,data!Q94)),\"\",CHOOSE(mySelectedAgeGroup,data!Q30,data!Q62,data!Q94))","v":0.14899999999999999},{"$f":"IF(ISBLANK(CHOOSE(mySelectedAgeGroup,data!R30,data!R62,data!R94)),\"\",CHOOSE(mySelectedAgeGroup,data!R30,data!R62,data!R94))","v":0.16},{"$f":"IF(ISBLANK(CHOOSE(mySelectedAgeGroup,data!S30,data!S62,data!S94)),\"\",CHOOSE(mySelectedAgeGroup,data!S30,data!S62,data!S94))","v":0.14400000000000002},{"$f":"IF(ISBLANK(CHOOSE(mySelectedAgeGroup,data!T30,data!T62,data!T94)),\"\",CHOOSE(mySelectedAgeGroup,data!T30,data!T62,data!T94))","v":0.11699999999999999},{"$f":"IF(ISBLANK(CHOOSE(mySelectedAgeGroup,data!U30,data!U62,data!U94)),\"\",CHOOSE(mySelectedAgeGroup,data!U30,data!U62,data!U94))","v":0.1},{"$f":"IF(ISBLANK(CHOOSE(mySelectedAgeGroup,data!V30,data!V62,data!V94)),\"\",CHOOSE(mySelectedAgeGroup,data!V30,data!V62,data!V94))","v":8.4000000000000005E-2},{"$f":"IF(ISBLANK(CHOOSE(mySelectedAgeGroup,data!W30,data!W62,data!W94)),\"\",CHOOSE(mySelectedAgeGroup,data!W30,data!W62,data!W94))","v":0.10400000000000001},{"$f":"IF(ISBLANK(CHOOSE(mySelectedAgeGroup,data!X30,data!X62,data!X94)),\"\",CHOOSE(mySelectedAgeGroup,data!X30,data!X62,data!X94))","v":0.125},{"$f":"IF(ISBLANK(CHOOSE(mySelectedAgeGroup,data!Y30,data!Y62,data!Y94)),\"\",CHOOSE(mySelectedAgeGroup,data!Y30,data!Y62,data!Y94))","v":0.11800000000000001},{"$f":"IF(ISBLANK(CHOOSE(mySelectedAgeGroup,data!Z30,data!Z62,data!Z94)),\"\",CHOOSE(mySelectedAgeGroup,data!Z30,data!Z62,data!Z94))","v":0.122},{"$f":"IF(ISBLANK(CHOOSE(mySelectedAgeGroup,data!AA30,data!AA62,data!AA94)),\"\",CHOOSE(mySelectedAgeGroup,data!AA30,data!AA62,data!AA94))","v":0.125},{"$f":"IF(ISBLANK(CHOOSE(mySelectedAgeGroup,data!AB30,data!AB62,data!AB94)),\"\",CHOOSE(mySelectedAgeGroup,data!AB30,data!AB62,data!AB94))","v":0.11800000000000001},{"$f":"IF(ISBLANK(CHOOSE(mySelectedAgeGroup,data!AC30,data!AC62,data!AC94)),\"\",CHOOSE(mySelectedAgeGroup,data!AC30,data!AC62,data!AC94))","v":0.10199999999999999},{"$f":"IF(ISBLANK(CHOOSE(mySelectedAgeGroup,data!AD30,data!AD62,data!AD94)),\"\",CHOOSE(mySelectedAgeGroup,data!AD30,data!AD62,data!AD94))","v":8.6999999999999994E-2},{"$f":"IF(ISBLANK(CHOOSE(mySelectedAgeGroup,data!AE30,data!AE62,data!AE94)),\"\",CHOOSE(mySelectedAgeGroup,data!AE30,data!AE62,data!AE94))","v":7.2999999999999995E-2},{"$f":"IF(ISBLANK(CHOOSE(mySelectedAgeGroup,data!AF30,data!AF62,data!AF94)),\"\",CHOOSE(mySelectedAgeGroup,data!AF30,data!AF62,data!AF94))","v":5.9000000000000004E-2},{"$f":"IF(ISBLANK(CHOOSE(mySelectedAgeGroup,data!AG30,data!AG62,data!AG94)),\"\",CHOOSE(mySelectedAgeGroup,data!AG30,data!AG62,data!AG94))","v":5.0999999999999997E-2},{"$f":"IF(ISBLANK(CHOOSE(mySelectedAgeGroup,data!AH30,data!AH62,data!AH94)),\"\",CHOOSE(mySelectedAgeGroup,data!AH30,data!AH62,data!AH94))","v":4.9000000000000002E-2}]
[null,null,{"$f":"data!B31","v":"Slovenia"},{"$f":"IF(ISBLANK(CHOOSE(mySelectedAgeGroup,data!D31,data!D63,data!D95)),\"\",CHOOSE(mySelectedAgeGroup,data!D31,data!D63,data!D95))","v":""},{"$f":"IF(ISBLANK(CHOOSE(mySelectedAgeGroup,data!E31,data!E63,data!E95)),\"\",CHOOSE(mySelectedAgeGroup,data!E31,data!E63,data!E95))","v":""},{"$f":"IF(ISBLANK(CHOOSE(mySelectedAgeGroup,data!F31,data!F63,data!F95)),\"\",CHOOSE(mySelectedAgeGroup,data!F31,data!F63,data!F95))","v":""},{"$f":"IF(ISBLANK(CHOOSE(mySelectedAgeGroup,data!G31,data!G63,data!G95)),\"\",CHOOSE(mySelectedAgeGroup,data!G31,data!G63,data!G95))","v":""},{"$f":"IF(ISBLANK(CHOOSE(mySelectedAgeGroup,data!H31,data!H63,data!H95)),\"\",CHOOSE(mySelectedAgeGroup,data!H31,data!H63,data!H95))","v":""},{"$f":"IF(ISBLANK(CHOOSE(mySelectedAgeGroup,data!I31,data!I63,data!I95)),\"\",CHOOSE(mySelectedAgeGroup,data!I31,data!I63,data!I95))","v":""},{"$f":"IF(ISBLANK(CHOOSE(mySelectedAgeGroup,data!J31,data!J63,data!J95)),\"\",CHOOSE(mySelectedAgeGroup,data!J31,data!J63,data!J95))","v":""},{"$f":"IF(ISBLANK(CHOOSE(mySelectedAgeGroup,data!K31,data!K63,data!K95)),\"\",CHOOSE(mySelectedAgeGroup,data!K31,data!K63,data!K95))","v":5.2000000000000005E-2},{"$f":"IF(ISBLANK(CHOOSE(mySelectedAgeGroup,data!L31,data!L63,data!L95)),\"\",CHOOSE(mySelectedAgeGroup,data!L31,data!L63,data!L95))","v":5.7999999999999996E-2},{"$f":"IF(ISBLANK(CHOOSE(mySelectedAgeGroup,data!M31,data!M63,data!M95)),\"\",CHOOSE(mySelectedAgeGroup,data!M31,data!M63,data!M95))","v":5.9000000000000004E-2},{"$f":"IF(ISBLANK(CHOOSE(mySelectedAgeGroup,data!N31,data!N63,data!N95)),\"\",CHOOSE(mySelectedAgeGroup,data!N31,data!N63,data!N95))","v":5.5E-2},{"$f":"IF(ISBLANK(CHOOSE(mySelectedAgeGroup,data!O31,data!O63,data!O95)),\"\",CHOOSE(mySelectedAgeGroup,data!O31,data!O63,data!O95))","v":4.8000000000000001E-2},{"$f":"IF(ISBLANK(CHOOSE(mySelectedAgeGroup,data!P31,data!P63,data!P95)),\"\",CHOOSE(mySelectedAgeGroup,data!P31,data!P63,data!P95))","v":5.0999999999999997E-2},{"$f":"IF(ISBLANK(CHOOSE(mySelectedAgeGroup,data!Q31,data!Q63,data!Q95)),\"\",CHOOSE(mySelectedAgeGroup,data!Q31,data!Q63,data!Q95))","v":5.5E-2},{"$f":"IF(ISBLANK(CHOOSE(mySelectedAgeGroup,data!R31,data!R63,data!R95)),\"\",CHOOSE(mySelectedAgeGroup,data!R31,data!R63,data!R95))","v":5.0999999999999997E-2},{"$f":"IF(ISBLANK(CHOOSE(mySelectedAgeGroup,data!S31,data!S63,data!S95)),\"\",CHOOSE(mySelectedAgeGroup,data!S31,data!S63,data!S95))","v":5.4000000000000006E-2},{"$f":"IF(ISBLANK(CHOOSE(mySelectedAgeGroup,data!T31,data!T63,data!T95)),\"\",CHOOSE(mySelectedAgeGroup,data!T31,data!T63,data!T95))","v":5.0999999999999997E-2},{"$f":"IF(ISBLANK(CHOOSE(mySelectedAgeGroup,data!U31,data!U63,data!U95)),\"\",CHOOSE(mySelectedAgeGroup,data!U31,data!U63,data!U95))","v":4.2000000000000003E-2},{"$f":"IF(ISBLANK(CHOOSE(mySelectedAgeGroup,data!V31,data!V63,data!V95)),\"\",CHOOSE(mySelectedAgeGroup,data!V31,data!V63,data!V95))","v":3.7000000000000005E-2},{"$f":"IF(ISBLANK(CHOOSE(mySelectedAgeGroup,data!W31,data!W63,data!W95)),\"\",CHOOSE(mySelectedAgeGroup,data!W31,data!W63,data!W95))","v":5.0999999999999997E-2},{"$f":"IF(ISBLANK(CHOOSE(mySelectedAgeGroup,data!X31,data!X63,data!X95)),\"\",CHOOSE(mySelectedAgeGroup,data!X31,data!X63,data!X95))","v":6.5000000000000002E-2},{"$f":"IF(ISBLANK(CHOOSE(mySelectedAgeGroup,data!Y31,data!Y63,data!Y95)),\"\",CHOOSE(mySelectedAgeGroup,data!Y31,data!Y63,data!Y95))","v":7.4999999999999997E-2},{"$f":"IF(ISBLANK(CHOOSE(mySelectedAgeGroup,data!Z31,data!Z63,data!Z95)),\"\",CHOOSE(mySelectedAgeGroup,data!Z31,data!Z63,data!Z95))","v":7.9000000000000001E-2},{"$f":"IF(ISBLANK(CHOOSE(mySelectedAgeGroup,data!AA31,data!AA63,data!AA95)),\"\",CHOOSE(mySelectedAgeGroup,data!AA31,data!AA63,data!AA95))","v":9.1999999999999998E-2},{"$f":"IF(ISBLANK(CHOOSE(mySelectedAgeGroup,data!AB31,data!AB63,data!AB95)),\"\",CHOOSE(mySelectedAgeGroup,data!AB31,data!AB63,data!AB95))","v":0.09},{"$f":"IF(ISBLANK(CHOOSE(mySelectedAgeGroup,data!AC31,data!AC63,data!AC95)),\"\",CHOOSE(mySelectedAgeGroup,data!AC31,data!AC63,data!AC95))","v":8.4000000000000005E-2},{"$f":"IF(ISBLANK(CHOOSE(mySelectedAgeGroup,data!AD31,data!AD63,data!AD95)),\"\",CHOOSE(mySelectedAgeGroup,data!AD31,data!AD63,data!AD95))","v":7.4999999999999997E-2},{"$f":"IF(ISBLANK(CHOOSE(mySelectedAgeGroup,data!AE31,data!AE63,data!AE95)),\"\",CHOOSE(mySelectedAgeGroup,data!AE31,data!AE63,data!AE95))","v":6.2E-2},{"$f":"IF(ISBLANK(CHOOSE(mySelectedAgeGroup,data!AF31,data!AF63,data!AF95)),\"\",CHOOSE(mySelectedAgeGroup,data!AF31,data!AF63,data!AF95))","v":4.8000000000000001E-2},{"$f":"IF(ISBLANK(CHOOSE(mySelectedAgeGroup,data!AG31,data!AG63,data!AG95)),\"\",CHOOSE(mySelectedAgeGroup,data!AG31,data!AG63,data!AG95))","v":4.2000000000000003E-2},{"$f":"IF(ISBLANK(CHOOSE(mySelectedAgeGroup,data!AH31,data!AH63,data!AH95)),\"\",CHOOSE(mySelectedAgeGroup,data!AH31,data!AH63,data!AH95))","v":3.5999999999999997E-2}]
[null,null,{"$f":"data!B32","v":"Spain"},{"$f":"IF(ISBLANK(CHOOSE(mySelectedAgeGroup,data!D32,data!D64,data!D96)),\"\",CHOOSE(mySelectedAgeGroup,data!D32,data!D64,data!D96))","v":0.11699999999999999},{"$f":"IF(ISBLANK(CHOOSE(mySelectedAgeGroup,data!E32,data!E64,data!E96)),\"\",CHOOSE(mySelectedAgeGroup,data!E32,data!E64,data!E96))","v":0.122},{"$f":"IF(ISBLANK(CHOOSE(mySelectedAgeGroup,data!F32,data!F64,data!F96)),\"\",CHOOSE(mySelectedAgeGroup,data!F32,data!F64,data!F96))","v":0.13600000000000001},{"$f":"IF(ISBLANK(CHOOSE(mySelectedAgeGroup,data!G32,data!G64,data!G96)),\"\",CHOOSE(mySelectedAgeGroup,data!G32,data!G64,data!G96))","v":0.16600000000000001},{"$f":"IF(ISBLANK(CHOOSE(mySelectedAgeGroup,data!H32,data!H64,data!H96)),\"\",CHOOSE(mySelectedAgeGroup,data!H32,data!H64,data!H96))","v":0.17899999999999999},{"$f":"IF(ISBLANK(CHOOSE(mySelectedAgeGroup,data!I32,data!I64,data!I96)),\"\",CHOOSE(mySelectedAgeGroup,data!I32,data!I64,data!I96))","v":0.19},{"$f":"IF(ISBLANK(CHOOSE(mySelectedAgeGroup,data!J32,data!J64,data!J96)),\"\",CHOOSE(mySelectedAgeGroup,data!J32,data!J64,data!J96))","v":0.184},{"$f":"IF(ISBLANK(CHOOSE(mySelectedAgeGroup,data!K32,data!K64,data!K96)),\"\",CHOOSE(mySelectedAgeGroup,data!K32,data!K64,data!K96))","v":0.17300000000000001},{"$f":"IF(ISBLANK(CHOOSE(mySelectedAgeGroup,data!L32,data!L64,data!L96)),\"\",CHOOSE(mySelectedAgeGroup,data!L32,data!L64,data!L96))","v":0.157},{"$f":"IF(ISBLANK(CHOOSE(mySelectedAgeGroup,data!M32,data!M64,data!M96)),\"\",CHOOSE(mySelectedAgeGroup,data!M32,data!M64,data!M96))","v":0.13400000000000001},{"$f":"IF(ISBLANK(CHOOSE(mySelectedAgeGroup,data!N32,data!N64,data!N96)),\"\",CHOOSE(mySelectedAgeGroup,data!N32,data!N64,data!N96))","v":0.11900000000000001},{"$f":"IF(ISBLANK(CHOOSE(mySelectedAgeGroup,data!O32,data!O64,data!O96)),\"\",CHOOSE(mySelectedAgeGroup,data!O32,data!O64,data!O96))","v":8.900000000000001E-2},{"$f":"IF(ISBLANK(CHOOSE(mySelectedAgeGroup,data!P32,data!P64,data!P96)),\"\",CHOOSE(mySelectedAgeGroup,data!P32,data!P64,data!P96))","v":9.8000000000000004E-2},{"$f":"IF(ISBLANK(CHOOSE(mySelectedAgeGroup,data!Q32,data!Q64,data!Q96)),\"\",CHOOSE(mySelectedAgeGroup,data!Q32,data!Q64,data!Q96))","v":9.9000000000000005E-2},{"$f":"IF(ISBLANK(CHOOSE(mySelectedAgeGroup,data!R32,data!R64,data!R96)),\"\",CHOOSE(mySelectedAgeGroup,data!R32,data!R64,data!R96))","v":9.5000000000000001E-2},{"$f":"IF(ISBLANK(CHOOSE(mySelectedAgeGroup,data!S32,data!S64,data!S96)),\"\",CHOOSE(mySelectedAgeGroup,data!S32,data!S64,data!S96))","v":7.6999999999999999E-2},{"$f":"IF(ISBLANK(CHOOSE(mySelectedAgeGroup,data!T32,data!T64,data!T96)),\"\",CHOOSE(mySelectedAgeGroup,data!T32,data!T64,data!T96))","v":7.2000000000000008E-2},{"$f":"IF(ISBLANK(CHOOSE(mySelectedAgeGroup,data!U32,data!U64,data!U96)),\"\",CHOOSE(mySelectedAgeGroup,data!U32,data!U64,data!U96))","v":7.0000000000000007E-2},{"$f":"IF(ISBLANK(CHOOSE(mySelectedAgeGroup,data!V32,data!V64,data!V96)),\"\",CHOOSE(mySelectedAgeGroup,data!V32,data!V64,data!V96))","v":9.6999999999999989E-2},{"$f":"IF(ISBLANK(CHOOSE(mySelectedAgeGroup,data!W32,data!W64,data!W96)),\"\",CHOOSE(mySelectedAgeGroup,data!W32,data!W64,data!W96))","v":0.157},{"$f":"IF(ISBLANK(CHOOSE(mySelectedAgeGroup,data!X32,data!X64,data!X96)),\"\",CHOOSE(mySelectedAgeGroup,data!X32,data!X64,data!X96))","v":0.17800000000000002},{"$f":"IF(ISBLANK(CHOOSE(mySelectedAgeGroup,data!Y32,data!Y64,data!Y96)),\"\",CHOOSE(mySelectedAgeGroup,data!Y32,data!Y64,data!Y96))","v":0.192},{"$f":"IF(ISBLANK(CHOOSE(mySelectedAgeGroup,data!Z32,data!Z64,data!Z96)),\"\",CHOOSE(mySelectedAgeGroup,data!Z32,data!Z64,data!Z96))","v":0.22500000000000001},{"$f":"IF(ISBLANK(CHOOSE(mySelectedAgeGroup,data!AA32,data!AA64,data!AA96)),\"\",CHOOSE(mySelectedAgeGroup,data!AA32,data!AA64,data!AA96))","v":0.23800000000000002},{"$f":"IF(ISBLANK(CHOOSE(mySelectedAgeGroup,data!AB32,data!AB64,data!AB96)),\"\",CHOOSE(mySelectedAgeGroup,data!AB32,data!AB64,data!AB96))","v":0.223},{"$f":"IF(ISBLANK(CHOOSE(mySelectedAgeGroup,data!AC32,data!AC64,data!AC96)),\"\",CHOOSE(mySelectedAgeGroup,data!AC32,data!AC64,data!AC96))","v":0.20199999999999999},{"$f":"IF(ISBLANK(CHOOSE(mySelectedAgeGroup,data!AD32,data!AD64,data!AD96)),\"\",CHOOSE(mySelectedAgeGroup,data!AD32,data!AD64,data!AD96))","v":0.17899999999999999},{"$f":"IF(ISBLANK(CHOOSE(mySelectedAgeGroup,data!AE32,data!AE64,data!AE96)),\"\",CHOOSE(mySelectedAgeGroup,data!AE32,data!AE64,data!AE96))","v":0.157},{"$f":"IF(ISBLANK(CHOOSE(mySelectedAgeGroup,data!AF32,data!AF64,data!AF96)),\"\",CHOOSE(mySelectedAgeGroup,data!AF32,data!AF64,data!AF96))","v":0.13900000000000001},{"$f":"IF(ISBLANK(CHOOSE(mySelectedAgeGroup,data!AG32,data!AG64,data!AG96)),\"\",CHOOSE(mySelectedAgeGroup,data!AG32,data!AG64,data!AG96))","v":0.128},{"$f":"IF(ISBLANK(CHOOSE(mySelectedAgeGroup,data!AH32,data!AH64,data!AH96)),\"\",CHOOSE(mySelectedAgeGroup,data!AH32,data!AH64,data!AH96))","v":0.13600000000000001}]
[null,null,{"$f":"data!B33","v":"Sweden"},{"$f":"IF(ISBLANK(CHOOSE(mySelectedAgeGroup,data!D33,data!D65,data!D97)),\"\",CHOOSE(mySelectedAgeGroup,data!D33,data!D65,data!D97))","v":1.2E-2},{"$f":"IF(ISBLANK(CHOOSE(mySelectedAgeGroup,data!E33,data!E65,data!E97)),\"\",CHOOSE(mySelectedAgeGroup,data!E33,data!E65,data!E97))","v":2.3E-2},{"$f":"IF(ISBLANK(CHOOSE(mySelectedAgeGroup,data!F33,data!F65,data!F97)),\"\",CHOOSE(mySelectedAgeGroup,data!F33,data!F65,data!F97))","v":4.4000000000000004E-2},{"$f":"IF(ISBLANK(CHOOSE(mySelectedAgeGroup,data!G33,data!G65,data!G97)),\"\",CHOOSE(mySelectedAgeGroup,data!G33,data!G65,data!G97))","v":7.2000000000000008E-2},{"$f":"IF(ISBLANK(CHOOSE(mySelectedAgeGroup,data!H33,data!H65,data!H97)),\"\",CHOOSE(mySelectedAgeGroup,data!H33,data!H65,data!H97))","v":7.5999999999999998E-2},{"$f":"IF(ISBLANK(CHOOSE(mySelectedAgeGroup,data!I33,data!I65,data!I97)),\"\",CHOOSE(mySelectedAgeGroup,data!I33,data!I65,data!I97))","v":""},{"$f":"IF(ISBLANK(CHOOSE(mySelectedAgeGroup,data!J33,data!J65,data!J97)),\"\",CHOOSE(mySelectedAgeGroup,data!J33,data!J65,data!J97))","v":8.3000000000000004E-2},{"$f":"IF(ISBLANK(CHOOSE(mySelectedAgeGroup,data!K33,data!K65,data!K97)),\"\",CHOOSE(mySelectedAgeGroup,data!K33,data!K65,data!K97))","v":8.900000000000001E-2},{"$f":"IF(ISBLANK(CHOOSE(mySelectedAgeGroup,data!L33,data!L65,data!L97)),\"\",CHOOSE(mySelectedAgeGroup,data!L33,data!L65,data!L97))","v":7.9000000000000001E-2},{"$f":"IF(ISBLANK(CHOOSE(mySelectedAgeGroup,data!M33,data!M65,data!M97)),\"\",CHOOSE(mySelectedAgeGroup,data!M33,data!M65,data!M97))","v":6.5000000000000002E-2},{"$f":"IF(ISBLANK(CHOOSE(mySelectedAgeGroup,data!N33,data!N65,data!N97)),\"\",CHOOSE(mySelectedAgeGroup,data!N33,data!N65,data!N97))","v":4.9000000000000002E-2},{"$f":"IF(ISBLANK(CHOOSE(mySelectedAgeGroup,data!O33,data!O65,data!O97)),\"\",CHOOSE(mySelectedAgeGroup,data!O33,data!O65,data!O97))","v":0.04},{"$f":"IF(ISBLANK(CHOOSE(mySelectedAgeGroup,data!P33,data!P65,data!P97)),\"\",CHOOSE(mySelectedAgeGroup,data!P33,data!P65,data!P97))","v":4.0999999999999995E-2},{"$f":"IF(ISBLANK(CHOOSE(mySelectedAgeGroup,data!Q33,data!Q65,data!Q97)),\"\",CHOOSE(mySelectedAgeGroup,data!Q33,data!Q65,data!Q97))","v":4.7E-2},{"$f":"IF(ISBLANK(CHOOSE(mySelectedAgeGroup,data!R33,data!R65,data!R97)),\"\",CHOOSE(mySelectedAgeGroup,data!R33,data!R65,data!R97))","v":5.2000000000000005E-2},{"$f":"IF(ISBLANK(CHOOSE(mySelectedAgeGroup,data!S33,data!S65,data!S97)),\"\",CHOOSE(mySelectedAgeGroup,data!S33,data!S65,data!S97))","v":5.5999999999999994E-2},{"$f":"IF(ISBLANK(CHOOSE(mySelectedAgeGroup,data!T33,data!T65,data!T97)),\"\",CHOOSE(mySelectedAgeGroup,data!T33,data!T65,data!T97))","v":0.05},{"$f":"IF(ISBLANK(CHOOSE(mySelectedAgeGroup,data!U33,data!U65,data!U97)),\"\",CHOOSE(mySelectedAgeGroup,data!U33,data!U65,data!U97))","v":4.2999999999999997E-2},{"$f":"IF(ISBLANK(CHOOSE(mySelectedAgeGroup,data!V33,data!V65,data!V97)),\"\",CHOOSE(mySelectedAgeGroup,data!V33,data!V65,data!V97))","v":4.0999999999999995E-2},{"$f":"IF(ISBLANK(CHOOSE(mySelectedAgeGroup,data!W33,data!W65,data!W97)),\"\",CHOOSE(mySelectedAgeGroup,data!W33,data!W65,data!W97))","v":5.9000000000000004E-2},{"$f":"IF(ISBLANK(CHOOSE(mySelectedAgeGroup,data!X33,data!X65,data!X97)),\"\",CHOOSE(mySelectedAgeGroup,data!X33,data!X65,data!X97))","v":6.2E-2},{"$f":"IF(ISBLANK(CHOOSE(mySelectedAgeGroup,data!Y33,data!Y65,data!Y97)),\"\",CHOOSE(mySelectedAgeGroup,data!Y33,data!Y65,data!Y97))","v":5.5E-2},{"$f":"IF(ISBLANK(CHOOSE(mySelectedAgeGroup,data!Z33,data!Z65,data!Z97)),\"\",CHOOSE(mySelectedAgeGroup,data!Z33,data!Z65,data!Z97))","v":5.7000000000000002E-2},{"$f":"IF(ISBLANK(CHOOSE(mySelectedAgeGroup,data!AA33,data!AA65,data!AA97)),\"\",CHOOSE(mySelectedAgeGroup,data!AA33,data!AA65,data!AA97))","v":5.7000000000000002E-2},{"$f":"IF(ISBLANK(CHOOSE(mySelectedAgeGroup,data!AB33,data!AB65,data!AB97)),\"\",CHOOSE(mySelectedAgeGroup,data!AB33,data!AB65,data!AB97))","v":5.7000000000000002E-2},{"$f":"IF(ISBLANK(CHOOSE(mySelectedAgeGroup,data!AC33,data!AC65,data!AC97)),\"\",CHOOSE(mySelectedAgeGroup,data!AC33,data!AC65,data!AC97))","v":5.5999999999999994E-2},{"$f":"IF(ISBLANK(CHOOSE(mySelectedAgeGroup,data!AD33,data!AD65,data!AD97)),\"\",CHOOSE(mySelectedAgeGroup,data!AD33,data!AD65,data!AD97))","v":5.2999999999999999E-2},{"$f":"IF(ISBLANK(CHOOSE(mySelectedAgeGroup,data!AE33,data!AE65,data!AE97)),\"\",CHOOSE(mySelectedAgeGroup,data!AE33,data!AE65,data!AE97))","v":5.2000000000000005E-2},{"$f":"IF(ISBLANK(CHOOSE(mySelectedAgeGroup,data!AF33,data!AF65,data!AF97)),\"\",CHOOSE(mySelectedAgeGroup,data!AF33,data!AF65,data!AF97))","v":4.9000000000000002E-2},{"$f":"IF(ISBLANK(CHOOSE(mySelectedAgeGroup,data!AG33,data!AG65,data!AG97)),\"\",CHOOSE(mySelectedAgeGroup,data!AG33,data!AG65,data!AG97))","v":5.0999999999999997E-2},{"$f":"IF(ISBLANK(CHOOSE(mySelectedAgeGroup,data!AH33,data!AH65,data!AH97)),\"\",CHOOSE(mySelectedAgeGroup,data!AH33,data!AH65,data!AH97))","v":5.3999999999999999E-2}]
[null,null,{"$f":"data!B34","v":"United Kingdom"},{"$f":"IF(ISBLANK(CHOOSE(mySelectedAgeGroup,data!D34,data!D66,data!D98)),\"\",CHOOSE(mySelectedAgeGroup,data!D34,data!D66,data!D98))","v":0.06},{"$f":"IF(ISBLANK(CHOOSE(mySelectedAgeGroup,data!E34,data!E66,data!E98)),\"\",CHOOSE(mySelectedAgeGroup,data!E34,data!E66,data!E98))","v":7.2999999999999995E-2},{"$f":"IF(ISBLANK(CHOOSE(mySelectedAgeGroup,data!F34,data!F66,data!F98)),\"\",CHOOSE(mySelectedAgeGroup,data!F34,data!F66,data!F98))","v":8.3000000000000004E-2},{"$f":"IF(ISBLANK(CHOOSE(mySelectedAgeGroup,data!G34,data!G66,data!G98)),\"\",CHOOSE(mySelectedAgeGroup,data!G34,data!G66,data!G98))","v":8.5999999999999993E-2},{"$f":"IF(ISBLANK(CHOOSE(mySelectedAgeGroup,data!H34,data!H66,data!H98)),\"\",CHOOSE(mySelectedAgeGroup,data!H34,data!H66,data!H98))","v":7.9000000000000001E-2},{"$f":"IF(ISBLANK(CHOOSE(mySelectedAgeGroup,data!I34,data!I66,data!I98)),\"\",CHOOSE(mySelectedAgeGroup,data!I34,data!I66,data!I98))","v":7.2999999999999995E-2},{"$f":"IF(ISBLANK(CHOOSE(mySelectedAgeGroup,data!J34,data!J66,data!J98)),\"\",CHOOSE(mySelectedAgeGroup,data!J34,data!J66,data!J98))","v":6.7000000000000004E-2},{"$f":"IF(ISBLANK(CHOOSE(mySelectedAgeGroup,data!K34,data!K66,data!K98)),\"\",CHOOSE(mySelectedAgeGroup,data!K34,data!K66,data!K98))","v":5.7999999999999996E-2},{"$f":"IF(ISBLANK(CHOOSE(mySelectedAgeGroup,data!L34,data!L66,data!L98)),\"\",CHOOSE(mySelectedAgeGroup,data!L34,data!L66,data!L98))","v":5.0999999999999997E-2},{"$f":"IF(ISBLANK(CHOOSE(mySelectedAgeGroup,data!M34,data!M66,data!M98)),\"\",CHOOSE(mySelectedAgeGroup,data!M34,data!M66,data!M98))","v":4.8000000000000001E-2},{"$f":"IF(ISBLANK(CHOOSE(mySelectedAgeGroup,data!N34,data!N66,data!N98)),\"\",CHOOSE(mySelectedAgeGroup,data!N34,data!N66,data!N98))","v":4.2999999999999997E-2},{"$f":"IF(ISBLANK(CHOOSE(mySelectedAgeGroup,data!O34,data!O66,data!O98)),\"\",CHOOSE(mySelectedAgeGroup,data!O34,data!O66,data!O98))","v":3.7999999999999999E-2},{"$f":"IF(ISBLANK(CHOOSE(mySelectedAgeGroup,data!P34,data!P66,data!P98)),\"\",CHOOSE(mySelectedAgeGroup,data!P34,data!P66,data!P98))","v":3.9E-2},{"$f":"IF(ISBLANK(CHOOSE(mySelectedAgeGroup,data!Q34,data!Q66,data!Q98)),\"\",CHOOSE(mySelectedAgeGroup,data!Q34,data!Q66,data!Q98))","v":3.7000000000000005E-2},{"$f":"IF(ISBLANK(CHOOSE(mySelectedAgeGroup,data!R34,data!R66,data!R98)),\"\",CHOOSE(mySelectedAgeGroup,data!R34,data!R66,data!R98))","v":3.4000000000000002E-2},{"$f":"IF(ISBLANK(CHOOSE(mySelectedAgeGroup,data!S34,data!S66,data!S98)),\"\",CHOOSE(mySelectedAgeGroup,data!S34,data!S66,data!S98))","v":3.3000000000000002E-2},{"$f":"IF(ISBLANK(CHOOSE(mySelectedAgeGroup,data!T34,data!T66,data!T98)),\"\",CHOOSE(mySelectedAgeGroup,data!T34,data!T66,data!T98))","v":3.7999999999999999E-2},{"$f":"IF(ISBLANK(CHOOSE(mySelectedAgeGroup,data!U34,data!U66,data!U98)),\"\",CHOOSE(mySelectedAgeGroup,data!U34,data!U66,data!U98))","v":3.6000000000000004E-2},{"$f":"IF(ISBLANK(CHOOSE(mySelectedAgeGroup,data!V34,data!V66,data!V98)),\"\",CHOOSE(mySelectedAgeGroup,data!V34,data!V66,data!V98))","v":3.9E-2},{"$f":"IF(ISBLANK(CHOOSE(mySelectedAgeGroup,data!W34,data!W66,data!W98)),\"\",CHOOSE(mySelectedAgeGroup,data!W34,data!W66,data!W98))","v":5.5999999999999994E-2},{"$f":"IF(ISBLANK(CHOOSE(mySelectedAgeGroup,data!X34,data!X66,data!X98)),\"\",CHOOSE(mySelectedAgeGroup,data!X34,data!X66,data!X98))","v":5.7999999999999996E-2},{"$f":"IF(ISBLANK(CHOOSE(mySelectedAgeGroup,data!Y34,data!Y66,data!Y98)),\"\",CHOOSE(mySelectedAgeGroup,data!Y34,data!Y66,data!Y98))","v":5.7999999999999996E-2},{"$f":"IF(ISBLANK(CHOOSE(mySelectedAgeGroup,data!Z34,data!Z66,data!Z98)),\"\",CHOOSE(mySelectedAgeGroup,data!Z34,data!Z66,data!Z98))","v":5.7000000000000002E-2},{"$f":"IF(ISBLANK(CHOOSE(mySelectedAgeGroup,data!AA34,data!AA66,data!AA98)),\"\",CHOOSE(mySelectedAgeGroup,data!AA34,data!AA66,data!AA98))","v":5.4000000000000006E-2},{"$f":"IF(ISBLANK(CHOOSE(mySelectedAgeGroup,data!AB34,data!AB66,data!AB98)),\"\",CHOOSE(mySelectedAgeGroup,data!AB34,data!AB66,data!AB98))","v":4.4000000000000004E-2},{"$f":"IF(ISBLANK(CHOOSE(mySelectedAgeGroup,data!AC34,data!AC66,data!AC98)),\"\",CHOOSE(mySelectedAgeGroup,data!AC34,data!AC66,data!AC98))","v":3.7999999999999999E-2},{"$f":"IF(ISBLANK(CHOOSE(mySelectedAgeGroup,data!AD34,data!AD66,data!AD98)),\"\",CHOOSE(mySelectedAgeGroup,data!AD34,data!AD66,data!AD98))","v":3.6000000000000004E-2},{"$f":"IF(ISBLANK(CHOOSE(mySelectedAgeGroup,data!AE34,data!AE66,data!AE98)),\"\",CHOOSE(mySelectedAgeGroup,data!AE34,data!AE66,data!AE98))","v":3.2000000000000001E-2},{"$f":"IF(ISBLANK(CHOOSE(mySelectedAgeGroup,data!AF34,data!AF66,data!AF98)),\"\",CHOOSE(mySelectedAgeGroup,data!AF34,data!AF66,data!AF98))","v":0.03},{"$f":"IF(ISBLANK(CHOOSE(mySelectedAgeGroup,data!AG34,data!AG66,data!AG98)),\"\",CHOOSE(mySelectedAgeGroup,data!AG34,data!AG66,data!AG98))","v":2.7000000000000003E-2},{"$f":"IF(ISBLANK(CHOOSE(mySelectedAgeGroup,data!AH34,data!AH66,data!AH98)),\"\",CHOOSE(mySelectedAgeGroup,data!AH34,data!AH66,data!AH98))","v":2.8000000000000001E-2}]
[]
[null,"Current selections"]
[]
[null,null,"Selected country",{"$f":"INDEX($C$7:$C$34,control!$C$9,1)","v":"Spain"}]
[null,null,"Shape name",{"$f":"INDEX(myShapeNames,control!$C$9,1)","v":"S_ESP"}]
[null,null,"Selected year",{"$f":"INDEX($D$6:$AH$6,1,mySelectedYear)","v":"2019-01-01"}]
[]
[null,"Sorted Bar Chart"]
[]
[null,"#","Country",{"$f":"$D$40","v":"2019-01-01"},{"$f":"$D$40","v":"2019-01-01"},"Sort Dummy","Sort Pos","Sort Country","Sort Value","Selected","Others"]
[null,1,{"$f":"C7","v":"Austria"},{"$f":"INDEX($D7:$AH7,1,mySelectedYear)","v":0.04},{"$f":"IF(D45=\"\",0,D45)","v":0.04},{"$f":"E45+B45/100000000","v":4.0000010000000003E-2},{"$f":"MATCH(LARGE($F$45:$F$72,B45),$F$45:$F$72,0)","v":12},{"$f":"INDEX($C$45:$C$72,$G45,1)","v":"Greece"},{"$f":"INDEX($E$45:$E$72,$G45,1)","v":0.16399999999999998},{"$f":"IF($H45=$D$38,$I45,0)","v":0},{"$f":"IF($H45<>$D$38,$I45,0)","v":0.16399999999999998}]
[null,2,"Belgium",4.5999999999999999E-2,{"$f":"IF(D46=\"\",0,D46)","v":4.5999999999999999E-2},4.6000020000000003E-2,26,{"$f":"INDEX($C$45:$C$72,G46,1)","v":"Spain"},0.128,0.128,0]
[null,3,"Bulgaria",0.04,0.04,4.0000029999999999E-2,15,"Italy",8.8000000000000009E-2,0,8.8000000000000009E-2]
[null,4,"Croatia",5.7000000000000002E-2,5.7000000000000002E-2,5.7000040000000002E-2,10,"France",7.2999999999999995E-2,0,7.2999999999999995E-2]
[null,5,"Cyprus",6.3E-2,6.3E-2,6.3000050000000002E-2,5,"Cyprus",6.3E-2,0,6.3E-2]
[null,6,"Czech Republic",1.8000000000000002E-2,1.8000000000000002E-2,1.8000060000000002E-2,16,"Latvia",5.9000000000000004E-2,0,5.9000000000000004E-2]
[null,7,"Denmark",4.2000000000000003E-2,4.2000000000000003E-2,4.200007E-2,17,"Lithuania",5.7999999999999996E-2,0,5.7999999999999996E-2]
[null,8,"Estonia",3.9E-2,3.9E-2,3.9000079999999999E-2,4,"Croatia",5.7000000000000002E-2,0,5.7000000000000002E-2]
[null,9,"Finland",5.2999999999999999E-2,5.2999999999999999E-2,5.300009E-2,22,"Portugal",5.5999999999999994E-2,0,5.5999999999999994E-2]
[null,10,"France",7.2999999999999995E-2,7.2999999999999995E-2,7.3000099999999998E-2,9,"Finland",5.2999999999999999E-2,0,5.2999999999999999E-2]
[null,11,"Germany",2.8999999999999998E-2,2.8999999999999998E-2,2.9000109999999999E-2,27,"Sweden",5.0999999999999997E-2,0,5.0999999999999997E-2]
[null,12,"Greece",0.16399999999999998,0.16399999999999998,0.16400011999999997,24,"Slovakia",5.0999999999999997E-2,0,5.0999999999999997E-2]
[null,13,"Hungary",2.7999999999999997E-2,2.7999999999999997E-2,2.8000129999999998E-2,18,"Luxembourg",4.5999999999999999E-2,0,4.5999999999999999E-2]
[null,14,"Ireland",0.04,0.04,4.0000140000000003E-2,2,"Belgium",4.5999999999999999E-2,0,4.5999999999999999E-2]
[null,15,"Italy",8.8000000000000009E-2,8.8000000000000009E-2,8.8000150000000013E-2,25,"Slovenia",4.2000000000000003E-2,0,4.2000000000000003E-2]
[null,16,"Latvia",5.9000000000000004E-2,5.9000000000000004E-2,5.9000160000000003E-2,7,"Denmark",4.2000000000000003E-2,0,4.2000000000000003E-2]
[null,17,"Lithuania",5.7999999999999996E-2,5.7999999999999996E-2,5.8000169999999997E-2,14,"Ireland",0.04,0,0.04]
[null,18,"Luxembourg",4.5999999999999999E-2,4.5999999999999999E-2,4.6000180000000002E-2,3,"Bulgaria",0.04,0,0.04]
[null,19,"Malta",2.6000000000000002E-2,2.6000000000000002E-2,2.6000190000000003E-2,1,"Austria",0.04,0,0.04]
[null,20,"Netherlands",2.7999999999999997E-2,2.7999999999999997E-2,2.8000199999999996E-2,8,"Estonia",3.9E-2,0,3.9E-2]
[null,21,"Poland",2.7999999999999997E-2,2.7999999999999997E-2,2.8000209999999998E-2,23,"Romania",0.03,0,0.03]
[null,22,"Portugal",5.5999999999999994E-2,5.5999999999999994E-2,5.6000219999999996E-2,11,"Germany",2.8999999999999998E-2,0,2.8999999999999998E-2]
[null,23,"Romania",0.03,0.03,3.0000229999999999E-2,21,"Poland",2.7999999999999997E-2,0,2.7999999999999997E-2]
[null,24,"Slovakia",5.0999999999999997E-2,5.0999999999999997E-2,5.1000239999999995E-2,20,"Netherlands",2.7999999999999997E-2,0,2.7999999999999997E-2]
[null,25,"Slovenia",4.2000000000000003E-2,4.2000000000000003E-2,4.2000250000000003E-2,13,"Hungary",2.7999999999999997E-2,0,2.7999999999999997E-2]
[null,26,"Spain",0.128,0.128,0.12800026,28,"United Kingdom",2.7000000000000003E-2,0,2.7000000000000003E-2]
[null,27,"Sweden",5.0999999999999997E-2,5.0999999999999997E-2,5.1000269999999993E-2,19,"Malta",2.6000000000000002E-2,0,2.6000000000000002E-2]
[null,28,"United Kingdom",2.7000000000000003E-2,2.7000000000000003E-2,2.7000280000000002E-2,6,"Czech Republic",1.8000000000000002E-2,0,1.8000000000000002E-2]
[]
[null,"Band Chart"]
[]
[null,null,"Country",{"$f":"D6","v":"1990-01-01"},"1991-01-01","1992-01-01","1993-01-01","1994-01-01","1995-01-01","1996-01-01","1997-01-01","1998-01-01","1999-01-01","2000-01-01","2001-01-01","2002-01-01","2003-01-01","2004-01-01","2005-01-01","2006-01-01","2007-01-01","2008-01-01","2009-01-01","2010-01-01","2011-01-01","2012-01-01","2013-01-01","2014-01-01",{"$f":"AC6","v":"2015-01-01"},"2016-01-01","2017-01-01","2018-01-01","2019-01-01","2020-01-01"]
[null,null,{"$f":"$D$38","v":"Spain"},{"$f":"IF(INDEX(D$7:D$34,mySelectedCountry,1)=\"\",NA(),INDEX(D$7:D$34,mySelectedCountry,1))","v":0.11699999999999999},0.122,0.13600000000000001,0.16600000000000001,0.17899999999999999,0.19,0.184,0.17300000000000001,0.157,0.13400000000000001,0.11900000000000001,8.900000000000001E-2,9.8000000000000004E-2,9.9000000000000005E-2,9.5000000000000001E-2,7.6999999999999999E-2,7.2000000000000008E-2,7.0000000000000007E-2,9.6999999999999989E-2,0.157,0.17800000000000002,0.192,0.22500000000000001,0.23800000000000002,0.223,0.20199999999999999,0.17899999999999999,0.157,0.13900000000000001,0.128,0.13600000000000001]
[null,null,"Min",{"$f":"MIN(D$7:D$34)","v":1.2E-2},{"$f":"MIN(E$7:E$34)","v":1.3999999999999999E-2},1.8000000000000002E-2,2.2000000000000002E-2,2.6000000000000002E-2,2.3E-2,2.3E-2,0.02,2.1000000000000001E-2,1.9E-2,1.9E-2,1.8000000000000002E-2,2.3E-2,3.1E-2,3.4000000000000002E-2,3.3000000000000002E-2,3.2000000000000001E-2,3.2000000000000001E-2,2.6000000000000002E-2,3.2000000000000001E-2,3.7000000000000005E-2,3.9E-2,4.2000000000000003E-2,4.7E-2,4.4000000000000004E-2,3.7999999999999999E-2,3.5000000000000003E-2,2.6000000000000002E-2,0.02,1.8000000000000002E-2,1.7000000000000001E-2]
[null,null,"Max",{"$f":"MAX(D$7:D$34)","v":0.11699999999999999},{"$f":"MAX(E$7:E$34)","v":0.126},0.13600000000000001,0.16600000000000001,0.17899999999999999,0.19,0.184,0.17300000000000001,0.157,0.13400000000000001,0.153,0.17899999999999999,0.16500000000000001,0.16300000000000001,0.161,0.151,0.11800000000000001,0.1,9.6999999999999989E-2,0.157,0.17800000000000002,0.192,0.22500000000000001,0.254,0.248,0.23399999999999999,0.222,0.20199999999999999,0.182,0.16399999999999998,0.16]
[null,null,"Average (unweighted)",{"$f":"IFERROR(AVERAGE(D$7:D$34),NA())","v":5.4545454545454557E-2},{"$f":"IFERROR(AVERAGE(E$7:E$34),NA())","v":6.0416666666666667E-2},6.9769230769230778E-2,7.9857142857142877E-2,7.9466666666666658E-2,7.7000000000000013E-2,7.9785714285714279E-2,7.8E-2,7.3039999999999994E-2,7.3119999999999991E-2,7.7407407407407397E-2,7.485185185185185E-2,7.4481481481481482E-2,7.3142857142857148E-2,7.4285714285714274E-2,7.0357142857142854E-2,6.2535714285714292E-2,5.4571428571428583E-2,5.2928571428571422E-2,7.514285714285715E-2,8.6821428571428536E-2,8.6750000000000008E-2,9.342857142857143E-2,9.7035714285714267E-2,9.1857142857142846E-2,8.478571428571427E-2,7.6214285714285707E-2,6.667857142857142E-2,5.753571428571428E-2,5.1785714285714289E-2,5.417857142857143E-2]
[null,null,"Range",{"$f":"IF(INDEX(D$7:D$34,mySelectedCountry,1)=\"\",NA(),D79-D78)","v":0.105},0.112,0.11800000000000001,0.14400000000000002,0.153,0.16700000000000001,0.161,0.15300000000000002,0.13600000000000001,0.115,0.13400000000000001,0.16099999999999998,0.14200000000000002,0.13200000000000001,0.127,0.11799999999999999,8.6000000000000007E-2,6.8000000000000005E-2,7.099999999999998E-2,0.125,0.14100000000000001,0.153,0.183,0.20700000000000002,0.20399999999999999,0.19599999999999998,0.187,0.17599999999999999,0.16200000000000001,0.14599999999999996,0.14300000000000002]
[null,null,"Selected Year",{"$f":"IF(D76=$D$40,$D$83,NA())","v":{"$error":"#N/A"}},{"$error":"#N/A"},{"$error":"#N/A"},{"$error":"#N/A"},{"$error":"#N/A"},{"$error":"#N/A"},{"$error":"#N/A"},{"$error":"#N/A"},{"$error":"#N/A"},{"$error":"#N/A"},{"$error":"#N/A"},{"$error":"#N/A"},{"$error":"#N/A"},{"$error":"#N/A"},{"$error":"#N/A"},{"$error":"#N/A"},{"$error":"#N/A"},{"$error":"#N/A"},{"$error":"#N/A"},{"$error":"#N/A"},{"$error":"#N/A"},{"$error":"#N/A"},{"$error":"#N/A"},{"$error":"#N/A"},{"$error":"#N/A"},{"$f":"IF(AC76=$D$40,$D$83,NA())","v":{"$error":"#N/A"}},{"$error":"#N/A"},{"$error":"#N/A"},{"$error":"#N/A"},0.254,{"$error":"#N/A"}]
[null,null,"Max",{"$f":"MAX(D79:AB79)","v":0.254}]
[]
[null,"Line Chart"]
[]
[null,null,"Country",{"$f":"D6","v":"1990-01-01"},"1991-01-01","1992-01-01","1993-01-01","1994-01-01","1995-01-01","1996-01-01","1997-01-01","1998-01-01","1999-01-01","2000-01-01","2001-01-01","2002-01-01","2003-01-01","2004-01-01","2005-01-01","2006-01-01","2007-01-01","2008-01-01","2009-01-01","2010-01-01","2011-01-01","2012-01-01","2013-01-01","2014-01-01",{"$f":"AC6","v":"2015-01-01"},"2016-01-01","2017-01-01","2018-01-01","2019-01-01","2020-01-01"]
[null,null,{"$f":"C7","v":"Austria"},{"$f":"IF(OR($C88=$D$38,D7=\"\"),NA(),D7)","v":{"$error":"#N/A"}},{"$error":"#N/A"},{"$error":"#N/A"},{"$error":"#N/A"},3.5000000000000003E-2,3.9E-2,4.2999999999999997E-2,4.2000000000000003E-2,4.0999999999999995E-2,3.5000000000000003E-2,3.3000000000000002E-2,3.3000000000000002E-2,3.6000000000000004E-2,3.9E-2,4.7E-2,4.7E-2,4.4999999999999998E-2,4.0999999999999995E-2,3.4000000000000002E-2,4.4000000000000004E-2,4.0999999999999995E-2,3.9E-2,4.2000000000000003E-2,4.7E-2,4.9000000000000002E-2,{"$f":"IF(OR($C88=$D$38,AC7=\"\"),NA(),AC7)","v":0.05},5.2999999999999999E-2,4.9000000000000002E-2,4.2999999999999997E-2,0.04,4.4999999999999998E-2]
[null,null,"Belgium",{"$f":"IF(OR($C89=$D$38,D8=\"\"),NA(),D8)","v":5.4000000000000006E-2},5.4000000000000006E-2,0.06,7.0999999999999994E-2,8.1000000000000003E-2,8.1000000000000003E-2,8.199999999999999E-2,7.9000000000000001E-2,0.08,7.2000000000000008E-2,5.9000000000000004E-2,5.4000000000000006E-2,6.4000000000000001E-2,6.7000000000000004E-2,7.0000000000000007E-2,7.0999999999999994E-2,7.0000000000000007E-2,6.3E-2,5.9000000000000004E-2,6.6000000000000003E-2,7.0000000000000007E-2,0.06,6.4000000000000001E-2,7.0999999999999994E-2,7.2999999999999995E-2,{"$f":"IF(OR($C89=$D$38,AC8=\"\"),NA(),AC8)","v":7.2999999999999995E-2},6.8000000000000005E-2,6.0999999999999999E-2,5.2000000000000005E-2,4.5999999999999999E-2,4.4999999999999998E-2]
[null,null,"Bulgaria",{"$f":"IF(OR($C90=$D$38,D9=\"\"),NA(),D9)","v":{"$error":"#N/A"}},{"$error":"#N/A"},{"$error":"#N/A"},{"$error":"#N/A"},{"$error":"#N/A"},{"$error":"#N/A"},{"$error":"#N/A"},{"$error":"#N/A"},{"$error":"#N/A"},{"$error":"#N/A"},0.14800000000000002,0.17899999999999999,0.161,0.122,0.107,8.900000000000001E-2,7.9000000000000001E-2,6.0999999999999999E-2,0.05,0.06,9.1999999999999998E-2,0.10099999999999999,0.11,0.11800000000000001,0.107,{"$f":"IF(OR($C90=$D$38,AC9=\"\"),NA(),AC9)","v":8.4000000000000005E-2},7.0999999999999994E-2,5.7999999999999996E-2,4.9000000000000002E-2,0.04,4.3999999999999997E-2]
[null,null,"Croatia",{"$f":"IF(OR($C91=$D$38,D10=\"\"),NA(),D10)","v":{"$error":"#N/A"}},{"$error":"#N/A"},{"$error":"#N/A"},{"$error":"#N/A"},{"$error":"#N/A"},{"$error":"#N/A"},{"$error":"#N/A"},{"$error":"#N/A"},{"$error":"#N/A"},{"$error":"#N/A"},0.125,0.128,0.11900000000000001,0.113,0.111,0.10300000000000001,9.1999999999999998E-2,8.199999999999999E-2,6.9000000000000006E-2,7.4999999999999997E-2,9.5000000000000001E-2,0.11599999999999999,0.13699999999999998,0.14400000000000002,0.14599999999999999,{"$f":"IF(OR($C91=$D$38,AC10=\"\"),NA(),AC10)","v":0.13800000000000001},0.11199999999999999,9.6000000000000002E-2,7.0000000000000007E-2,5.7000000000000002E-2,6.3E-2]
[null,null,"Cyprus",{"$f":"IF(OR($C92=$D$38,D11=\"\"),NA(),D11)","v":{"$error":"#N/A"}},{"$error":"#N/A"},{"$error":"#N/A"},{"$error":"#N/A"},{"$error":"#N/A"},{"$error":"#N/A"},{"$error":"#N/A"},4.2000000000000003E-2,4.2999999999999997E-2,4.4999999999999998E-2,4.2000000000000003E-2,3.4000000000000002E-2,3.1E-2,3.7000000000000005E-2,4.0999999999999995E-2,4.2999999999999997E-2,3.9E-2,3.3000000000000002E-2,3.1E-2,4.4000000000000004E-2,5.0999999999999997E-2,6.4000000000000001E-2,0.10199999999999999,0.13600000000000001,0.14000000000000001,{"$f":"IF(OR($C92=$D$38,AC11=\"\"),NA(),AC11)","v":0.13200000000000001},0.115,9.9000000000000005E-2,7.2999999999999995E-2,6.3E-2,6.6000000000000003E-2]
[null,null,"Czech Republic",{"$f":"IF(OR($C93=$D$38,D12=\"\"),NA(),D12)","v":{"$error":"#N/A"}},{"$error":"#N/A"},{"$error":"#N/A"},3.5000000000000003E-2,3.4000000000000002E-2,{"$error":"#N/A"},{"$error":"#N/A"},{"$error":"#N/A"},5.2999999999999999E-2,7.2000000000000008E-2,7.400000000000001E-2,6.9000000000000006E-2,6.2E-2,6.6000000000000003E-2,7.0000000000000007E-2,6.8000000000000005E-2,6.2E-2,4.8000000000000001E-2,3.9E-2,5.7999999999999996E-2,6.4000000000000001E-2,5.9000000000000004E-2,0.06,6.0999999999999999E-2,5.4000000000000006E-2,{"$f":"IF(OR($C93=$D$38,AC12=\"\"),NA(),AC12)","v":4.4999999999999998E-2},3.5000000000000003E-2,2.6000000000000002E-2,0.02,1.8000000000000002E-2,1.7000000000000001E-2]
[null,null,"Denmark",{"$f":"IF(OR($C94=$D$38,D13=\"\"),NA(),D13)","v":6.4000000000000001E-2},7.2000000000000008E-2,7.9000000000000001E-2,8.900000000000001E-2,7.2000000000000008E-2,6.6000000000000003E-2,6.0999999999999999E-2,5.0999999999999997E-2,4.9000000000000002E-2,4.9000000000000002E-2,4.2999999999999997E-2,0.04,4.0999999999999995E-2,4.8000000000000001E-2,5.0999999999999997E-2,4.2000000000000003E-2,3.2000000000000001E-2,3.2000000000000001E-2,2.6000000000000002E-2,5.0999999999999997E-2,6.4000000000000001E-2,6.2E-2,6.4000000000000001E-2,6.0999999999999999E-2,5.7000000000000002E-2,{"$f":"IF(OR($C94=$D$38,AC13=\"\"),NA(),AC13)","v":5.2999999999999999E-2},4.9000000000000002E-2,4.7E-2,4.2000000000000003E-2,4.2000000000000003E-2,0.04]
[null,null,"Estonia",{"$f":"IF(OR($C95=$D$38,D14=\"\"),NA(),D14)","v":{"$error":"#N/A"}},{"$error":"#N/A"},{"$error":"#N/A"},{"$error":"#N/A"},{"$error":"#N/A"},{"$error":"#N/A"},{"$error":"#N/A"},9.1999999999999998E-2,9.1999999999999998E-2,0.113,0.13400000000000001,0.11900000000000001,0.105,0.09,8.4000000000000005E-2,7.2000000000000008E-2,5.2000000000000005E-2,3.9E-2,4.5999999999999999E-2,0.11900000000000001,0.14899999999999999,0.11199999999999999,8.900000000000001E-2,7.5999999999999998E-2,6.7000000000000004E-2,{"$f":"IF(OR($C95=$D$38,AC14=\"\"),NA(),AC14)","v":5.5999999999999994E-2},6.2E-2,5.2000000000000005E-2,4.8000000000000001E-2,3.9E-2,4.5999999999999999E-2]
[null,null,"Finland",{"$f":"IF(OR($C96=$D$38,D15=\"\"),NA(),D15)","v":2.1000000000000001E-2},5.0999999999999997E-2,9.6000000000000002E-2,0.14099999999999999,0.14499999999999999,{"$error":"#N/A"},0.12,0.115,9.8000000000000004E-2,8.5999999999999993E-2,8.1000000000000003E-2,7.5999999999999998E-2,7.400000000000001E-2,7.2000000000000008E-2,7.2000000000000008E-2,6.8000000000000005E-2,6.2E-2,5.4000000000000006E-2,4.9000000000000002E-2,6.4000000000000001E-2,6.6000000000000003E-2,6.0999999999999999E-2,6.0999999999999999E-2,6.5000000000000002E-2,7.0000000000000007E-2,{"$f":"IF(OR($C96=$D$38,AC15=\"\"),NA(),AC15)","v":7.5999999999999998E-2},7.2999999999999995E-2,7.0999999999999994E-2,6.0999999999999999E-2,5.2999999999999999E-2,0.05]
[null,null,"France",{"$f":"IF(OR($C97=$D$38,D16=\"\"),NA(),D16)","v":5.2000000000000005E-2},5.2000000000000005E-2,5.7000000000000002E-2,6.0999999999999999E-2,6.3E-2,{"$error":"#N/A"},{"$error":"#N/A"},{"$error":"#N/A"},{"$error":"#N/A"},{"$error":"#N/A"},{"$error":"#N/A"},{"$error":"#N/A"},{"$error":"#N/A"},7.2999999999999995E-2,7.4999999999999997E-2,7.4999999999999997E-2,7.2999999999999995E-2,6.7000000000000004E-2,6.0999999999999999E-2,7.400000000000001E-2,7.6999999999999999E-2,7.6999999999999999E-2,8.199999999999999E-2,8.8000000000000009E-2,8.900000000000001E-2,{"$f":"IF(OR($C97=$D$38,AC16=\"\"),NA(),AC16)","v":8.900000000000001E-2},8.5000000000000006E-2,8.1000000000000003E-2,7.8E-2,7.2999999999999995E-2,7.2999999999999995E-2]
[null,null,"Germany",{"$f":"IF(OR($C98=$D$38,D17=\"\"),NA(),D17)","v":{"$error":"#N/A"}},5.5E-2,6.6000000000000003E-2,7.6999999999999999E-2,8.4000000000000005E-2,8.3000000000000004E-2,0.09,9.8000000000000004E-2,9.6000000000000002E-2,8.6999999999999994E-2,7.8E-2,0.08,8.5999999999999993E-2,9.6999999999999989E-2,0.105,0.106,9.8000000000000004E-2,8.199999999999999E-2,7.0999999999999994E-2,7.2999999999999995E-2,6.6000000000000003E-2,5.5E-2,5.0999999999999997E-2,4.9000000000000002E-2,4.7E-2,{"$f":"IF(OR($C98=$D$38,AC17=\"\"),NA(),AC17)","v":4.4000000000000004E-2},3.7999999999999999E-2,3.4000000000000002E-2,3.1E-2,2.8999999999999998E-2,3.5999999999999997E-2]
[null,null,"Greece",{"$f":"IF(OR($C99=$D$38,D18=\"\"),NA(),D18)","v":{"$error":"#N/A"}},{"$error":"#N/A"},{"$error":"#N/A"},{"$error":"#N/A"},{"$error":"#N/A"},6.7000000000000004E-2,6.9000000000000006E-2,7.2999999999999995E-2,8.3000000000000004E-2,9.3000000000000013E-2,8.900000000000001E-2,8.5999999999999993E-2,8.4000000000000005E-2,7.9000000000000001E-2,8.8000000000000009E-2,8.4000000000000005E-2,7.4999999999999997E-2,7.2000000000000008E-2,6.6000000000000003E-2,8.4000000000000005E-2,0.11199999999999999,0.159,0.223,0.254,0.248,{"$f":"IF(OR($C99=$D$38,AC18=\"\"),NA(),AC18)","v":0.23399999999999999},0.222,0.20199999999999999,0.182,0.16399999999999998,0.16]
[null,null,"Hungary",{"$f":"IF(OR($C100=$D$38,D19=\"\"),NA(),D19)","v":{"$error":"#N/A"}},{"$error":"#N/A"},{"$error":"#N/A"},{"$error":"#N/A"},{"$error":"#N/A"},{"$error":"#N/A"},{"$error":"#N/A"},7.6999999999999999E-2,7.2999999999999995E-2,0.06,5.4000000000000006E-2,0.05,0.05,0.05,5.2000000000000005E-2,6.0999999999999999E-2,6.5000000000000002E-2,6.5000000000000002E-2,6.9000000000000006E-2,8.8000000000000009E-2,0.1,9.9000000000000005E-2,9.6999999999999989E-2,8.900000000000001E-2,6.7000000000000004E-2,{"$f":"IF(OR($C100=$D$38,AC19=\"\"),NA(),AC19)","v":0.06},4.4999999999999998E-2,3.6000000000000004E-2,3.2000000000000001E-2,2.7999999999999997E-2,3.2000000000000001E-2]
[null,null,"Ireland",{"$f":"IF(OR($C101=$D$38,D20=\"\"),NA(),D20)","v":0.11699999999999999},0.126,0.13,0.13100000000000001,0.122,0.10400000000000001,0.1,8.5999999999999993E-2,6.7000000000000004E-2,0.05,3.7999999999999999E-2,3.3000000000000002E-2,3.7000000000000005E-2,3.7999999999999999E-2,3.7000000000000005E-2,3.7000000000000005E-2,3.7999999999999999E-2,0.04,5.2999999999999999E-2,0.10300000000000001,0.12300000000000001,0.13200000000000001,0.13200000000000001,0.11900000000000001,0.10300000000000001,{"$f":"IF(OR($C101=$D$38,AC20=\"\"),NA(),AC20)","v":8.5999999999999993E-2},7.2000000000000008E-2,5.7000000000000002E-2,4.7E-2,0.04,4.1000000000000002E-2]
[null,null,"Italy",{"$f":"IF(OR($C102=$D$38,D21=\"\"),NA(),D21)","v":{"$error":"#N/A"}},{"$error":"#N/A"},5.5E-2,6.6000000000000003E-2,7.4999999999999997E-2,0.08,8.3000000000000004E-2,8.5999999999999993E-2,8.8000000000000009E-2,8.6999999999999994E-2,8.1000000000000003E-2,7.4999999999999997E-2,7.0999999999999994E-2,6.8000000000000005E-2,6.5000000000000002E-2,6.3E-2,5.5E-2,4.9000000000000002E-2,5.5999999999999994E-2,6.4000000000000001E-2,6.9000000000000006E-2,6.9000000000000006E-2,8.900000000000001E-2,0.10300000000000001,0.107,{"$f":"IF(OR($C102=$D$38,AC21=\"\"),NA(),AC21)","v":0.10099999999999999},0.1,9.8000000000000004E-2,9.3000000000000013E-2,8.8000000000000009E-2,8.6999999999999994E-2]
[null,null,"Latvia",{"$f":"IF(OR($C103=$D$38,D22=\"\"),NA(),D22)","v":{"$error":"#N/A"}},{"$error":"#N/A"},{"$error":"#N/A"},{"$error":"#N/A"},{"$error":"#N/A"},{"$error":"#N/A"},{"$error":"#N/A"},0.124,0.12300000000000001,0.125,0.13200000000000001,0.125,0.114,0.106,0.106,9.3000000000000013E-2,6.0999999999999999E-2,5.4000000000000006E-2,6.9000000000000006E-2,0.154,0.17399999999999999,0.14599999999999999,0.13600000000000001,0.107,0.1,{"$f":"IF(OR($C103=$D$38,AC22=\"\"),NA(),AC22)","v":9.3000000000000013E-2},0.09,8.1000000000000003E-2,7.0999999999999994E-2,5.9000000000000004E-2,7.0000000000000007E-2]
[null,null,"Lithuania",{"$f":"IF(OR($C104=$D$38,D23=\"\"),NA(),D23)","v":{"$error":"#N/A"}},{"$error":"#N/A"},{"$error":"#N/A"},{"$error":"#N/A"},{"$error":"#N/A"},{"$error":"#N/A"},{"$error":"#N/A"},0.113,0.11900000000000001,0.127,0.14800000000000002,0.157,0.128,0.111,9.9000000000000005E-2,7.6999999999999999E-2,5.4000000000000006E-2,3.9E-2,0.05,0.122,0.161,0.13900000000000001,0.122,0.109,9.9000000000000005E-2,{"$f":"IF(OR($C104=$D$38,AC23=\"\"),NA(),AC23)","v":8.5000000000000006E-2},7.2999999999999995E-2,6.6000000000000003E-2,5.7999999999999996E-2,5.7999999999999996E-2,7.0000000000000007E-2]
[null,null,"Luxembourg",{"$f":"IF(OR($C105=$D$38,D24=\"\"),NA(),D24)","v":1.3000000000000001E-2},1.3999999999999999E-2,1.8000000000000002E-2,2.2000000000000002E-2,2.6000000000000002E-2,2.3E-2,2.3E-2,0.02,2.1000000000000001E-2,1.9E-2,1.9E-2,1.8000000000000002E-2,2.4E-2,3.1E-2,4.2000000000000003E-2,3.7999999999999999E-2,3.9E-2,3.3000000000000002E-2,0.04,4.0999999999999995E-2,3.7000000000000005E-2,4.0999999999999995E-2,4.2000000000000003E-2,5.2000000000000005E-2,4.8000000000000001E-2,{"$f":"IF(OR($C105=$D$38,AC24=\"\"),NA(),AC24)","v":5.7000000000000002E-2},5.2999999999999999E-2,4.7E-2,4.9000000000000002E-2,4.5999999999999999E-2,5.2999999999999999E-2]
[null,null,"Malta",{"$f":"IF(OR($C106=$D$38,D25=\"\"),NA(),D25)","v":{"$error":"#N/A"}},{"$error":"#N/A"},{"$error":"#N/A"},{"$error":"#N/A"},{"$error":"#N/A"},{"$error":"#N/A"},{"$error":"#N/A"},4.7E-2,4.7E-2,4.7E-2,4.7E-2,4.2999999999999997E-2,4.8000000000000001E-2,5.2000000000000005E-2,4.7E-2,4.7E-2,4.8000000000000001E-2,4.9000000000000002E-2,4.8000000000000001E-2,5.2999999999999999E-2,5.5999999999999994E-2,0.05,4.8000000000000001E-2,4.9000000000000002E-2,4.7E-2,{"$f":"IF(OR($C106=$D$38,AC25=\"\"),NA(),AC25)","v":4.4000000000000004E-2},3.7999999999999999E-2,3.1E-2,2.8999999999999998E-2,2.6000000000000002E-2,2.7E-2]
[null,null,"Netherlands",{"$f":"IF(OR($C107=$D$38,D26=\"\"),NA(),D26)","v":5.2999999999999999E-2},4.9000000000000002E-2,5.0999999999999997E-2,5.5999999999999994E-2,6.4000000000000001E-2,6.0999999999999999E-2,5.4000000000000006E-2,4.5999999999999999E-2,3.6000000000000004E-2,2.8999999999999998E-2,2.4E-2,1.8000000000000002E-2,2.3E-2,3.2000000000000001E-2,3.9E-2,4.8000000000000001E-2,4.0999999999999995E-2,3.2000000000000001E-2,2.7000000000000003E-2,3.2000000000000001E-2,3.9E-2,0.04,4.7E-2,6.0999999999999999E-2,6.5000000000000002E-2,{"$f":"IF(OR($C107=$D$38,AC26=\"\"),NA(),AC26)","v":6.0999999999999999E-2},5.0999999999999997E-2,4.0999999999999995E-2,3.2000000000000001E-2,2.7999999999999997E-2,2.5000000000000001E-2]
[null,null,"Poland",{"$f":"IF(OR($C108=$D$38,D27=\"\"),NA(),D27)","v":{"$error":"#N/A"}},{"$error":"#N/A"},{"$error":"#N/A"},{"$error":"#N/A"},{"$error":"#N/A"},{"$error":"#N/A"},{"$error":"#N/A"},{"$error":"#N/A"},8.5999999999999993E-2,0.109,0.13400000000000001,0.14899999999999999,0.16500000000000001,0.16300000000000001,0.161,0.151,0.11800000000000001,8.1000000000000003E-2,5.9000000000000004E-2,6.8000000000000005E-2,8.1000000000000003E-2,0.08,8.5000000000000006E-2,8.8000000000000009E-2,7.6999999999999999E-2,{"$f":"IF(OR($C108=$D$38,AC27=\"\"),NA(),AC27)","v":6.4000000000000001E-2},5.2000000000000005E-2,4.0999999999999995E-2,3.2000000000000001E-2,2.7999999999999997E-2,2.8000000000000001E-2]
[null,null,"Portugal",{"$f":"IF(OR($C109=$D$38,D28=\"\"),NA(),D28)","v":3.7000000000000005E-2},3.4000000000000002E-2,3.2000000000000001E-2,4.4999999999999998E-2,5.7000000000000002E-2,5.7000000000000002E-2,5.7999999999999996E-2,5.5E-2,4.2000000000000003E-2,3.7999999999999999E-2,3.4000000000000002E-2,3.3000000000000002E-2,4.0999999999999995E-2,5.2999999999999999E-2,5.7000000000000002E-2,6.7000000000000004E-2,6.8000000000000005E-2,7.2000000000000008E-2,6.8000000000000005E-2,8.5999999999999993E-2,0.1,0.113,0.13900000000000001,0.14699999999999999,0.125,{"$f":"IF(OR($C109=$D$38,AC28=\"\"),NA(),AC28)","v":0.111},9.9000000000000005E-2,7.8E-2,6.0999999999999999E-2,5.5999999999999994E-2,5.8000000000000003E-2]
[null,null,"Romania",{"$f":"IF(OR($C110=$D$38,D29=\"\"),NA(),D29)","v":{"$error":"#N/A"}},{"$error":"#N/A"},{"$error":"#N/A"},{"$error":"#N/A"},{"$error":"#N/A"},{"$error":"#N/A"},{"$error":"#N/A"},{"$error":"#N/A"},4.2999999999999997E-2,0.05,5.4000000000000006E-2,0.05,6.5000000000000002E-2,5.4000000000000006E-2,6.2E-2,5.5999999999999994E-2,5.7000000000000002E-2,4.9000000000000002E-2,4.4000000000000004E-2,5.4000000000000006E-2,5.5999999999999994E-2,5.7000000000000002E-2,5.4000000000000006E-2,5.7000000000000002E-2,5.5E-2,{"$f":"IF(OR($C110=$D$38,AC29=\"\"),NA(),AC29)","v":5.5999999999999994E-2},4.8000000000000001E-2,3.9E-2,3.3000000000000002E-2,0.03,3.7999999999999999E-2]
[null,null,"Slovakia",{"$f":"IF(OR($C111=$D$38,D30=\"\"),NA(),D30)","v":{"$error":"#N/A"}},{"$error":"#N/A"},{"$error":"#N/A"},{"$error":"#N/A"},{"$error":"#N/A"},{"$error":"#N/A"},{"$error":"#N/A"},9.8000000000000004E-2,0.10099999999999999,0.129,0.153,0.157,0.153,0.14899999999999999,0.16,0.14400000000000002,0.11699999999999999,0.1,8.4000000000000005E-2,0.10400000000000001,0.125,0.11800000000000001,0.122,0.125,0.11800000000000001,{"$f":"IF(OR($C111=$D$38,AC30=\"\"),NA(),AC30)","v":0.10199999999999999},8.6999999999999994E-2,7.2999999999999995E-2,5.9000000000000004E-2,5.0999999999999997E-2,4.9000000000000002E-2]
[null,null,"Slovenia",{"$f":"IF(OR($C112=$D$38,D31=\"\"),NA(),D31)","v":{"$error":"#N/A"}},{"$error":"#N/A"},{"$error":"#N/A"},{"$error":"#N/A"},{"$error":"#N/A"},{"$error":"#N/A"},{"$error":"#N/A"},5.2000000000000005E-2,5.7999999999999996E-2,5.9000000000000004E-2,5.5E-2,4.8000000000000001E-2,5.0999999999999997E-2,5.5E-2,5.0999999999999997E-2,5.4000000000000006E-2,5.0999999999999997E-2,4.2000000000000003E-2,3.7000000000000005E-2,5.0999999999999997E-2,6.5000000000000002E-2,7.4999999999999997E-2,7.9000000000000001E-2,9.1999999999999998E-2,0.09,{"$f":"IF(OR($C112=$D$38,AC31=\"\"),NA(),AC31)","v":8.4000000000000005E-2},7.4999999999999997E-2,6.2E-2,4.8000000000000001E-2,4.2000000000000003E-2,3.5999999999999997E-2]
[null,null,"Spain",{"$f":"IF(OR($C113=$D$38,D32=\"\"),NA(),D32)","v":{"$error":"#N/A"}},{"$error":"#N/A"},{"$error":"#N/A"},{"$error":"#N/A"},{"$error":"#N/A"},{"$error":"#N/A"},{"$error":"#N/A"},{"$error":"#N/A"},{"$error":"#N/A"},{"$error":"#N/A"},{"$error":"#N/A"},{"$error":"#N/A"},{"$error":"#N/A"},{"$error":"#N/A"},{"$error":"#N/A"},{"$error":"#N/A"},{"$error":"#N/A"},{"$error":"#N/A"},{"$error":"#N/A"},{"$error":"#N/A"},{"$error":"#N/A"},{"$error":"#N/A"},{"$error":"#N/A"},{"$error":"#N/A"},{"$error":"#N/A"},{"$f":"IF(OR($C113=$D$38,AC32=\"\"),NA(),AC32)","v":{"$error":"#N/A"}},{"$error":"#N/A"},{"$error":"#N/A"},{"$error":"#N/A"},{"$error":"#N/A"},{"$error":"#N/A"}]
[null,null,"Sweden",{"$f":"IF(OR($C114=$D$38,D33=\"\"),NA(),D33)","v":1.2E-2},2.3E-2,4.4000000000000004E-2,7.2000000000000008E-2,7.5999999999999998E-2,{"$error":"#N/A"},8.3000000000000004E-2,8.900000000000001E-2,7.9000000000000001E-2,6.5000000000000002E-2,4.9000000000000002E-2,0.04,4.0999999999999995E-2,4.7E-2,5.2000000000000005E-2,5.5999999999999994E-2,0.05,4.2999999999999997E-2,4.0999999999999995E-2,5.9000000000000004E-2,6.2E-2,5.5E-2,5.7000000000000002E-2,5.7000000000000002E-2,5.7000000000000002E-2,{"$f":"IF(OR($C114=$D$38,AC33=\"\"),NA(),AC33)","v":5.5999999999999994E-2},5.2999999999999999E-2,5.2000000000000005E-2,4.9000000000000002E-2,5.0999999999999997E-2,5.3999999999999999E-2]
[null,null,"United Kingdom",{"$f":"IF(OR($C115=$D$38,D34=\"\"),NA(),D34)","v":0.06},7.2999999999999995E-2,8.3000000000000004E-2,8.5999999999999993E-2,7.9000000000000001E-2,7.2999999999999995E-2,6.7000000000000004E-2,5.7999999999999996E-2,5.0999999999999997E-2,4.8000000000000001E-2,4.2999999999999997E-2,3.7999999999999999E-2,3.9E-2,3.7000000000000005E-2,3.4000000000000002E-2,3.3000000000000002E-2,3.7999999999999999E-2,3.6000000000000004E-2,3.9E-2,5.5999999999999994E-2,5.7999999999999996E-2,5.7999999999999996E-2,5.7000000000000002E-2,5.4000000000000006E-2,4.4000000000000004E-2,{"$f":"IF(OR($C115=$D$38,AC34=\"\"),NA(),AC34)","v":3.7999999999999999E-2},3.6000000000000004E-2,3.2000000000000001E-2,0.03,2.7000000000000003E-2,2.8000000000000001E-2]
[]
[null,null,"Average (unweighted)",{"$f":"IFERROR(AVERAGE(D7:D34),NA())","v":5.4545454545454557E-2},{"$f":"IFERROR(AVERAGE(E7:E34),NA())","v":6.0416666666666667E-2},6.9769230769230778E-2,7.9857142857142877E-2,7.9466666666666658E-2,7.7000000000000013E-2,7.9785714285714279E-2,7.8E-2,7.3039999999999994E-2,7.3119999999999991E-2,7.7407407407407397E-2,7.485185185185185E-2,7.4481481481481482E-2,7.3142857142857148E-2,7.4285714285714274E-2,7.0357142857142854E-2,6.2535714285714292E-2,5.4571428571428583E-2,5.2928571428571422E-2,7.514285714285715E-2,8.6821428571428536E-2,8.6750000000000008E-2,9.342857142857143E-2,9.7035714285714267E-2,9.1857142857142846E-2,8.478571428571427E-2,7.6214285714285707E-2,6.667857142857142E-2,5.753571428571428E-2,5.1785714285714289E-2,5.417857142857143E-2]
[null,null,{"$f":"$D$38","v":"Spain"},{"$f":"IF(INDEX(D$7:D$34,mySelectedCountry,1)=\"\",NA(),INDEX(D$7:D$34,mySelectedCountry,1))","v":0.11699999999999999},0.122,0.13600000000000001,0.16600000000000001,0.17899999999999999,0.19,0.184,0.17300000000000001,0.157,0.13400000000000001,0.11900000000000001,8.900000000000001E-2,9.8000000000000004E-2,9.9000000000000005E-2,9.5000000000000001E-2,7.6999999999999999E-2,7.2000000000000008E-2,7.0000000000000007E-2,9.6999999999999989E-2,0.157,0.17800000000000002,0.192,0.22500000000000001,0.23800000000000002,0.223,0.20199999999999999,0.17899999999999999,0.157,0.13900000000000001,0.128,0.13600000000000001]
[]
[null,"Scrollable Table"]
[]
[null,null,null,{"$f":"control!$C$46+1","v":22},{"$f":"D122+1","v":23},{"$f":"E122+1","v":24},25,26,{"$f":"H122+1","v":27},{"$f":"I122+1","v":28},{"$f":"J122+1","v":29},{"$f":"K122+1","v":30},31]
[null,"Ndx","Country",{"$f":"INDEX($D$6:$AH$6,1,D122)","v":"2011-01-01"},{"$f":"INDEX($D$6:$AH$6,1,E122)","v":"2012-01-01"},"2013-01-01","2014-01-01","2015-01-01","2016-01-01","2017-01-01","2018-01-01","2019-01-01","2020-01-01",null,"Pos"]
[null,{"$f":"control!$C$47+1","v":19},{"$f":"INDEX($C$7:$C$34,$B124,1)","v":"Malta"},{"$f":"IF(ISBLANK(INDEX($D$7:$AH$34,$B124,D$122)),\"\",INDEX($D$7:$AH$34,$B124,D$122))","v":0.05},{"$f":"IF(ISBLANK(INDEX($D$7:$AH$34,$B124,E$122)),\"\",INDEX($D$7:$AH$34,$B124,E$122))","v":4.8000000000000001E-2},4.9000000000000002E-2,4.7E-2,4.4000000000000004E-2,3.7999999999999999E-2,3.1E-2,2.8999999999999998E-2,2.6000000000000002E-2,2.7E-2,null,{"$f":"MATCH(C124,myCountryList,0)","v":19}]
[null,{"$f":"B124+1","v":20},"Netherlands",{"$f":"IF(ISBLANK(INDEX($D$7:$AH$34,$B125,D$122)),\"\",INDEX($D$7:$AH$34,$B125,D$122))","v":0.04},4.7E-2,6.0999999999999999E-2,6.5000000000000002E-2,6.0999999999999999E-2,5.0999999999999997E-2,4.0999999999999995E-2,3.2000000000000001E-2,2.7999999999999997E-2,2.5000000000000001E-2,null,20]
[null,{"$f":"B125+1","v":21},"Poland",0.08,8.5000000000000006E-2,8.8000000000000009E-2,7.6999999999999999E-2,6.4000000000000001E-2,5.2000000000000005E-2,4.0999999999999995E-2,3.2000000000000001E-2,2.7999999999999997E-2,2.8000000000000001E-2,null,21]
[null,22,"Portugal",0.113,0.13900000000000001,0.14699999999999999,0.125,0.111,9.9000000000000005E-2,7.8E-2,6.0999999999999999E-2,5.5999999999999994E-2,5.8000000000000003E-2,null,22]
[null,23,"Romania",5.7000000000000002E-2,5.4000000000000006E-2,5.7000000000000002E-2,5.5E-2,5.5999999999999994E-2,4.8000000000000001E-2,3.9E-2,3.3000000000000002E-2,0.03,3.7999999999999999E-2,null,23]
[null,24,"Slovakia",0.11800000000000001,0.122,0.125,0.11800000000000001,0.10199999999999999,8.6999999999999994E-2,7.2999999999999995E-2,5.9000000000000004E-2,5.0999999999999997E-2,4.9000000000000002E-2,null,24]
[null,25,"Slovenia",7.4999999999999997E-2,7.9000000000000001E-2,9.1999999999999998E-2,0.09,8.4000000000000005E-2,7.4999999999999997E-2,6.2E-2,4.8000000000000001E-2,4.2000000000000003E-2,3.5999999999999997E-2,null,25]
[null,26,"Spain",0.192,0.22500000000000001,0.23800000000000002,0.223,0.20199999999999999,0.17899999999999999,0.157,0.13900000000000001,0.128,0.13600000000000001,null,26]
[null,27,"Sweden",5.5E-2,5.7000000000000002E-2,5.7000000000000002E-2,5.7000000000000002E-2,5.5999999999999994E-2,5.2999999999999999E-2,5.2000000000000005E-2,4.9000000000000002E-2,5.0999999999999997E-2,5.3999999999999999E-2,null,27]
[null,28,"United Kingdom",5.7999999999999996E-2,5.7000000000000002E-2,5.4000000000000006E-2,4.4000000000000004E-2,3.7999999999999999E-2,3.6000000000000004E-2,3.2000000000000001E-2,0.03,2.7000000000000003E-2,2.8000000000000001E-2,null,28]
[]
[null,"Choropleth Map"]
[]
[null,"#","Country Name","Value","Shape Name","Shape Index"]
[null,1,{"$f":"C7","v":"Austria"},{"$f":"IF(ISBLANK(INDEX($D7:$AH7,1,mySelectedYear)),\"\",INDEX($D7:$AH7,1,mySelectedYear))","v":0.04},"S_AUT",1]
[null,2,{"$f":"C8","v":"Belgium"},4.5999999999999999E-2,"S_BEL",2]
[null,3,"Bulgaria",0.04,"S_BGR",3]
[null,4,"Croatia",5.7000000000000002E-2,"S_HRV",4]
[null,5,"Cyprus",6.3E-2,"S_CYP",5]
[null,6,"Czech Republic",1.8000000000000002E-2,"S_CZE",6]
[null,7,"Denmark",4.2000000000000003E-2,"S_DNK",7]
[null,8,"Estonia",3.9E-2,"S_EST",8]
[null,9,"Finland",5.2999999999999999E-2,"S_FIN",9]
[null,10,"France",7.2999999999999995E-2,"S_FRA",10]
[null,11,"Germany",2.8999999999999998E-2,"S_DEU",11]
[null,12,"Greece",0.16399999999999998,"S_GRC",12]
[null,13,"Hungary",2.7999999999999997E-2,"S_HUN",13]
[null,14,"Ireland",0.04,"S_IRL",14]
[null,15,"Italy",8.8000000000000009E-2,"S_ITA",15]
[null,16,"Latvia",5.9000000000000004E-2,"S_LVA",16]
[null,17,"Lithuania",5.7999999999999996E-2,"S_LTU",17]
[null,18,"Luxembourg",4.5999999999999999E-2,"S_LUX",18]
[null,19,"Malta",2.6000000000000002E-2,"S_MLT",19]
[null,20,"Netherlands",2.7999999999999997E-2,"S_NLD",20]
[null,21,"Poland",2.7999999999999997E-2,"S_POL",21]
[null,22,"Portugal",5.5999999999999994E-2,"S_PRT",22]
[null,23,"Romania",0.03,"S_ROU",23]
[null,24,"Slovakia",5.0999999999999997E-2,"S_SVK",24]
[null,25,"Slovenia",4.2000000000000003E-2,"S_SVN",25]
[null,26,"Spain",0.128,"S_ESP",26]
[null,27,"Sweden",5.0999999999999997E-2,"S_SWE",27]
[null,28,"United Kingdom",2.7000000000000003E-2,"S_GBR",28]
[]
[null,"Map legend calculations"]
[]
[null,null,"Maximum value",{"$f":"MAX($E$45:$E$72)","v":0.16399999999999998}]
[null,null,"Step Size",{"$f":"ROUND(D169/$D$181,2)","v":0.02}]
[null,null,"Current country bin",{"$f":"IFERROR(VLOOKUP(INDEX($D$45:$D$72,mySelectedCountry,1),$E$173:$G$181,3,TRUE),control!$E$54)","v":"12% to 14%"}]
[]
[null,null,null,1,0,{"$f":"$D$170","v":0.02},{"$f":"TEXT(E173,\"0%\")&\" to \"&TEXT(F173,\"0%\")","v":"0% to 2%"}]
[null,null,null,2,{"$f":"F173","v":0.02},{"$f":"F173+$D$170","v":0.04},{"$f":"TEXT(E174,\"0%\")&\" to \"&TEXT(F174,\"0%\")","v":"2% to 4%"}]
[null,null,null,3,{"$f":"F174","v":0.04},0.06,"4% to 6%"]
[null,null,null,4,0.06,0.08,"6% to 8%"]
[null,null,null,5,0.08,0.1,"8% to 10%"]
[null,null,null,6,0.1,0.12000000000000001,"10% to 12%"]
[null,null,null,7,0.12000000000000001,0.14000000000000001,"12% to 14%"]
[null,null,null,8,0.14000000000000001,0.16,"14% to 16%"]
[null,null,null,9,0.16,1,{"$f":"TEXT(E181,\"0%\")&\" or more\"","v":"16% or more"}]

{"sheet":"charts","index":4,"n_rows":2,"n_cols":2,"rows_kept":2,"cut":false,"hidden":false,"merged":[]}
[]
[null,"Line and Band Chart"]

{"sheet":"map icon","index":5,"n_rows":2,"n_cols":2,"rows_kept":2,"cut":false,"hidden":false,"merged":[]}
[]
[null,"Map \"Icon\""]