{"text_format":"1","workbook":"xlsx","n_sheets":6,"sheets":["dashboard","data","control","calcs","charts","map icon"],"not_rendered":{"charts":5,"images":11,"macros":1,"external_links":0,"defined_names":35,"comments":0,"pivot_tables":0},"unopened":[],"bounds":{"document_bytes":16777216,"sheet_cells":100000,"rows_first":2000,"rows_last":500,"rows_between":2000,"halvings":0,"cell_chars":16384,"cell_head_chars":4096},"cells_cut":0,"cells_raw":0,"read":"whole","date_system":"1900"}

{"sheet":"dashboard","index":0,"n_rows":44,"n_cols":29,"rows_kept":44,"cut":false,"hidden":false,"merged":[[1,25,1,28],[1,23,3,23],[25,1,25,11],[6,13,6,18],[6,20,6,23],[1,1,3,8],[43,2,43,13],[2,25,2,28],[3,25,3,28],[41,2,41,13],[40,8,40,10],[40,2,40,6],[42,2,42,13]]}
[]
[null,"European Union Unemployment Rates",null,null,null,null,null,null,null,null,null,null,null,null,null,null,null,null,null,null,null,null,null,1,null,"Robert Mundigl & Pedro Wave"]
[null,null,null,null,null,null,null,null,null,null,"Age group",null,null,null,null,"Country",null,null,null,null,"Year",null,null,null,null,"www.clearlyandsimply.com"]
[null,null,null,null,null,null,null,null,null,null,null,null,null,null,null,null,null,null,null,null,null,null,null,null,null,"pedrowave.blogspot.com"]
[]
[]
[null,null,null,"Band Chart",null,null,null,"Line Chart",null,null,null,null,null,{"$f":"\"Sorted Bar Chart (\"&YEAR(calcs!$D$40)&\")\"","v":"Sorted Bar Chart (2019)"},null,null,null,null,null,null,{"$f":"\"Choropleth Map (\"&YEAR(calcs!$D$40)&\")\"","v":"Choropleth Map (2019)"},null,null,null,"Color scale"]
[]
[null,null,null,null,null,null,null,null,null,null,null,null,null,null,null,"Click on a Country to select",null,null,null,null,null,"Click on a Country to select"]
[]
{"$rows_left_out":35}
{"sheet":"data","index":1,"n_rows":98,"n_cols":34,"rows_kept":98,"cut":false,"hidden":false,"merged":[[1,21,1,30],[1,1,1,2],[3,21,3,32]]}
[]
[null,"EU Unemployment\nRates by Country",null,null,null,null,null,null,null,null,null,null,null,null,null,null,null,null,null,null,"Source: EuroStat","https://ec.europa.eu/eurostat/web/products-datasets/-/tipsun20"]
[]
[null,"Age group 15 to 74",null,null,null,null,null,null,null,null,null,null,null,null,null,null,null,null,null,null,"ILOSTAT Monthly","https://www.ilo.org/shinyapps/bulkexplorer9/?lang=en&segment=indicator&id=UNE_DEAP_SEX_AGE_RT_M"]
[]
[null,"Country",null,"1990-01-01","1991-01-01","1992-01-01","1993-01-01","1994-01-01","1995-01-01","1996-01-01","1997-01-01","1998-01-01","1999-01-01","2000-01-01","2001-01-01","2002-01-01","2003-01-01","2004-01-01","2005-01-01","2006-01-01","2007-01-01","2008-01-01","2009-01-01","2010-01-01","2011-01-01","2012-01-01","2013-01-01","2014-01-01","2015-01-01","2016-01-01","2017-01-01","2018-01-01","2019-01-01","2020-01-01"]
[null,"Austria",null,null,null,null,null,null,4.2000000000000003E-2,4.5999999999999999E-2,4.5999999999999999E-2,4.4000000000000004E-2,3.7000000000000005E-2,3.5000000000000003E-2,3.6000000000000004E-2,0.04,4.2999999999999997E-2,5.5E-2,5.5999999999999994E-2,5.2999999999999999E-2,4.9000000000000002E-2,4.0999999999999995E-2,5.2999999999999999E-2,4.8000000000000001E-2,4.5999999999999999E-2,4.9000000000000002E-2,5.4000000000000006E-2,5.5999999999999994E-2,5.7000000000000002E-2,0.06,5.5E-2,4.9000000000000002E-2,4.4999999999999998E-2]
[null,"Belgium",null,null,null,null,null,null,9.5000000000000001E-2,9.5000000000000001E-2,9.3000000000000013E-2,9.3000000000000013E-2,8.5999999999999993E-2,7.0000000000000007E-2,6.6000000000000003E-2,7.4999999999999997E-2,8.199999999999999E-2,8.4000000000000005E-2,8.5000000000000006E-2,8.3000000000000004E-2,7.4999999999999997E-2,7.0000000000000007E-2,7.9000000000000001E-2,8.3000000000000004E-2,7.2000000000000008E-2,7.5999999999999998E-2,8.4000000000000005E-2,8.5000000000000006E-2,8.5000000000000006E-2,7.8E-2,7.0999999999999994E-2,0.06,5.4000000000000006E-2]
[null,"Bulgaria",null,null,null,null,null,null,"","","","","",0.16899999999999998,0.20300000000000001,0.182,0.13699999999999998,0.121,0.10099999999999999,0.09,6.9000000000000006E-2,5.5999999999999994E-2,6.8000000000000005E-2,0.10300000000000001,0.113,0.12300000000000001,0.13,0.114,9.1999999999999998E-2,7.5999999999999998E-2,6.2E-2,5.2000000000000005E-2,4.2000000000000003E-2]
[null,"Croatia",null,null,null,null,null,null,"","","","","",0.156,0.16,0.15,0.14199999999999999,0.13699999999999998,0.127,0.113,9.9000000000000005E-2,8.5999999999999993E-2,9.1999999999999998E-2,0.11699999999999999,0.13699999999999998,0.16,0.17300000000000001,0.17300000000000001,0.16200000000000001,0.13100000000000001,0.11199999999999999,8.5000000000000006E-2,6.6000000000000003E-2]
{"$rows_left_out":89}
{"sheet":"control","index":2,"n_rows":89,"n_cols":28,"rows_kept":89,"cut":false,"hidden":false,"merged":[]}
[]
[null,"Control"]
[]
[null,"Selection age group",3,"25 to 74",{"$f":"MATCH(D4,myAgeGroups,0)","v":3}]
[null,"Age group","15 to 74"]
[null,null,"15 to 24"]
[null,null,"25 to 74"]
[]
[null,"Selection country",26,"Spain",{"$f":"INDEX(myCountryList,mySelectedCountry)","v":"Spain"},{"$f":"COUNTA(myCountryList)","v":28}]
[]
{"$rows_left_out":80}
{"sheet":"calcs","index":3,"n_rows":181,"n_cols":34,"rows_kept":181,"cut":false,"hidden":false,"merged":[]}
[]
[null,"Calculations"]
[]
[null,{"$f":"\"Age group data: \" & control!$D$4","v":"Age group data: 25 to 74"}]
[]
[null,null,"Country",{"$f":"data!D6","v":"1990-01-01"},{"$f":"data!E6","v":"1991-01-01"},{"$f":"data!F6","v":"1992-01-01"},{"$f":"data!G6","v":"1993-01-01"},{"$f":"data!H6","v":"1994-01-01"},{"$f":"data!I6","v":"1995-01-01"},{"$f":"data!J6","v":"1996-01-01"},{"$f":"data!K6","v":"1997-01-01"},{"$f":"data!L6","v":"1998-01-01"},{"$f":"data!M6","v":"1999-01-01"},{"$f":"data!N6","v":"2000-01-01"},{"$f":"data!O6","v":"2001-01-01"},{"$f":"data!P6","v":"2002-01-01"},{"$f":"data!Q6","v":"2003-01-01"},{"$f":"data!R6","v":"2004-01-01"},{"$f":"data!S6","v":"2005-01-01"},{"$f":"data!T6","v":"2006-01-01"},{"$f":"data!U6","v":"2007-01-01"},{"$f":"data!V6","v":"2008-01-01"},{"$f":"data!W6","v":"2009-01-01"},{"$f":"data!X6","v":"2010-01-01"},{"$f":"data!Y6","v":"2011-01-01"},{"$f":"data!Z6","v":"2012-01-01"},{"$f":"data!AA6","v":"2013-01-01"},{"$f":"data!AB6","v":"2014-01-01"},{"$f":"data!AC6","v":"2015-01-01"},{"$f":"data!AD6","v":"2016-01-01"},{"$f":"data!AE6","v":"2017-01-01"},{"$f":"data!AF6","v":"2018-01-01"},{"$f":"data!AG6","v":"2019-01-01"},{"$f":"data!AH6","v":"2020-01-01"}]
[null,null,{"$f":"data!B7","v":"Austria"},{"$f":"IF(ISBLANK(CHOOSE(mySelectedAgeGroup,data!D7,data!D39,data!D71)),\"\",CHOOSE(mySelectedAgeGroup,data!D7,data!D39,data!D71))","v":""},{"$f":"IF(ISBLANK(CHOOSE(mySelectedAgeGroup,data!E7,data!E39,data!E71)),\"\",CHOOSE(mySelectedAgeGroup,data!E7,data!E39,data!E71))","v":""},{"$f":"IF(ISBLANK(CHOOSE(mySelectedAgeGroup,data!F7,data!F39,data!F71)),\"\",CHOOSE(mySelectedAgeGroup,data!F7,data!F39,data!F71))","v":""},{"$f":"IF(ISBLANK(CHOOSE(mySelectedAgeGroup,data!G7,data!G39,data!G71)),\"\",CHOOSE(mySelectedAgeGroup,data!G7,data!G39,data!G71))","v":""},{"$f":"IF(ISBLANK(CHOOSE(mySelectedAgeGroup,data!H7,data!H39,data!H71)),\"\",CHOOSE(mySelectedAgeGroup,data!H7,data!H39,data!H71))","v":3.5000000000000003E-2},{"$f":"IF(ISBLANK(CHOOSE(mySelectedAgeGroup,data!I7,data!I39,data!I71)),\"\",CHOOSE(mySelectedAgeGroup,data!I7,data!I39,data!I71))","v":3.9E-2},{"$f":"IF(ISBLANK(CHOOSE(mySelectedAgeGroup,data!J7,data!J39,data!J71)),\"\",CHOOSE(mySelectedAgeGroup,data!J7,data!J39,data!J71))","v":4.2999999999999997E-2},{"$f":"IF(ISBLANK(CHOOSE(mySelectedAgeGroup,data!K7,data!K39,data!K71)),\"\",CHOOSE(mySelectedAgeGroup,data!K7,data!K39,data!K71))","v":4.2000000000000003E-2},{"$f":"IF(ISBLANK(CHOOSE(mySelectedAgeGroup,data!L7,data!L39,data!L71)),\"\",CHOOSE(mySelectedAgeGroup,data!L7,data!L39,data!L71))","v":4.0999999999999995E-2},{"$f":"IF(ISBLANK(CHOOSE(mySelectedAgeGroup,data!M7,data!M39,data!M71)),\"\",CHOOSE(mySelectedAgeGroup,data!M7,data!M39,data!M71))","v":3.5000000000000003E-2},{"$f":"IF(ISBLANK(CHOOSE(mySelectedAgeGroup,data!N7,data!N39,data!N71)),\"\",CHOOSE(mySelectedAgeGroup,data!N7,data!N39,data!N71))","v":3.3000000000000002E-2},{"$f":"IF(ISBLANK(CHOOSE(mySelectedAgeGroup,data!O7,data!O39,data!O71)),\"\",CHOOSE(mySelectedAgeGroup,data!O7,data!O39,data!O71))","v":3.3000000000000002E-2},{"$f":"IF(ISBLANK(CHOOSE(mySelectedAgeGroup,data!P7,data!P39,data!P71)),\"\",CHOOSE(mySelectedAgeGroup,data!P7,data!P39,data!P71))","v":3.6000000000000004E-2},{"$f":"IF(ISBLANK(CHOOSE(mySelectedAgeGroup,data!Q7,data!Q39,data!Q71)),\"\",CHOOSE(mySelectedAgeGroup,data!Q7,data!Q39,data!Q71))","v":3.9E-2},{"$f":"IF(ISBLANK(CHOOSE(mySelectedAgeGroup,data!R7,data!R39,data!R71)),\"\",CHOOSE(mySelectedAgeGroup,data!R7,data!R39,data!R71))","v":4.7E-2},{"$f":"IF(ISBLANK(CHOOSE(mySelectedAgeGroup,data!S7,data!S39,data!S71)),\"\",CHOOSE(mySelectedAgeGroup,data!S7,data!S39,data!S71))","v":4.7E-2},{"$f":"IF(ISBLANK(CHOOSE(mySelectedAgeGroup,data!T7,data!T39,data!T71)),\"\",CHOOSE(mySelectedAgeGroup,data!T7,data!T39,data!T71))","v":4.4999999999999998E-2},{"$f":"IF(ISBLANK(CHOOSE(mySelectedAgeGroup,data!U7,data!U39,data!U71)),\"\",CHOOSE(mySelectedAgeGroup,data!U7,data!U39,data!U71))","v":4.0999999999999995E-2},{"$f":"IF(ISBLANK(CHOOSE(mySelectedAgeGroup,data!V7,data!V39,data!V71)),\"\",CHOOSE(mySelectedAgeGroup,data!V7,data!V39,data!V71))","v":3.4000000000000002E-2},{"$f":"IF(ISBLANK(CHOOSE(mySelectedAgeGroup,data!W7,data!W39,data!W71)),\"\",CHOOSE(mySelectedAgeGroup,data!W7,data!W39,data!W71))","v":4.4000000000000004E-2},{"$f":"IF(ISBLANK(CHOOSE(mySelectedAgeGroup,data!X7,data!X39,data!X71)),\"\",CHOOSE(mySelectedAgeGroup,data!X7,data!X39,data!X71))","v":4.0999999999999995E-2},{"$f":"IF(ISBLANK(CHOOSE(mySelectedAgeGroup,data!Y7,data!Y39,data!Y71)),\"\",CHOOSE(mySelectedAgeGroup,data!Y7,data!Y39,data!Y71))","v":3.9E-2},{"$f":"IF(ISBLANK(CHOOSE(mySelectedAgeGroup,data!Z7,data!Z39,data!Z71)),\"\",CHOOSE(mySelectedAgeGroup,data!Z7,data!Z39,data!Z71))","v":4.2000000000000003E-2},{"$f":"IF(ISBLANK(CHOOSE(mySelectedAgeGroup,data!AA7,data!AA39,data!AA71)),\"\",CHOOSE(mySelectedAgeGroup,data!AA7,data!AA39,data!AA71))","v":4.7E-2},{"$f":"IF(ISBLANK(CHOOSE(mySelectedAgeGroup,data!AB7,data!AB39,data!AB71)),\"\",CHOOSE(mySelectedAgeGroup,data!AB7,data!AB39,data!AB71))","v":4.9000000000000002E-2},{"$f":"IF(ISBLANK(CHOOSE(mySelectedAgeGroup,data!AC7,data!AC39,data!AC71)),\"\",CHOOSE(mySelectedAgeGroup,data!AC7,data!AC39,data!AC71))","v":0.05},{"$f":"IF(ISBLANK(CHOOSE(mySelectedAgeGroup,data!AD7,data!AD39,data!AD71)),\"\",CHOOSE(mySelectedAgeGroup,data!AD7,data!AD39,data!AD71))","v":5.2999999999999999E-2},{"$f":"IF(ISBLANK(CHOOSE(mySelectedAgeGroup,data!AE7,data!AE39,data!AE71)),\"\",CHOOSE(mySelectedAgeGroup,data!AE7,data!AE39,data!AE71))","v":4.9000000000000002E-2},{"$f":"IF(ISBLANK(CHOOSE(mySelectedAgeGroup,data!AF7,data!AF39,data!AF71)),\"\",CHOOSE(mySelectedAgeGroup,data!AF7,data!AF39,data!AF71))","v":4.2999999999999997E-2},{"$f":"IF(ISBLANK(CHOOSE(mySelectedAgeGroup,data!AG7,data!AG39,data!AG71)),\"\",CHOOSE(mySelectedAgeGroup,data!AG7,data!AG39,data!AG71))","v":0.04},{"$f":"IF(ISBLANK(CHOOSE(mySelectedAgeGroup,data!AH7,data!AH39,data!AH71)),\"\",CHOOSE(mySelectedAgeGroup,data!AH7,data!AH39,data!AH71))","v":4.4999999999999998E-2}]
[null,null,{"$f":"data!B8","v":"Belgium"},{"$f":"IF(ISBLANK(CHOOSE(mySelectedAgeGroup,data!D8,data!D40,data!D72)),\"\",CHOOSE(mySelectedAgeGroup,data!D8,data!D40,data!D72))","v":5.4000000000000006E-2},{"$f":"IF(ISBLANK(CHOOSE(mySelectedAgeGroup,data!E8,data!E40,data!E72)),\"\",CHOOSE(mySelectedAgeGroup,data!E8,data!E40,data!E72))","v":5.4000000000000006E-2},{"$f":"IF(ISBLANK(CHOOSE(mySelectedAgeGroup,data!F8,data!F40,data!F72)),\"\",CHOOSE(mySelectedAgeGroup,data!F8,data!F40,data!F72))","v":0.06},{"$f":"IF(ISBLANK(CHOOSE(mySelectedAgeGroup,data!G8,data!G40,data!G72)),\"\",CHOOSE(mySelectedAgeGroup,data!G8,data!G40,data!G72))","v":7.0999999999999994E-2},{"$f":"IF(ISBLANK(CHOOSE(mySelectedAgeGroup,data!H8,data!H40,data!H72)),\"\",CHOOSE(mySelectedAgeGroup,data!H8,data!H40,data!H72))","v":8.1000000000000003E-2},{"$f":"IF(ISBLANK(CHOOSE(mySelectedAgeGroup,data!I8,data!I40,data!I72)),\"\",CHOOSE(mySelectedAgeGroup,data!I8,data!I40,data!I72))","v":8.1000000000000003E-2},{"$f":"IF(ISBLANK(CHOOSE(mySelectedAgeGroup,data!J8,data!J40,data!J72)),\"\",CHOOSE(mySelectedAgeGroup,data!J8,data!J40,data!J72))","v":8.199999999999999E-2},{"$f":"IF(ISBLANK(CHOOSE(mySelectedAgeGroup,data!K8,data!K40,data!K72)),\"\",CHOOSE(mySelectedAgeGroup,data!K8,data!K40,data!K72))","v":7.9000000000000001E-2},{"$f":"IF(ISBLANK(CHOOSE(mySelectedAgeGroup,data!L8,data!L40,data!L72)),\"\",CHOOSE(mySelectedAgeGroup,data!L8,data!L40,data!L72))","v":0.08},{"$f":"IF(ISBLANK(CHOOSE(mySelectedAgeGroup,data!M8,data!M40,data!M72)),\"\",CHOOSE(mySelectedAgeGroup,data!M8,data!M40,data!M72))","v":7.2000000000000008E-2},{"$f":"IF(ISBLANK(CHOOSE(mySelectedAgeGroup,data!N8,data!N40,data!N72)),\"\",CHOOSE(mySelectedAgeGroup,data!N8,data!N40,data!N72))","v":5.9000000000000004E-2},{"$f":"IF(ISBLANK(CHOOSE(mySelectedAgeGroup,data!O8,data!O40,data!O72)),\"\",CHOOSE(mySelectedAgeGroup,data!O8,data!O40,data!O72))","v":5.4000000000000006E-2},{"$f":"IF(ISBLANK(CHOOSE(mySelectedAgeGroup,data!P8,data!P40,data!P72)),\"\",CHOOSE(mySelectedAgeGroup,data!P8,data!P40,data!P72))","v":6.4000000000000001E-2},{"$f":"IF(ISBLANK(CHOOSE(mySelectedAgeGroup,data!Q8,data!Q40,data!Q72)),\"\",CHOOSE(mySelectedAgeGroup,data!Q8,data!Q40,data!Q72))","v":6.7000000000000004E-2},{"$f":"IF(ISBLANK(CHOOSE(mySelectedAgeGroup,data!R8,data!R40,data!R72)),\"\",CHOOSE(mySelectedAgeGroup,data!R8,data!R40,data!R72))","v":7.0000000000000007E-2},{"$f":"IF(ISBLANK(CHOOSE(mySelectedAgeGroup,data!S8,data!S40,data!S72)),\"\",CHOOSE(mySelectedAgeGroup,data!S8,data!S40,data!S72))","v":7.0999999999999994E-2},{"$f":"IF(ISBLANK(CHOOSE(mySelectedAgeGroup,data!T8,data!T40,data!T72)),\"\",CHOOSE(mySelectedAgeGroup,data!T8,data!T40,data!T72))","v":7.0000000000000007E-2},{"$f":"IF(ISBLANK(CHOOSE(mySelectedAgeGroup,data!U8,data!U40,data!U72)),\"\",CHOOSE(mySelectedAgeGroup,data!U8,data!U40,data!U72))","v":6.3E-2},{"$f":"IF(ISBLANK(CHOOSE(mySelectedAgeGroup,data!V8,data!V40,data!V72)),\"\",CHOOSE(mySelectedAgeGroup,data!V8,data!V40,data!V72))","v":5.9000000000000004E-2},{"$f":"IF(ISBLANK(CHOOSE(mySelectedAgeGroup,data!W8,data!W40,data!W72)),\"\",CHOOSE(mySelectedAgeGroup,data!W8,data!W40,data!W72))","v":6.6000000000000003E-2},{"$f":"IF(ISBLANK(CHOOSE(mySelectedAgeGroup,data!X8,data!X40,data!X72)),\"\",CHOOSE(mySelectedAgeGroup,data!X8,data!X40,data!X72))","v":7.0000000000000007E-2},{"$f":"IF(ISBLANK(CHOOSE(mySelectedAgeGroup,data!Y8,data!Y40,data!Y72)),\"\",CHOOSE(mySelectedAgeGroup,data!Y8,data!Y40,data!Y72))","v":0.06},{"$f":"IF(ISBLANK(CHOOSE(mySelectedAgeGroup,data!Z8,data!Z40,data!Z72)),\"\",CHOOSE(mySelectedAgeGroup,data!Z8,data!Z40,data!Z72))","v":6.4000000000000001E-2},{"$f":"IF(ISBLANK(CHOOSE(mySelectedAgeGroup,data!AA8,data!AA40,data!AA72)),\"\",CHOOSE(mySelectedAgeGroup,data!AA8,data!AA40,data!AA72))","v":7.0999999999999994E-2},{"$f":"IF(ISBLANK(CHOOSE(mySelectedAgeGroup,data!AB8,data!AB40,data!AB72)),\"\",CHOOSE(mySelectedAgeGroup,data!AB8,data!AB40,data!AB72))","v":7.2999999999999995E-2},{"$f":"IF(ISBLANK(CHOOSE(mySelectedAgeGroup,data!AC8,data!AC40,data!AC72)),\"\",CHOOSE(mySelectedAgeGroup,data!AC8,data!AC40,data!AC72))","v":7.2999999999999995E-2},{"$f":"IF(ISBLANK(CHOOSE(mySelectedAgeGroup,data!AD8,data!AD40,data!AD72)),\"\",CHOOSE(mySelectedAgeGroup,data!AD8,data!AD40,data!AD72))","v":6.8000000000000005E-2},{"$f":"IF(ISBLANK(CHOOSE(mySelectedAgeGroup,data!AE8,data!AE40,data!AE72)),\"\",CHOOSE(mySelectedAgeGroup,data!AE8,data!AE40,data!AE72))","v":6.0999999999999999E-2},{"$f":"IF(ISBLANK(CHOOSE(mySelectedAgeGroup,data!AF8,data!AF40,data!AF72)),\"\",CHOOSE(mySelectedAgeGroup,data!AF8,data!AF40,data!AF72))","v":5.2000000000000005E-2},{"$f":"IF(ISBLANK(CHOOSE(mySelectedAgeGroup,data!AG8,data!AG40,data!AG72)),\"\",CHOOSE(mySelectedAgeGroup,data!AG8,data!AG40,data!AG72))","v":4.5999999999999999E-2},{"$f":"IF(ISBLANK(CHOOSE(mySelectedAgeGroup,data!AH8,data!AH40,data!AH72)),\"\",CHOOSE(mySelectedAgeGroup,data!AH8,data!AH40,data!AH72))","v":4.4999999999999998E-2}]
[null,null,{"$f":"data!B9","v":"Bulgaria"},{"$f":"IF(ISBLANK(CHOOSE(mySelectedAgeGroup,data!D9,data!D41,data!D73)),\"\",CHOOSE(mySelectedAgeGroup,data!D9,data!D41,data!D73))","v":""},{"$f":"IF(ISBLANK(CHOOSE(mySelectedAgeGroup,data!E9,data!E41,data!E73)),\"\",CHOOSE(mySelectedAgeGroup,data!E9,data!E41,data!E73))","v":""},{"$f":"IF(ISBLANK(CHOOSE(mySelectedAgeGroup,data!F9,data!F41,data!F73)),\"\",CHOOSE(mySelectedAgeGroup,data!F9,data!F41,data!F73))","v":""},{"$f":"IF(ISBLANK(CHOOSE(mySelectedAgeGroup,data!G9,data!G41,data!G73)),\"\",CHOOSE(mySelectedAgeGroup,data!G9,data!G41,data!G73))","v":""},{"$f":"IF(ISBLANK(CHOOSE(mySelectedAgeGroup,data!H9,data!H41,data!H73)),\"\",CHOOSE(mySelectedAgeGroup,data!H9,data!H41,data!H73))","v":""},{"$f":"IF(ISBLANK(CHOOSE(mySelectedAgeGroup,data!I9,data!I41,data!I73)),\"\",CHOOSE(mySelectedAgeGroup,data!I9,data!I41,data!I73))","v":""},{"$f":"IF(ISBLANK(CHOOSE(mySelectedAgeGroup,data!J9,data!J41,data!J73)),\"\",CHOOSE(mySelectedAgeGroup,data!J9,data!J41,data!J73))","v":""},{"$f":"IF(ISBLANK(CHOOSE(mySelectedAgeGroup,data!K9,data!K41,data!K73)),\"\",CHOOSE(mySelectedAgeGroup,data!K9,data!K41,data!K73))","v":""},{"$f":"IF(ISBLANK(CHOOSE(mySelectedAgeGroup,data!L9,data!L41,data!L73)),\"\",CHOOSE(mySelectedAgeGroup,data!L9,data!L41,data!L73))","v":""},{"$f":"IF(ISBLANK(CHOOSE(mySelectedAgeGroup,data!M9,data!M41,data!M73)),\"\",CHOOSE(mySelectedAgeGroup,data!M9,data!M41,data!M73))","v":""},{"$f":"IF(ISBLANK(CHOOSE(mySelectedAgeGroup,data!N9,data!N41,data!N73)),\"\",CHOOSE(mySelectedAgeGroup,data!N9,data!N41,data!N73))","v":0.14800000000000002},{"$f":"IF(ISBLANK(CHOOSE(mySelectedAgeGroup,data!O9,data!O41,data!O73)),\"\",CHOOSE(mySelectedAgeGroup,data!O9,data!O41,data!O73))","v":0.17899999999999999},{"$f":"IF(ISBLANK(CHOOSE(mySelectedAgeGroup,data!P9,data!P41,data!P73)),\"\",CHOOSE(mySelectedAgeGroup,data!P9,data!P41,data!P73))","v":0.161},{"$f":"IF(ISBLANK(CHOOSE(mySelectedAgeGroup,data!Q9,data!Q41,data!Q73)),\"\",CHOOSE(mySelectedAgeGroup,data!Q9,data!Q41,data!Q73))","v":0.122},{"$f":"IF(ISBLANK(CHOOSE(mySelectedAgeGroup,data!R9,data!R41,data!R73)),\"\",CHOOSE(mySelectedAgeGroup,data!R9,data!R41,data!R73))","v":0.107},{"$f":"IF(ISBLANK(CHOOSE(mySelectedAgeGroup,data!S9,data!S41,data!S73)),\"\",CHOOSE(mySelectedAgeGroup,data!S9,data!S41,data!S73))","v":8.900000000000001E-2},{"$f":"IF(ISBLANK(CHOOSE(mySelectedAgeGroup,data!T9,data!T41,data!T73)),\"\",CHOOSE(mySelectedAgeGroup,data!T9,data!T41,data!T73))","v":7.9000000000000001E-2},{"$f":"IF(ISBLANK(CHOOSE(mySelectedAgeGroup,data!U9,data!U41,data!U73)),\"\",CHOOSE(mySelectedAgeGroup,data!U9,data!U41,data!U73))","v":6.0999999999999999E-2},{"$f":"IF(ISBLANK(CHOOSE(mySelectedAgeGroup,data!V9,data!V41,data!V73)),\"\",CHOOSE(mySelectedAgeGroup,data!V9,data!V41,data!V73))","v":0.05},{"$f":"IF(ISBLANK(CHOOSE(mySelectedAgeGroup,data!W9,data!W41,data!W73)),\"\",CHOOSE(mySelectedAgeGroup,data!W9,data!W41,data!W73))","v":0.06},{"$f":"IF(ISBLANK(CHOOSE(mySelectedAgeGroup,data!X9,data!X41,data!X73)),\"\",CHOOSE(mySelectedAgeGroup,data!X9,data!X41,data!X73))","v":9.1999999999999998E-2},{"$f":"IF(ISBLANK(CHOOSE(mySelectedAgeGroup,data!Y9,data!Y41,data!Y73)),\"\",CHOOSE(mySelectedAgeGroup,data!Y9,data!Y41,data!Y73))","v":0.10099999999999999},{"$f":"IF(ISBLANK(CHOOSE(mySelectedAgeGroup,data!Z9,data!Z41,data!Z73)),\"\",CHOOSE(mySelectedAgeGroup,data!Z9,data!Z41,data!Z73))","v":0.11},{"$f":"IF(ISBLANK(CHOOSE(mySelectedAgeGroup,data!AA9,data!AA41,data!AA73)),\"\",CHOOSE(mySelectedAgeGroup,data!AA9,data!AA41,data!AA73))","v":0.11800000000000001},{"$f":"IF(ISBLANK(CHOOSE(mySelectedAgeGroup,data!AB9,data!AB41,data!AB73)),\"\",CHOOSE(mySelectedAgeGroup,data!AB9,data!AB41,data!AB73))","v":0.107},{"$f":"IF(ISBLANK(CHOOSE(mySelectedAgeGroup,data!AC9,data!AC41,data!AC73)),\"\",CHOOSE(mySelectedAgeGroup,data!AC9,data!AC41,data!AC73))","v":8.4000000000000005E-2},{"$f":"IF(ISBLANK(CHOOSE(mySelectedAgeGroup,data!AD9,data!AD41,data!AD73)),\"\",CHOOSE(mySelectedAgeGroup,data!AD9,data!AD41,data!AD73))","v":7.0999999999999994E-2},{"$f":"IF(ISBLANK(CHOOSE(mySelectedAgeGroup,data!AE9,data!AE41,data!AE73)),\"\",CHOOSE(mySelectedAgeGroup,data!AE9,data!AE41,data!AE73))","v":5.7999999999999996E-2},{"$f":"IF(ISBLANK(CHOOSE(mySelectedAgeGroup,data!AF9,data!AF41,data!AF73)),\"\",CHOOSE(mySelectedAgeGroup,data!AF9,data!AF41,data!AF73))","v":4.9000000000000002E-2},{"$f":"IF(ISBLANK(CHOOSE(mySelectedAgeGroup,data!AG9,data!AG41,data!AG73)),\"\",CHOOSE(mySelectedAgeGroup,data!AG9,data!AG41,data!AG73))","v":0.04},{"$f":"IF(ISBLANK(CHOOSE(mySelectedAgeGroup,data!AH9,data!AH41,data!AH73)),\"\",CHOOSE(mySelectedAgeGroup,data!AH9,data!AH41,data!AH73))","v":4.3999999999999997E-2}]
[null,null,{"$f":"data!B10","v":"Croatia"},{"$f":"IF(ISBLANK(CHOOSE(mySelectedAgeGroup,data!D10,data!D42,data!D74)),\"\",CHOOSE(mySelectedAgeGroup,data!D10,data!D42,data!D74))","v":""},{"$f":"IF(ISBLANK(CHOOSE(mySelectedAgeGroup,data!E10,data!E42,data!E74)),\"\",CHOOSE(mySelectedAgeGroup,data!E10,data!E42,data!E74))","v":""},{"$f":"IF(ISBLANK(CHOOSE(mySelectedAgeGroup,data!F10,data!F42,data!F74)),\"\",CHOOSE(mySelectedAgeGroup,data!F10,data!F42,data!F74))","v":""},{"$f":"IF(ISBLANK(CHOOSE(mySelectedAgeGroup,data!G10,data!G42,data!G74)),\"\",CHOOSE(mySelectedAgeGroup,data!G10,data!G42,data!G74))","v":""},{"$f":"IF(ISBLANK(CHOOSE(mySelectedAgeGroup,data!H10,data!H42,data!H74)),\"\",CHOOSE(mySelectedAgeGroup,data!H10,data!H42,data!H74))","v":""},{"$f":"IF(ISBLANK(CHOOSE(mySelectedAgeGroup,data!I10,data!I42,data!I74)),\"\",CHOOSE(mySelectedAgeGroup,data!I10,data!I42,data!I74))","v":""},{"$f":"IF(ISBLANK(CHOOSE(mySelectedAgeGroup,data!J10,data!J42,data!J74)),\"\",CHOOSE(mySelectedAgeGroup,data!J10,data!J42,data!J74))","v":""},{"$f":"IF(ISBLANK(CHOOSE(mySelectedAgeGroup,data!K10,data!K42,data!K74)),\"\",CHOOSE(mySelectedAgeGroup,data!K10,data!K42,data!K74))","v":""},{"$f":"IF(ISBLANK(CHOOSE(mySelectedAgeGroup,data!L10,data!L42,data!L74)),\"\",CHOOSE(mySelectedAgeGroup,data!L10,data!L42,data!L74))","v":""},{"$f":"IF(ISBLANK(CHOOSE(mySelectedAgeGroup,data!M10,data!M42,data!M74)),\"\",CHOOSE(mySelectedAgeGroup,data!M10,data!M42,data!M74))","v":""},{"$f":"IF(ISBLANK(CHOOSE(mySelectedAgeGroup,data!N10,data!N42,data!N74)),\"\",CHOOSE(mySelectedAgeGroup,data!N10,data!N42,data!N74))","v":0.125},{"$f":"IF(ISBLANK(CHOOSE(mySelectedAgeGroup,data!O10,data!O42,data!O74)),\"\",CHOOSE(mySelectedAgeGroup,data!O10,data!O42,data!O74))","v":0.128},{"$f":"IF(ISBLANK(CHOOSE(mySelectedAgeGroup,data!P10,data!P42,data!P74)),\"\",CHOOSE(mySelectedAgeGroup,data!P10,data!P42,data!P74))","v":0.11900000000000001},{"$f":"IF(ISBLANK(CHOOSE(mySelectedAgeGroup,data!Q10,data!Q42,data!Q74)),\"\",CHOOSE(mySelectedAgeGroup,data!Q10,data!Q42,data!Q74))","v":0.113},{"$f":"IF(ISBLANK(CHOOSE(mySelectedAgeGroup,data!R10,data!R42,data!R74)),\"\",CHOOSE(mySelectedAgeGroup,data!R10,data!R42,data!R74))","v":0.111},{"$f":"IF(ISBLANK(CHOOSE(mySelectedAgeGroup,data!S10,data!S42,data!S74)),\"\",CHOOSE(mySelectedAgeGroup,data!S10,data!S42,data!S74))","v":0.10300000000000001},{"$f":"IF(ISBLANK(CHOOSE(mySelectedAgeGroup,data!T10,data!T42,data!T74)),\"\",CHOOSE(mySelectedAgeGroup,data!T10,data!T42,data!T74))","v":9.1999999999999998E-2},{"$f":"IF(ISBLANK(CHOOSE(mySelectedAgeGroup,data!U10,data!U42,data!U74)),\"\",CHOOSE(mySelectedAgeGroup,data!U10,data!U42,data!U74))","v":8.199999999999999E-2},{"$f":"IF(ISBLANK(CHOOSE(mySelectedAgeGroup,data!V10,data!V42,data!V74)),\"\",CHOOSE(mySelectedAgeGroup,data!V10,data!V42,data!V74))","v":6.9000000000000006E-2},{"$f":"IF(ISBLANK(CHOOSE(mySelectedAgeGroup,data!W10,data!W42,data!W74)),\"\",CHOOSE(mySelectedAgeGroup,data!W10,data!W42,data!W74))","v":7.4999999999999997E-2},{"$f":"IF(ISBLANK(CHOOSE(mySelectedAgeGroup,data!X10,data!X42,data!X74)),\"\",CHOOSE(mySelectedAgeGroup,data!X10,data!X42,data!X74))","v":9.5000000000000001E-2},{"$f":"IF(ISBLANK(CHOOSE(mySelectedAgeGroup,data!Y10,data!Y42,data!Y74)),\"\",CHOOSE(mySelectedAgeGroup,data!Y10,data!Y42,data!Y74))","v":0.11599999999999999},{"$f":"IF(ISBLANK(CHOOSE(mySelectedAgeGroup,data!Z10,data!Z42,data!Z74)),\"\",CHOOSE(mySelectedAgeGroup,data!Z10,data!Z42,data!Z74))","v":0.13699999999999998},{"$f":"IF(ISBLANK(CHOOSE(mySelectedAgeGroup,data!AA10,data!AA42,data!AA74)),\"\",CHOOSE(mySelectedAgeGroup,data!AA10,data!AA42,data!AA74))","v":0.14400000000000002},{"$f":"IF(ISBLANK(CHOOSE(mySelectedAgeGroup,data!AB10,data!AB42,data!AB74)),\"\",CHOOSE(mySelectedAgeGroup,data!AB10,data!AB42,data!AB74))","v":0.14599999999999999},{"$f":"IF(ISBLANK(CHOOSE(mySelectedAgeGroup,data!AC10,data!AC42,data!AC74)),\"\",CHOOSE(mySelectedAgeGroup,data!AC10,data!AC42,data!AC74))","v":0.13800000000000001},{"$f":"IF(ISBLANK(CHOOSE(mySelectedAgeGroup,data!AD10,data!AD42,data!AD74)),\"\",CHOOSE(mySelectedAgeGroup,data!AD10,data!AD42,data!AD74))","v":0.11199999999999999},{"$f":"IF(ISBLANK(CHOOSE(mySelectedAgeGroup,data!AE10,data!AE42,data!AE74)),\"\",CHOOSE(mySelectedAgeGroup,data!AE10,data!AE42,data!AE74))","v":9.6000000000000002E-2},{"$f":"IF(ISBLANK(CHOOSE(mySelectedAgeGroup,data!AF10,data!AF42,data!AF74)),\"\",CHOOSE(mySelectedAgeGroup,data!AF10,data!AF42,data!AF74))","v":7.0000000000000007E-2},{"$f":"IF(ISBLANK(CHOOSE(mySelectedAgeGroup,data!AG10,data!AG42,data!AG74)),\"\",CHOOSE(mySelectedAgeGroup,data!AG10,data!AG42,data!AG74))","v":5.7000000000000002E-2},{"$f":"IF(ISBLANK(CHOOSE(mySelectedAgeGroup,data!AH10,data!AH42,data!AH74)),\"\",CHOOSE(mySelectedAgeGroup,data!AH10,data!AH42,data!AH74))","v":6.3E-2}]
{"$rows_left_out":172}
{"sheet":"charts","index":4,"n_rows":2,"n_cols":2,"rows_kept":2,"cut":false,"hidden":false,"merged":[]}
[]
[null,"Line and Band Chart"]

{"sheet":"map icon","index":5,"n_rows":2,"n_cols":2,"rows_kept":2,"cut":false,"hidden":false,"merged":[]}
[]
[null,"Map \"Icon\""]