{"text_format":"1","workbook":"xlsx","n_sheets":2,"sheets":["Mapa","Buscador"],"not_rendered":{"charts":0,"images":2,"macros":1,"external_links":0,"defined_names":4,"comments":0,"pivot_tables":0},"unopened":[],"bounds":{"document_bytes":16777216,"sheet_cells":100000,"rows_first":2000,"rows_last":500,"rows_between":2000,"halvings":0,"cell_chars":16384,"cell_head_chars":4096},"cells_cut":0,"cells_raw":0,"read":"whole","date_system":"1900"}

{"sheet":"Mapa","index":0,"n_rows":1,"n_cols":2,"rows_kept":1,"cut":false,"hidden":false,"merged":[]}
[null,""]

{"sheet":"Buscador","index":1,"n_rows":244,"n_cols":11,"rows_kept":244,"cut":false,"hidden":false,"merged":[]}
["Países",null,"Países buscados",null,"Países no repetidos",null,"Países ordenados",null,"Países listados",null,""]
["Afganistán",null,{"$f":"IF(IFERROR(VLOOKUP(miDesplegable&\"*\",$A2:$A$244,1,FALSE),\"\")=\"\",\"\",IFERROR(VLOOKUP(miDesplegable&\"*\",$A2:$A$244,1,FALSE),\"\"))","v":"Afganistán"},null,{"$f":"IFERROR(INDEX(TablaPaísesBuscados[],MATCH(ROW(TablaPaísesBuscados[])+1-ROW(INDEX(TablaPaísesBuscados[],1)),COUNTIF(TablaPaísesBuscados[],\"<=\"&INDEX(IFERROR(TablaPaísesBuscados[]&\"\",0),ROW(TablaPaísesBuscados[])+1-ROW(INDEX(TablaPaísesBuscados[],1)))),0)),\"\")","v":"Afganistán"},null,{"$f":"IFERROR(INDEX($E$2:$E$244,SMALL(IF(IFERROR($E$2:$E$244&\"\",\"\")=\"\",\"\",MATCH(ROW($E$2:$E$244),ROW($E$2:$E$244),0)),ROW($E$2:$E$244)+1-ROW(INDEX($E$2:$E$244,1))))&\"\",\"\")","v":"Afganistán"},null,{"$f":"INDEX(Buscador!$G$2:$G$244,1):INDEX(Buscador!$G$2:$G$244,MAX(1,COUNTIF(Buscador!$G$2:$G$244,\"?*\")))","v":"Afganistán"},null,"Buscador de países"]
["Albania",null,{"$f":"IF(IFERROR(VLOOKUP(miDesplegable&\"*\",$A3:$A$244,1,FALSE),\"\")=\"\",\"\",IFERROR(VLOOKUP(miDesplegable&\"*\",$A3:$A$244,1,FALSE),\"\"))","v":"Albania"},null,"Albania",null,"Albania",null,"Albania",null,""]
["Alemania",null,{"$f":"IF(IFERROR(VLOOKUP(miDesplegable&\"*\",$A4:$A$244,1,FALSE),\"\")=\"\",\"\",IFERROR(VLOOKUP(miDesplegable&\"*\",$A4:$A$244,1,FALSE),\"\"))","v":"Alemania"},null,"Alemania",null,"Alemania",null,"Alemania"]
["Andorra",null,{"$f":"IF(IFERROR(VLOOKUP(miDesplegable&\"*\",$A5:$A$244,1,FALSE),\"\")=\"\",\"\",IFERROR(VLOOKUP(miDesplegable&\"*\",$A5:$A$244,1,FALSE),\"\"))","v":"Andorra"},null,"Andorra",null,"Andorra",null,"Andorra"]
["Angola",null,{"$f":"IF(IFERROR(VLOOKUP(miDesplegable&\"*\",$A6:$A$244,1,FALSE),\"\")=\"\",\"\",IFERROR(VLOOKUP(miDesplegable&\"*\",$A6:$A$244,1,FALSE),\"\"))","v":"Angola"},null,"Angola",null,"Angola",null,"Angola"]
["Anguila",null,{"$f":"IF(IFERROR(VLOOKUP(miDesplegable&\"*\",$A7:$A$244,1,FALSE),\"\")=\"\",\"\",IFERROR(VLOOKUP(miDesplegable&\"*\",$A7:$A$244,1,FALSE),\"\"))","v":"Anguila"},null,"Anguila",null,"Anguila",null,"Anguila","Blog:","#ExcelPedroWave"]
["Antigua y Barbuda",null,{"$f":"IF(IFERROR(VLOOKUP(miDesplegable&\"*\",$A8:$A$244,1,FALSE),\"\")=\"\",\"\",IFERROR(VLOOKUP(miDesplegable&\"*\",$A8:$A$244,1,FALSE),\"\"))","v":"Antigua y Barbuda"},null,"Antigua y Barbuda",null,"Antigua y Barbuda",null,"Antigua y Barbuda","YouTube:","Excel Pedro Wave"]
["Arabia Saudita",null,{"$f":"IF(IFERROR(VLOOKUP(miDesplegable&\"*\",$A9:$A$244,1,FALSE),\"\")=\"\",\"\",IFERROR(VLOOKUP(miDesplegable&\"*\",$A9:$A$244,1,FALSE),\"\"))","v":"Arabia Saudita"},null,"Arabia Saudita",null,"Arabia Saudita",null,"Arabia Saudita","Copyright:","Creative Commons 3.0"]
["Argelia",null,{"$f":"IF(IFERROR(VLOOKUP(miDesplegable&\"*\",$A10:$A$244,1,FALSE),\"\")=\"\",\"\",IFERROR(VLOOKUP(miDesplegable&\"*\",$A10:$A$244,1,FALSE),\"\"))","v":"Argelia"},null,"Argelia",null,"Argelia",null,"Argelia"]
["Argentina",null,{"$f":"IF(IFERROR(VLOOKUP(miDesplegable&\"*\",$A11:$A$244,1,FALSE),\"\")=\"\",\"\",IFERROR(VLOOKUP(miDesplegable&\"*\",$A11:$A$244,1,FALSE),\"\"))","v":"Argentina"},null,"Argentina",null,"Argentina",null,"Argentina"]
["Armenia",null,{"$f":"IF(IFERROR(VLOOKUP(miDesplegable&\"*\",$A12:$A$244,1,FALSE),\"\")=\"\",\"\",IFERROR(VLOOKUP(miDesplegable&\"*\",$A12:$A$244,1,FALSE),\"\"))","v":"Armenia"},null,"Armenia",null,"Armenia",null,"Armenia"]
["Aruba",null,{"$f":"IF(IFERROR(VLOOKUP(miDesplegable&\"*\",$A13:$A$244,1,FALSE),\"\")=\"\",\"\",IFERROR(VLOOKUP(miDesplegable&\"*\",$A13:$A$244,1,FALSE),\"\"))","v":"Aruba"},null,"Aruba",null,"Aruba",null,"Aruba"]
["Australia",null,{"$f":"IF(IFERROR(VLOOKUP(miDesplegable&\"*\",$A14:$A$244,1,FALSE),\"\")=\"\",\"\",IFERROR(VLOOKUP(miDesplegable&\"*\",$A14:$A$244,1,FALSE),\"\"))","v":"Australia"},null,"Australia",null,"Australia",null,"Australia"]
["Austria",null,{"$f":"IF(IFERROR(VLOOKUP(miDesplegable&\"*\",$A15:$A$244,1,FALSE),\"\")=\"\",\"\",IFERROR(VLOOKUP(miDesplegable&\"*\",$A15:$A$244,1,FALSE),\"\"))","v":"Austria"},null,"Austria",null,"Austria",null,"Austria"]
["Azerbaiyán",null,{"$f":"IF(IFERROR(VLOOKUP(miDesplegable&\"*\",$A16:$A$244,1,FALSE),\"\")=\"\",\"\",IFERROR(VLOOKUP(miDesplegable&\"*\",$A16:$A$244,1,FALSE),\"\"))","v":"Azerbaiyán"},null,"Azerbaiyán",null,"Azerbaiyán",null,"Azerbaiyán"]
["Bahamas",null,{"$f":"IF(IFERROR(VLOOKUP(miDesplegable&\"*\",$A17:$A$244,1,FALSE),\"\")=\"\",\"\",IFERROR(VLOOKUP(miDesplegable&\"*\",$A17:$A$244,1,FALSE),\"\"))","v":"Bahamas"},null,"Bahamas",null,"Bahamas",null,"Bahamas"]
["Bangladés",null,{"$f":"IF(IFERROR(VLOOKUP(miDesplegable&\"*\",$A18:$A$244,1,FALSE),\"\")=\"\",\"\",IFERROR(VLOOKUP(miDesplegable&\"*\",$A18:$A$244,1,FALSE),\"\"))","v":"Bangladés"},null,"Bangladés",null,"Bangladés",null,"Bangladés"]
["Barbados",null,{"$f":"IF(IFERROR(VLOOKUP(miDesplegable&\"*\",$A19:$A$244,1,FALSE),\"\")=\"\",\"\",IFERROR(VLOOKUP(miDesplegable&\"*\",$A19:$A$244,1,FALSE),\"\"))","v":"Barbados"},null,"Barbados",null,"Barbados",null,"Barbados"]
["Baréin",null,{"$f":"IF(IFERROR(VLOOKUP(miDesplegable&\"*\",$A20:$A$244,1,FALSE),\"\")=\"\",\"\",IFERROR(VLOOKUP(miDesplegable&\"*\",$A20:$A$244,1,FALSE),\"\"))","v":"Baréin"},null,"Baréin",null,"Baréin",null,"Baréin"]
["Bélgica",null,{"$f":"IF(IFERROR(VLOOKUP(miDesplegable&\"*\",$A21:$A$244,1,FALSE),\"\")=\"\",\"\",IFERROR(VLOOKUP(miDesplegable&\"*\",$A21:$A$244,1,FALSE),\"\"))","v":"Bélgica"},null,"Bélgica",null,"Bélgica",null,"Bélgica"]
["Belice",null,{"$f":"IF(IFERROR(VLOOKUP(miDesplegable&\"*\",$A22:$A$244,1,FALSE),\"\")=\"\",\"\",IFERROR(VLOOKUP(miDesplegable&\"*\",$A22:$A$244,1,FALSE),\"\"))","v":"Belice"},null,"Belice",null,"Belice",null,"Belice"]
["Benín",null,{"$f":"IF(IFERROR(VLOOKUP(miDesplegable&\"*\",$A23:$A$244,1,FALSE),\"\")=\"\",\"\",IFERROR(VLOOKUP(miDesplegable&\"*\",$A23:$A$244,1,FALSE),\"\"))","v":"Benín"},null,"Benín",null,"Benín",null,"Benín"]
["Bermudas",null,{"$f":"IF(IFERROR(VLOOKUP(miDesplegable&\"*\",$A24:$A$244,1,FALSE),\"\")=\"\",\"\",IFERROR(VLOOKUP(miDesplegable&\"*\",$A24:$A$244,1,FALSE),\"\"))","v":"Bermudas"},null,"Bermudas",null,"Bermudas",null,"Bermudas"]
["Bielorrusia",null,{"$f":"IF(IFERROR(VLOOKUP(miDesplegable&\"*\",$A25:$A$244,1,FALSE),\"\")=\"\",\"\",IFERROR(VLOOKUP(miDesplegable&\"*\",$A25:$A$244,1,FALSE),\"\"))","v":"Bielorrusia"},null,"Bielorrusia",null,"Bielorrusia",null,"Bielorrusia"]
["Birmania",null,{"$f":"IF(IFERROR(VLOOKUP(miDesplegable&\"*\",$A26:$A$244,1,FALSE),\"\")=\"\",\"\",IFERROR(VLOOKUP(miDesplegable&\"*\",$A26:$A$244,1,FALSE),\"\"))","v":"Birmania"},null,"Birmania",null,"Birmania",null,"Birmania"]
["Bolivia",null,{"$f":"IF(IFERROR(VLOOKUP(miDesplegable&\"*\",$A27:$A$244,1,FALSE),\"\")=\"\",\"\",IFERROR(VLOOKUP(miDesplegable&\"*\",$A27:$A$244,1,FALSE),\"\"))","v":"Bolivia"},null,"Bolivia",null,"Bolivia",null,"Bolivia"]
["Bosnia y Herzegovina",null,{"$f":"IF(IFERROR(VLOOKUP(miDesplegable&\"*\",$A28:$A$244,1,FALSE),\"\")=\"\",\"\",IFERROR(VLOOKUP(miDesplegable&\"*\",$A28:$A$244,1,FALSE),\"\"))","v":"Bosnia y Herzegovina"},null,"Bosnia y Herzegovina",null,"Bosnia y Herzegovina",null,"Bosnia y Herzegovina"]
["Botsuana",null,{"$f":"IF(IFERROR(VLOOKUP(miDesplegable&\"*\",$A29:$A$244,1,FALSE),\"\")=\"\",\"\",IFERROR(VLOOKUP(miDesplegable&\"*\",$A29:$A$244,1,FALSE),\"\"))","v":"Botsuana"},null,"Botsuana",null,"Botsuana",null,"Botsuana"]
["Brasil",null,{"$f":"IF(IFERROR(VLOOKUP(miDesplegable&\"*\",$A30:$A$244,1,FALSE),\"\")=\"\",\"\",IFERROR(VLOOKUP(miDesplegable&\"*\",$A30:$A$244,1,FALSE),\"\"))","v":"Brasil"},null,"Brasil",null,"Brasil",null,"Brasil"]
["Brunéi",null,{"$f":"IF(IFERROR(VLOOKUP(miDesplegable&\"*\",$A31:$A$244,1,FALSE),\"\")=\"\",\"\",IFERROR(VLOOKUP(miDesplegable&\"*\",$A31:$A$244,1,FALSE),\"\"))","v":"Brunéi"},null,"Brunéi",null,"Brunéi",null,"Brunéi"]
["Bulgaria",null,{"$f":"IF(IFERROR(VLOOKUP(miDesplegable&\"*\",$A32:$A$244,1,FALSE),\"\")=\"\",\"\",IFERROR(VLOOKUP(miDesplegable&\"*\",$A32:$A$244,1,FALSE),\"\"))","v":"Bulgaria"},null,"Bulgaria",null,"Bulgaria",null,"Bulgaria"]
["Burkina Faso",null,{"$f":"IF(IFERROR(VLOOKUP(miDesplegable&\"*\",$A33:$A$244,1,FALSE),\"\")=\"\",\"\",IFERROR(VLOOKUP(miDesplegable&\"*\",$A33:$A$244,1,FALSE),\"\"))","v":"Burkina Faso"},null,"Burkina Faso",null,"Burkina Faso",null,"Burkina Faso"]
["Burundi",null,{"$f":"IF(IFERROR(VLOOKUP(miDesplegable&\"*\",$A34:$A$244,1,FALSE),\"\")=\"\",\"\",IFERROR(VLOOKUP(miDesplegable&\"*\",$A34:$A$244,1,FALSE),\"\"))","v":"Burundi"},null,"Burundi",null,"Burundi",null,"Burundi"]
["Bután",null,{"$f":"IF(IFERROR(VLOOKUP(miDesplegable&\"*\",$A35:$A$244,1,FALSE),\"\")=\"\",\"\",IFERROR(VLOOKUP(miDesplegable&\"*\",$A35:$A$244,1,FALSE),\"\"))","v":"Bután"},null,"Bután",null,"Bután",null,"Bután"]
["Cabo Verde",null,{"$f":"IF(IFERROR(VLOOKUP(miDesplegable&\"*\",$A36:$A$244,1,FALSE),\"\")=\"\",\"\",IFERROR(VLOOKUP(miDesplegable&\"*\",$A36:$A$244,1,FALSE),\"\"))","v":"Cabo Verde"},null,"Cabo Verde",null,"Cabo Verde",null,"Cabo Verde"]
["Camboya",null,{"$f":"IF(IFERROR(VLOOKUP(miDesplegable&\"*\",$A37:$A$244,1,FALSE),\"\")=\"\",\"\",IFERROR(VLOOKUP(miDesplegable&\"*\",$A37:$A$244,1,FALSE),\"\"))","v":"Camboya"},null,"Camboya",null,"Camboya",null,"Camboya"]
["Camerún",null,{"$f":"IF(IFERROR(VLOOKUP(miDesplegable&\"*\",$A38:$A$244,1,FALSE),\"\")=\"\",\"\",IFERROR(VLOOKUP(miDesplegable&\"*\",$A38:$A$244,1,FALSE),\"\"))","v":"Camerún"},null,"Camerún",null,"Camerún",null,"Camerún"]
["Canadá",null,{"$f":"IF(IFERROR(VLOOKUP(miDesplegable&\"*\",$A39:$A$244,1,FALSE),\"\")=\"\",\"\",IFERROR(VLOOKUP(miDesplegable&\"*\",$A39:$A$244,1,FALSE),\"\"))","v":"Canadá"},null,"Canadá",null,"Canadá",null,"Canadá"]
["Caribe Neerlandés",null,{"$f":"IF(IFERROR(VLOOKUP(miDesplegable&\"*\",$A40:$A$244,1,FALSE),\"\")=\"\",\"\",IFERROR(VLOOKUP(miDesplegable&\"*\",$A40:$A$244,1,FALSE),\"\"))","v":"Caribe Neerlandés"},null,"Caribe Neerlandés",null,"Caribe Neerlandés",null,"Caribe Neerlandés"]
["Catar",null,{"$f":"IF(IFERROR(VLOOKUP(miDesplegable&\"*\",$A41:$A$244,1,FALSE),\"\")=\"\",\"\",IFERROR(VLOOKUP(miDesplegable&\"*\",$A41:$A$244,1,FALSE),\"\"))","v":"Catar"},null,"Catar",null,"Catar",null,"Catar"]
["Chad",null,{"$f":"IF(IFERROR(VLOOKUP(miDesplegable&\"*\",$A42:$A$244,1,FALSE),\"\")=\"\",\"\",IFERROR(VLOOKUP(miDesplegable&\"*\",$A42:$A$244,1,FALSE),\"\"))","v":"Chad"},null,"Chad",null,"Chad",null,"Chad"]
["Chile",null,{"$f":"IF(IFERROR(VLOOKUP(miDesplegable&\"*\",$A43:$A$244,1,FALSE),\"\")=\"\",\"\",IFERROR(VLOOKUP(miDesplegable&\"*\",$A43:$A$244,1,FALSE),\"\"))","v":"Chile"},null,"Chile",null,"Chile",null,"Chile"]
["China",null,{"$f":"IF(IFERROR(VLOOKUP(miDesplegable&\"*\",$A44:$A$244,1,FALSE),\"\")=\"\",\"\",IFERROR(VLOOKUP(miDesplegable&\"*\",$A44:$A$244,1,FALSE),\"\"))","v":"China"},null,"China",null,"China",null,"China"]
["Chipre",null,{"$f":"IF(IFERROR(VLOOKUP(miDesplegable&\"*\",$A45:$A$244,1,FALSE),\"\")=\"\",\"\",IFERROR(VLOOKUP(miDesplegable&\"*\",$A45:$A$244,1,FALSE),\"\"))","v":"Chipre"},null,"Chipre",null,"Chipre",null,"Chipre"]
["Ciudad del Vaticano",null,{"$f":"IF(IFERROR(VLOOKUP(miDesplegable&\"*\",$A46:$A$244,1,FALSE),\"\")=\"\",\"\",IFERROR(VLOOKUP(miDesplegable&\"*\",$A46:$A$244,1,FALSE),\"\"))","v":"Ciudad del Vaticano"},null,"Ciudad del Vaticano",null,"Ciudad del Vaticano",null,"Ciudad del Vaticano"]
["Colombia",null,{"$f":"IF(IFERROR(VLOOKUP(miDesplegable&\"*\",$A47:$A$244,1,FALSE),\"\")=\"\",\"\",IFERROR(VLOOKUP(miDesplegable&\"*\",$A47:$A$244,1,FALSE),\"\"))","v":"Colombia"},null,"Colombia",null,"Colombia",null,"Colombia"]
["Comoras",null,{"$f":"IF(IFERROR(VLOOKUP(miDesplegable&\"*\",$A48:$A$244,1,FALSE),\"\")=\"\",\"\",IFERROR(VLOOKUP(miDesplegable&\"*\",$A48:$A$244,1,FALSE),\"\"))","v":"Comoras"},null,"Comoras",null,"Comoras",null,"Comoras"]
["Corea del Norte",null,{"$f":"IF(IFERROR(VLOOKUP(miDesplegable&\"*\",$A49:$A$244,1,FALSE),\"\")=\"\",\"\",IFERROR(VLOOKUP(miDesplegable&\"*\",$A49:$A$244,1,FALSE),\"\"))","v":"Corea del Norte"},null,"Corea del Norte",null,"Corea del Norte",null,"Corea del Norte"]
["Corea del Sur",null,{"$f":"IF(IFERROR(VLOOKUP(miDesplegable&\"*\",$A50:$A$244,1,FALSE),\"\")=\"\",\"\",IFERROR(VLOOKUP(miDesplegable&\"*\",$A50:$A$244,1,FALSE),\"\"))","v":"Corea del Sur"},null,"Corea del Sur",null,"Corea del Sur",null,"Corea del Sur"]
["Costa de Marfil",null,{"$f":"IF(IFERROR(VLOOKUP(miDesplegable&\"*\",$A51:$A$244,1,FALSE),\"\")=\"\",\"\",IFERROR(VLOOKUP(miDesplegable&\"*\",$A51:$A$244,1,FALSE),\"\"))","v":"Costa de Marfil"},null,"Costa de Marfil",null,"Costa de Marfil",null,"Costa de Marfil"]
["Costa Rica",null,{"$f":"IF(IFERROR(VLOOKUP(miDesplegable&\"*\",$A52:$A$244,1,FALSE),\"\")=\"\",\"\",IFERROR(VLOOKUP(miDesplegable&\"*\",$A52:$A$244,1,FALSE),\"\"))","v":"Costa Rica"},null,"Costa Rica",null,"Costa Rica",null,"Costa Rica"]
["Crimea - Ucrania",null,{"$f":"IF(IFERROR(VLOOKUP(miDesplegable&\"*\",$A53:$A$244,1,FALSE),\"\")=\"\",\"\",IFERROR(VLOOKUP(miDesplegable&\"*\",$A53:$A$244,1,FALSE),\"\"))","v":"Crimea - Ucrania"},null,"Crimea - Ucrania",null,"Crimea - Ucrania",null,"Crimea - Ucrania"]
["Croacia",null,{"$f":"IF(IFERROR(VLOOKUP(miDesplegable&\"*\",$A54:$A$244,1,FALSE),\"\")=\"\",\"\",IFERROR(VLOOKUP(miDesplegable&\"*\",$A54:$A$244,1,FALSE),\"\"))","v":"Croacia"},null,"Croacia",null,"Croacia",null,"Croacia"]
["Cuba",null,{"$f":"IF(IFERROR(VLOOKUP(miDesplegable&\"*\",$A55:$A$244,1,FALSE),\"\")=\"\",\"\",IFERROR(VLOOKUP(miDesplegable&\"*\",$A55:$A$244,1,FALSE),\"\"))","v":"Cuba"},null,"Cuba",null,"Cuba",null,"Cuba"]
["Curazao",null,{"$f":"IF(IFERROR(VLOOKUP(miDesplegable&\"*\",$A56:$A$244,1,FALSE),\"\")=\"\",\"\",IFERROR(VLOOKUP(miDesplegable&\"*\",$A56:$A$244,1,FALSE),\"\"))","v":"Curazao"},null,"Curazao",null,"Curazao",null,"Curazao"]
["Dinamarca",null,{"$f":"IF(IFERROR(VLOOKUP(miDesplegable&\"*\",$A57:$A$244,1,FALSE),\"\")=\"\",\"\",IFERROR(VLOOKUP(miDesplegable&\"*\",$A57:$A$244,1,FALSE),\"\"))","v":"Dinamarca"},null,"Dinamarca",null,"Dinamarca",null,"Dinamarca"]
["Dominica",null,{"$f":"IF(IFERROR(VLOOKUP(miDesplegable&\"*\",$A58:$A$244,1,FALSE),\"\")=\"\",\"\",IFERROR(VLOOKUP(miDesplegable&\"*\",$A58:$A$244,1,FALSE),\"\"))","v":"Dominica"},null,"Dominica",null,"Dominica",null,"Dominica"]
["Ecuador",null,{"$f":"IF(IFERROR(VLOOKUP(miDesplegable&\"*\",$A59:$A$244,1,FALSE),\"\")=\"\",\"\",IFERROR(VLOOKUP(miDesplegable&\"*\",$A59:$A$244,1,FALSE),\"\"))","v":"Ecuador"},null,"Ecuador",null,"Ecuador",null,"Ecuador"]
["Egipto",null,{"$f":"IF(IFERROR(VLOOKUP(miDesplegable&\"*\",$A60:$A$244,1,FALSE),\"\")=\"\",\"\",IFERROR(VLOOKUP(miDesplegable&\"*\",$A60:$A$244,1,FALSE),\"\"))","v":"Egipto"},null,"Egipto",null,"Egipto",null,"Egipto"]
["El Salvador",null,{"$f":"IF(IFERROR(VLOOKUP(miDesplegable&\"*\",$A61:$A$244,1,FALSE),\"\")=\"\",\"\",IFERROR(VLOOKUP(miDesplegable&\"*\",$A61:$A$244,1,FALSE),\"\"))","v":"El Salvador"},null,"El Salvador",null,"El Salvador",null,"El Salvador"]
["Emiratos Árabes Unidos",null,{"$f":"IF(IFERROR(VLOOKUP(miDesplegable&\"*\",$A62:$A$244,1,FALSE),\"\")=\"\",\"\",IFERROR(VLOOKUP(miDesplegable&\"*\",$A62:$A$244,1,FALSE),\"\"))","v":"Emiratos Árabes Unidos"},null,"Emiratos Árabes Unidos",null,"Emiratos Árabes Unidos",null,"Emiratos Árabes Unidos"]
["Eritrea",null,{"$f":"IF(IFERROR(VLOOKUP(miDesplegable&\"*\",$A63:$A$244,1,FALSE),\"\")=\"\",\"\",IFERROR(VLOOKUP(miDesplegable&\"*\",$A63:$A$244,1,FALSE),\"\"))","v":"Eritrea"},null,"Eritrea",null,"Eritrea",null,"Eritrea"]
["Eslovaquia",null,{"$f":"IF(IFERROR(VLOOKUP(miDesplegable&\"*\",$A64:$A$244,1,FALSE),\"\")=\"\",\"\",IFERROR(VLOOKUP(miDesplegable&\"*\",$A64:$A$244,1,FALSE),\"\"))","v":"Eslovaquia"},null,"Eslovaquia",null,"Eslovaquia",null,"Eslovaquia"]
["Eslovenia",null,{"$f":"IF(IFERROR(VLOOKUP(miDesplegable&\"*\",$A65:$A$244,1,FALSE),\"\")=\"\",\"\",IFERROR(VLOOKUP(miDesplegable&\"*\",$A65:$A$244,1,FALSE),\"\"))","v":"Eslovenia"},null,"Eslovenia",null,"Eslovenia",null,"Eslovenia"]
["España",null,{"$f":"IF(IFERROR(VLOOKUP(miDesplegable&\"*\",$A66:$A$244,1,FALSE),\"\")=\"\",\"\",IFERROR(VLOOKUP(miDesplegable&\"*\",$A66:$A$244,1,FALSE),\"\"))","v":"España"},null,"España",null,"España",null,"España"]
["Estados Unidos",null,{"$f":"IF(IFERROR(VLOOKUP(miDesplegable&\"*\",$A67:$A$244,1,FALSE),\"\")=\"\",\"\",IFERROR(VLOOKUP(miDesplegable&\"*\",$A67:$A$244,1,FALSE),\"\"))","v":"Estados Unidos"},null,"Estados Unidos",null,"Estados Unidos",null,"Estados Unidos"]
["Estonia",null,{"$f":"IF(IFERROR(VLOOKUP(miDesplegable&\"*\",$A68:$A$244,1,FALSE),\"\")=\"\",\"\",IFERROR(VLOOKUP(miDesplegable&\"*\",$A68:$A$244,1,FALSE),\"\"))","v":"Estonia"},null,"Estonia",null,"Estonia",null,"Estonia"]
["Etiopía",null,{"$f":"IF(IFERROR(VLOOKUP(miDesplegable&\"*\",$A69:$A$244,1,FALSE),\"\")=\"\",\"\",IFERROR(VLOOKUP(miDesplegable&\"*\",$A69:$A$244,1,FALSE),\"\"))","v":"Etiopía"},null,"Etiopía",null,"Etiopía",null,"Etiopía"]
["Filipinas",null,{"$f":"IF(IFERROR(VLOOKUP(miDesplegable&\"*\",$A70:$A$244,1,FALSE),\"\")=\"\",\"\",IFERROR(VLOOKUP(miDesplegable&\"*\",$A70:$A$244,1,FALSE),\"\"))","v":"Filipinas"},null,"Filipinas",null,"Filipinas",null,"Filipinas"]
["Finlandia",null,{"$f":"IF(IFERROR(VLOOKUP(miDesplegable&\"*\",$A71:$A$244,1,FALSE),\"\")=\"\",\"\",IFERROR(VLOOKUP(miDesplegable&\"*\",$A71:$A$244,1,FALSE),\"\"))","v":"Finlandia"},null,"Finlandia",null,"Finlandia",null,"Finlandia"]
["Fiyi",null,{"$f":"IF(IFERROR(VLOOKUP(miDesplegable&\"*\",$A72:$A$244,1,FALSE),\"\")=\"\",\"\",IFERROR(VLOOKUP(miDesplegable&\"*\",$A72:$A$244,1,FALSE),\"\"))","v":"Fiyi"},null,"Fiyi",null,"Fiyi",null,"Fiyi"]
["Francia",null,{"$f":"IF(IFERROR(VLOOKUP(miDesplegable&\"*\",$A73:$A$244,1,FALSE),\"\")=\"\",\"\",IFERROR(VLOOKUP(miDesplegable&\"*\",$A73:$A$244,1,FALSE),\"\"))","v":"Francia"},null,"Francia",null,"Francia",null,"Francia"]
["Gabón",null,{"$f":"IF(IFERROR(VLOOKUP(miDesplegable&\"*\",$A74:$A$244,1,FALSE),\"\")=\"\",\"\",IFERROR(VLOOKUP(miDesplegable&\"*\",$A74:$A$244,1,FALSE),\"\"))","v":"Gabón"},null,"Gabón",null,"Gabón",null,"Gabón"]
["Gambia",null,{"$f":"IF(IFERROR(VLOOKUP(miDesplegable&\"*\",$A75:$A$244,1,FALSE),\"\")=\"\",\"\",IFERROR(VLOOKUP(miDesplegable&\"*\",$A75:$A$244,1,FALSE),\"\"))","v":"Gambia"},null,"Gambia",null,"Gambia",null,"Gambia"]
["Georgia",null,{"$f":"IF(IFERROR(VLOOKUP(miDesplegable&\"*\",$A76:$A$244,1,FALSE),\"\")=\"\",\"\",IFERROR(VLOOKUP(miDesplegable&\"*\",$A76:$A$244,1,FALSE),\"\"))","v":"Georgia"},null,"Georgia",null,"Georgia",null,"Georgia"]
["Ghana",null,{"$f":"IF(IFERROR(VLOOKUP(miDesplegable&\"*\",$A77:$A$244,1,FALSE),\"\")=\"\",\"\",IFERROR(VLOOKUP(miDesplegable&\"*\",$A77:$A$244,1,FALSE),\"\"))","v":"Ghana"},null,"Ghana",null,"Ghana",null,"Ghana"]
["Gibraltar",null,{"$f":"IF(IFERROR(VLOOKUP(miDesplegable&\"*\",$A78:$A$244,1,FALSE),\"\")=\"\",\"\",IFERROR(VLOOKUP(miDesplegable&\"*\",$A78:$A$244,1,FALSE),\"\"))","v":"Gibraltar"},null,"Gibraltar",null,"Gibraltar",null,"Gibraltar"]
["Granada",null,{"$f":"IF(IFERROR(VLOOKUP(miDesplegable&\"*\",$A79:$A$244,1,FALSE),\"\")=\"\",\"\",IFERROR(VLOOKUP(miDesplegable&\"*\",$A79:$A$244,1,FALSE),\"\"))","v":"Granada"},null,"Granada",null,"Granada",null,"Granada"]
["Grecia",null,{"$f":"IF(IFERROR(VLOOKUP(miDesplegable&\"*\",$A80:$A$244,1,FALSE),\"\")=\"\",\"\",IFERROR(VLOOKUP(miDesplegable&\"*\",$A80:$A$244,1,FALSE),\"\"))","v":"Grecia"},null,"Grecia",null,"Grecia",null,"Grecia"]
{"$rows_left_out":164}