{"text_format":"1","workbook":"xlsx","n_sheets":8,"sheets":["Mapa","Información","Fronteras","Banderas","Países","Nombres","Population","Datos"],"not_rendered":{"charts":0,"images":252,"macros":1,"external_links":0,"defined_names":27,"comments":0,"pivot_tables":0},"unopened":[],"bounds":{"document_bytes":16777216,"sheet_cells":100000,"rows_first":2000,"rows_last":500,"rows_between":2000,"halvings":0,"cell_chars":16384,"cell_head_chars":4096},"cells_cut":0,"cells_raw":0,"read":"whole","date_system":"1900"}

{"sheet":"Mapa","index":0,"n_rows":23,"n_cols":2,"rows_kept":23,"cut":false,"hidden":false,"merged":[]}
[]
[]
[]
[]
[]
[]
[]
[]
[]
[]
[]
[]
[]
[]
[]
[]
[]
[]
[]
[]
[]
["X = ",0]
["Y = ",0]

{"sheet":"Información","index":1,"n_rows":20,"n_cols":11,"rows_kept":20,"cut":false,"hidden":false,"merged":[[8,1,9,6],[10,1,11,6],[12,1,13,6],[1,1,2,6],[3,1,4,6],[5,1,5,6],[6,1,6,6],[7,1,7,6]]}
[null,null,null,null,null,null,null,"Y"]
[null,{"$f":"IF(ISNUMBER(miPaís),\nHYPERLINK(\"https://es.wikipedia.org/wiki/\" & IF(miSelección=\"\",\"Anexo:Países\",LEFT(miSelección,IFERROR(FIND(\" - \",miSelección)-1,LEN(miSelección)))),IF(miSelección=\"\",\"Seleccionar algún país\",miSelección&\"\")),\nHYPERLINK(\"https://es.wikipedia.org/wiki/\" & IF(miPaís=\"\",\"Anexo:Países\",LEFT(miPaís,IFERROR(FIND(\" - \",miPaís)-1,LEN(miPaís)))),IF(miPaís=\"\",\"Seleccionar algún país\",miPaís&\"\")))","v":"Seleccionar algún país"},null,null,null,null,null,1,null,"Blog:","Puntero al mapa de África | #ExcelPedroWave"]
[null,null,null,null,null,null,null,2,null,"YouTube:","Excel Pedro Wave"]
[null,{"$f":"IF(miSelección=\"\",\"\",IFERROR(INDEX(TablaPaíses[Nombre oficial],miFilaPaíses),\"\"))","v":""},null,null,null,null,null,3,null,"Copyright:","Creative Commons 3.0"]
[null,null,null,null,null,null,null,4,null,"Población:","Countries by population (countrymeters.info)"]
[null,{"$f":"IF(miSelección=\"\",\"\",IFERROR(\"Capital: \"&INDEX(Datos[Capital],miFilaDatos)&\"\",\"\"))","v":""},null,null,null,null,null,5,null,"Wikipedia:","Anexo:Países - Wikipedia"]
[null,{"$f":"IF(miSelección=\"\",\"\",IFERROR(INDEX(TablaPaíses[Población],miFilaPaíses),\"\"))","v":""},null,null,null,null,null,6]
[null,{"$f":"IF(miSelección=\"\",\"\",IFERROR(INDEX(Datos[Superficie (km²)],miFilaDatos),\"\"))","v":""},null,null,null,null,null,7,null,"URL:","https://es.wikipedia.org/wiki/Riyal saudí"]
[null,{"$f":"IF(miSelección=\"\",\"\",IFERROR(\"Idiomas: \" & INDEX(Datos[Idiomas],miFilaDatos),\"\"))","v":""},null,null,null,null,null,8]
[null,null,null,null,null,null,null,9]
[null,{"$f":"IF(miSelección=\"\",\"\",IFERROR(\"Monedas: \" & INDEX(Datos[Monedas],miFilaDatos),\"\"))","v":""},null,null,null,null,null,10]
[null,null,null,null,null,null,null,11]
[null,{"$f":"IF(miSelección=\"\",\"\",IF(IFERROR(INDEX(Datos[Código ISO 3166-1],miFilaDatos),\"\")<>\"\",IFERROR(\"Código ISO 3166-1: \" & INDEX(Datos[Código ISO 3166-1],miFilaDatos),\"\"),IFERROR(\"Estatus: \"&INDEX(Datos[Estatus],miFilaDatos)&\"\",\"\")))","v":""},null,null,null,null,null,12]
[null,null,null,null,null,null,null,13]
[null,"ü","q","\u0097 ","ZM","á","Z+",14]
[null,"ñ",")","i","ß","Z0","à",15]
[null,"H","ë",">","Zm","â","Z-",16]
["X",1,2,3,4,5,6]
[]
[null,"ë",null,null,"X =",5,"Y =",15]

{"sheet":"Fronteras","index":2,"n_rows":245,"n_cols":9,"rows_kept":245,"cut":false,"hidden":false,"merged":[]}
["Frontera","X","Y","Ancho","Alto","Centro X","Centro Y","Distancia","Fila"]
["Puerto Rico",216.86236572265625,155.72488403320313,3.3807086944580078,1.4342520236968994,{"$f":"TablaFronteras[[#This Row],[X]]+TablaFronteras[[#This Row],[Ancho]]/2","v":218.55272006988525},{"$f":"TablaFronteras[[#This Row],[Y]]+TablaFronteras[[#This Row],[Alto]]/2","v":156.44201004505157},{"$f":"IF(AND(TablaFronteras[[#This Row],[Fila]]<>\"\",TablaFronteras[[#This Row],[X]]<miX,miX<TablaFronteras[[#This Row],[X]]+TablaFronteras[[#This Row],[Ancho]],TablaFronteras[[#This Row],[Y]]<miY,miY<TablaFronteras[[#This Row],[Y]]+TablaFronteras[[#This Row],[Alto]]),SQRT((TablaFronteras[[#This Row],[Centro X]]-miX)^2+(TablaFronteras[[#This Row],[Centro Y]]-miY)^2),\"\")","v":""},{"$f":"IF(TablaFronteras[[#This Row],[Frontera]]=\"\",\"\",IFERROR(MATCH(RIGHT(TablaFronteras[[#This Row],[Frontera]],LEN(TablaFronteras[[#This Row],[Frontera]])-IFERROR(FIND(\" - \",TablaFronteras[[#This Row],[Frontera]])+2,0)),Datos[País],0),\"\"))","v":206}]
["Jamaica",194.09747314453125,155.79063415527344,2.9575591087341309,1.8966141939163208,{"$f":"TablaFronteras[[#This Row],[X]]+TablaFronteras[[#This Row],[Ancho]]/2","v":195.57625269889832},{"$f":"TablaFronteras[[#This Row],[Y]]+TablaFronteras[[#This Row],[Alto]]/2","v":156.7389412522316},{"$f":"IF(AND(TablaFronteras[[#This Row],[Fila]]<>\"\",TablaFronteras[[#This Row],[X]]<miX,miX<TablaFronteras[[#This Row],[X]]+TablaFronteras[[#This Row],[Ancho]],TablaFronteras[[#This Row],[Y]]<miY,miY<TablaFronteras[[#This Row],[Y]]+TablaFronteras[[#This Row],[Alto]]),SQRT((TablaFronteras[[#This Row],[Centro X]]-miX)^2+(TablaFronteras[[#This Row],[Centro Y]]-miY)^2),\"\")","v":""},{"$f":"IF(TablaFronteras[[#This Row],[Frontera]]=\"\",\"\",IFERROR(MATCH(RIGHT(TablaFronteras[[#This Row],[Frontera]],LEN(TablaFronteras[[#This Row],[Frontera]])-IFERROR(FIND(\" - \",TablaFronteras[[#This Row],[Frontera]])+2,0)),Datos[País],0),\"\"))","v":136}]
["Tierras Australes Francesas",481.12686157226563,317.83441162109375,3.7777953147888184,2.4828345775604248,{"$f":"TablaFronteras[[#This Row],[X]]+TablaFronteras[[#This Row],[Ancho]]/2","v":483.01575922966003},{"$f":"TablaFronteras[[#This Row],[Y]]+TablaFronteras[[#This Row],[Alto]]/2","v":319.07582890987396},{"$f":"IF(AND(TablaFronteras[[#This Row],[Fila]]<>\"\",TablaFronteras[[#This Row],[X]]<miX,miX<TablaFronteras[[#This Row],[X]]+TablaFronteras[[#This Row],[Ancho]],TablaFronteras[[#This Row],[Y]]<miY,miY<TablaFronteras[[#This Row],[Y]]+TablaFronteras[[#This Row],[Alto]]),SQRT((TablaFronteras[[#This Row],[Centro X]]-miX)^2+(TablaFronteras[[#This Row],[Centro Y]]-miY)^2),\"\")","v":""},{"$f":"IF(TablaFronteras[[#This Row],[Frontera]]=\"\",\"\",IFERROR(MATCH(RIGHT(TablaFronteras[[#This Row],[Frontera]],LEN(TablaFronteras[[#This Row],[Frontera]])-IFERROR(FIND(\" - \",TablaFronteras[[#This Row],[Frontera]])+2,0)),Datos[País],0),\"\"))","v":254}]
["República Democrática del Congo",379.25393676757813,187.63275146484375,40.270393371582031,45.514724731445313,{"$f":"TablaFronteras[[#This Row],[X]]+TablaFronteras[[#This Row],[Ancho]]/2","v":399.38913345336914},{"$f":"TablaFronteras[[#This Row],[Y]]+TablaFronteras[[#This Row],[Alto]]/2","v":210.39011383056641},{"$f":"IF(AND(TablaFronteras[[#This Row],[Fila]]<>\"\",TablaFronteras[[#This Row],[X]]<miX,miX<TablaFronteras[[#This Row],[X]]+TablaFronteras[[#This Row],[Ancho]],TablaFronteras[[#This Row],[Y]]<miY,miY<TablaFronteras[[#This Row],[Y]]+TablaFronteras[[#This Row],[Alto]]),SQRT((TablaFronteras[[#This Row],[Centro X]]-miX)^2+(TablaFronteras[[#This Row],[Centro Y]]-miY)^2),\"\")","v":""},{"$f":"IF(TablaFronteras[[#This Row],[Frontera]]=\"\",\"\",IFERROR(MATCH(RIGHT(TablaFronteras[[#This Row],[Frontera]],LEN(TablaFronteras[[#This Row],[Frontera]])-IFERROR(FIND(\" - \",TablaFronteras[[#This Row],[Frontera]])+2,0)),Datos[País],0),\"\"))","v":210}]
["República del Congo",376.98291015625,191.55361938476563,16.19354248046875,21.199132919311523,{"$f":"TablaFronteras[[#This Row],[X]]+TablaFronteras[[#This Row],[Ancho]]/2","v":385.07968139648438},{"$f":"TablaFronteras[[#This Row],[Y]]+TablaFronteras[[#This Row],[Alto]]/2","v":202.15318584442139},{"$f":"IF(AND(TablaFronteras[[#This Row],[Fila]]<>\"\",TablaFronteras[[#This Row],[X]]<miX,miX<TablaFronteras[[#This Row],[X]]+TablaFronteras[[#This Row],[Ancho]],TablaFronteras[[#This Row],[Y]]<miY,miY<TablaFronteras[[#This Row],[Y]]+TablaFronteras[[#This Row],[Alto]]),SQRT((TablaFronteras[[#This Row],[Centro X]]-miX)^2+(TablaFronteras[[#This Row],[Centro Y]]-miY)^2),\"\")","v":""},{"$f":"IF(TablaFronteras[[#This Row],[Frontera]]=\"\",\"\",IFERROR(MATCH(RIGHT(TablaFronteras[[#This Row],[Frontera]],LEN(TablaFronteras[[#This Row],[Frontera]])-IFERROR(FIND(\" - \",TablaFronteras[[#This Row],[Frontera]])+2,0)),Datos[País],0),\"\"))","v":212}]
["Senegal",318.58865356445313,160.14189147949219,11.973149299621582,10.630393981933594,{"$f":"TablaFronteras[[#This Row],[X]]+TablaFronteras[[#This Row],[Ancho]]/2","v":324.57522821426392},{"$f":"TablaFronteras[[#This Row],[Y]]+TablaFronteras[[#This Row],[Alto]]/2","v":165.45708847045898},{"$f":"IF(AND(TablaFronteras[[#This Row],[Fila]]<>\"\",TablaFronteras[[#This Row],[X]]<miX,miX<TablaFronteras[[#This Row],[X]]+TablaFronteras[[#This Row],[Ancho]],TablaFronteras[[#This Row],[Y]]<miY,miY<TablaFronteras[[#This Row],[Y]]+TablaFronteras[[#This Row],[Alto]]),SQRT((TablaFronteras[[#This Row],[Centro X]]-miX)^2+(TablaFronteras[[#This Row],[Centro Y]]-miY)^2),\"\")","v":""},{"$f":"IF(TablaFronteras[[#This Row],[Frontera]]=\"\",\"\",IFERROR(MATCH(RIGHT(TablaFronteras[[#This Row],[Frontera]],LEN(TablaFronteras[[#This Row],[Frontera]])-IFERROR(FIND(\" - \",TablaFronteras[[#This Row],[Frontera]])+2,0)),Datos[País],0),\"\"))","v":231}]
["Albania",392.8946533203125,97.579292297363281,3.4942519664764404,7.0337009429931641,{"$f":"TablaFronteras[[#This Row],[X]]+TablaFronteras[[#This Row],[Ancho]]/2","v":394.64177930355072},{"$f":"TablaFronteras[[#This Row],[Y]]+TablaFronteras[[#This Row],[Alto]]/2","v":101.09614276885986},{"$f":"IF(AND(TablaFronteras[[#This Row],[Fila]]<>\"\",TablaFronteras[[#This Row],[X]]<miX,miX<TablaFronteras[[#This Row],[X]]+TablaFronteras[[#This Row],[Ancho]],TablaFronteras[[#This Row],[Y]]<miY,miY<TablaFronteras[[#This Row],[Y]]+TablaFronteras[[#This Row],[Alto]]),SQRT((TablaFronteras[[#This Row],[Centro X]]-miX)^2+(TablaFronteras[[#This Row],[Centro Y]]-miY)^2),\"\")","v":""},{"$f":"IF(TablaFronteras[[#This Row],[Frontera]]=\"\",\"\",IFERROR(MATCH(RIGHT(TablaFronteras[[#This Row],[Frontera]],LEN(TablaFronteras[[#This Row],[Frontera]])-IFERROR(FIND(\" - \",TablaFronteras[[#This Row],[Frontera]])+2,0)),Datos[País],0),\"\"))","v":4}]
["Bulgaria",397.05166625976563,93.865745544433594,12.942598342895508,6.9964566230773926,{"$f":"TablaFronteras[[#This Row],[X]]+TablaFronteras[[#This Row],[Ancho]]/2","v":403.52296543121338},{"$f":"TablaFronteras[[#This Row],[Y]]+TablaFronteras[[#This Row],[Alto]]/2","v":97.36397385597229},{"$f":"IF(AND(TablaFronteras[[#This Row],[Fila]]<>\"\",TablaFronteras[[#This Row],[X]]<miX,miX<TablaFronteras[[#This Row],[X]]+TablaFronteras[[#This Row],[Ancho]],TablaFronteras[[#This Row],[Y]]<miY,miY<TablaFronteras[[#This Row],[Y]]+TablaFronteras[[#This Row],[Alto]]),SQRT((TablaFronteras[[#This Row],[Centro X]]-miX)^2+(TablaFronteras[[#This Row],[Centro Y]]-miY)^2),\"\")","v":""},{"$f":"IF(TablaFronteras[[#This Row],[Frontera]]=\"\",\"\",IFERROR(MATCH(RIGHT(TablaFronteras[[#This Row],[Frontera]],LEN(TablaFronteras[[#This Row],[Frontera]])-IFERROR(FIND(\" - \",TablaFronteras[[#This Row],[Frontera]])+2,0)),Datos[País],0),\"\"))","v":39}]
["Noruega",348.111328125,16.852361679077148,58.001968383789063,45.125747680664063,{"$f":"TablaFronteras[[#This Row],[X]]+TablaFronteras[[#This Row],[Ancho]]/2","v":377.11231231689453},{"$f":"TablaFronteras[[#This Row],[Y]]+TablaFronteras[[#This Row],[Alto]]/2","v":39.41523551940918},{"$f":"IF(AND(TablaFronteras[[#This Row],[Fila]]<>\"\",TablaFronteras[[#This Row],[X]]<miX,miX<TablaFronteras[[#This Row],[X]]+TablaFronteras[[#This Row],[Ancho]],TablaFronteras[[#This Row],[Y]]<miY,miY<TablaFronteras[[#This Row],[Y]]+TablaFronteras[[#This Row],[Alto]]),SQRT((TablaFronteras[[#This Row],[Centro X]]-miX)^2+(TablaFronteras[[#This Row],[Centro Y]]-miY)^2),\"\")","v":""},{"$f":"IF(TablaFronteras[[#This Row],[Frontera]]=\"\",\"\",IFERROR(MATCH(RIGHT(TablaFronteras[[#This Row],[Frontera]],LEN(TablaFronteras[[#This Row],[Frontera]])-IFERROR(FIND(\" - \",TablaFronteras[[#This Row],[Frontera]])+2,0)),Datos[País],0),\"\"))","v":184}]
["China",496.92196655273438,72.055587768554688,107.06149291992188,84.393226623535156,{"$f":"TablaFronteras[[#This Row],[X]]+TablaFronteras[[#This Row],[Ancho]]/2","v":550.45271301269531},{"$f":"TablaFronteras[[#This Row],[Y]]+TablaFronteras[[#This Row],[Alto]]/2","v":114.25220108032227},{"$f":"IF(AND(TablaFronteras[[#This Row],[Fila]]<>\"\",TablaFronteras[[#This Row],[X]]<miX,miX<TablaFronteras[[#This Row],[X]]+TablaFronteras[[#This Row],[Ancho]],TablaFronteras[[#This Row],[Y]]<miY,miY<TablaFronteras[[#This Row],[Y]]+TablaFronteras[[#This Row],[Alto]]),SQRT((TablaFronteras[[#This Row],[Centro X]]-miX)^2+(TablaFronteras[[#This Row],[Centro Y]]-miY)^2),\"\")","v":""},{"$f":"IF(TablaFronteras[[#This Row],[Frontera]]=\"\",\"\",IFERROR(MATCH(RIGHT(TablaFronteras[[#This Row],[Frontera]],LEN(TablaFronteras[[#This Row],[Frontera]])-IFERROR(FIND(\" - \",TablaFronteras[[#This Row],[Frontera]])+2,0)),Datos[País],0),\"\"))","v":53}]
["Australia",487.86032104492188,225.09268188476563,207.02842712402344,105.6832275390625,{"$f":"TablaFronteras[[#This Row],[X]]+TablaFronteras[[#This Row],[Ancho]]/2","v":591.37453460693359},{"$f":"TablaFronteras[[#This Row],[Y]]+TablaFronteras[[#This Row],[Alto]]/2","v":277.93429565429688},{"$f":"IF(AND(TablaFronteras[[#This Row],[Fila]]<>\"\",TablaFronteras[[#This Row],[X]]<miX,miX<TablaFronteras[[#This Row],[X]]+TablaFronteras[[#This Row],[Ancho]],TablaFronteras[[#This Row],[Y]]<miY,miY<TablaFronteras[[#This Row],[Y]]+TablaFronteras[[#This Row],[Alto]]),SQRT((TablaFronteras[[#This Row],[Centro X]]-miX)^2+(TablaFronteras[[#This Row],[Centro Y]]-miY)^2),\"\")","v":""},{"$f":"IF(TablaFronteras[[#This Row],[Frontera]]=\"\",\"\",IFERROR(MATCH(RIGHT(TablaFronteras[[#This Row],[Frontera]],LEN(TablaFronteras[[#This Row],[Frontera]])-IFERROR(FIND(\" - \",TablaFronteras[[#This Row],[Frontera]])+2,0)),Datos[País],0),\"\"))","v":19}]
["Indonesia",551.52520751953125,186.34669494628906,95.4527587890625,40.769447326660156,{"$f":"TablaFronteras[[#This Row],[X]]+TablaFronteras[[#This Row],[Ancho]]/2","v":599.2515869140625},{"$f":"TablaFronteras[[#This Row],[Y]]+TablaFronteras[[#This Row],[Alto]]/2","v":206.73141860961914},{"$f":"IF(AND(TablaFronteras[[#This Row],[Fila]]<>\"\",TablaFronteras[[#This Row],[X]]<miX,miX<TablaFronteras[[#This Row],[X]]+TablaFronteras[[#This Row],[Ancho]],TablaFronteras[[#This Row],[Y]]<miY,miY<TablaFronteras[[#This Row],[Y]]+TablaFronteras[[#This Row],[Alto]]),SQRT((TablaFronteras[[#This Row],[Centro X]]-miX)^2+(TablaFronteras[[#This Row],[Centro Y]]-miY)^2),\"\")","v":""},{"$f":"IF(TablaFronteras[[#This Row],[Frontera]]=\"\",\"\",IFERROR(MATCH(RIGHT(TablaFronteras[[#This Row],[Frontera]],LEN(TablaFronteras[[#This Row],[Frontera]])-IFERROR(FIND(\" - \",TablaFronteras[[#This Row],[Frontera]])+2,0)),Datos[País],0),\"\"))","v":105}]
["Groenlandia",263.80087280273438,12.577165603637695,83.109840393066406,45.443859100341797,{"$f":"TablaFronteras[[#This Row],[X]]+TablaFronteras[[#This Row],[Ancho]]/2","v":305.35579299926758},{"$f":"TablaFronteras[[#This Row],[Y]]+TablaFronteras[[#This Row],[Alto]]/2","v":35.299095153808594},{"$f":"IF(AND(TablaFronteras[[#This Row],[Fila]]<>\"\",TablaFronteras[[#This Row],[X]]<miX,miX<TablaFronteras[[#This Row],[X]]+TablaFronteras[[#This Row],[Ancho]],TablaFronteras[[#This Row],[Y]]<miY,miY<TablaFronteras[[#This Row],[Y]]+TablaFronteras[[#This Row],[Alto]]),SQRT((TablaFronteras[[#This Row],[Centro X]]-miX)^2+(TablaFronteras[[#This Row],[Centro Y]]-miY)^2),\"\")","v":""},{"$f":"IF(TablaFronteras[[#This Row],[Frontera]]=\"\",\"\",IFERROR(MATCH(RIGHT(TablaFronteras[[#This Row],[Frontera]],LEN(TablaFronteras[[#This Row],[Frontera]])-IFERROR(FIND(\" - \",TablaFronteras[[#This Row],[Frontera]])+2,0)),Datos[País],0),\"\"))","v":90}]
["Canadá",123.29716491699219,13.270550727844238,163.26881408691406,85.953781127929688,{"$f":"TablaFronteras[[#This Row],[X]]+TablaFronteras[[#This Row],[Ancho]]/2","v":204.93157196044922},{"$f":"TablaFronteras[[#This Row],[Y]]+TablaFronteras[[#This Row],[Alto]]/2","v":56.247441291809082},{"$f":"IF(AND(TablaFronteras[[#This Row],[Fila]]<>\"\",TablaFronteras[[#This Row],[X]]<miX,miX<TablaFronteras[[#This Row],[X]]+TablaFronteras[[#This Row],[Ancho]],TablaFronteras[[#This Row],[Y]]<miY,miY<TablaFronteras[[#This Row],[Y]]+TablaFronteras[[#This Row],[Alto]]),SQRT((TablaFronteras[[#This Row],[Centro X]]-miX)^2+(TablaFronteras[[#This Row],[Centro Y]]-miY)^2),\"\")","v":""},{"$f":"IF(TablaFronteras[[#This Row],[Frontera]]=\"\",\"\",IFERROR(MATCH(RIGHT(TablaFronteras[[#This Row],[Frontera]],LEN(TablaFronteras[[#This Row],[Frontera]])-IFERROR(FIND(\" - \",TablaFronteras[[#This Row],[Frontera]])+2,0)),Datos[País],0),\"\"))","v":47}]
["Estados Unidos",28.168031692504883,33.78094482421875,203.52133178710938,120.87968444824219,{"$f":"TablaFronteras[[#This Row],[X]]+TablaFronteras[[#This Row],[Ancho]]/2","v":129.92869758605957},{"$f":"TablaFronteras[[#This Row],[Y]]+TablaFronteras[[#This Row],[Alto]]/2","v":94.220787048339844},{"$f":"IF(AND(TablaFronteras[[#This Row],[Fila]]<>\"\",TablaFronteras[[#This Row],[X]]<miX,miX<TablaFronteras[[#This Row],[X]]+TablaFronteras[[#This Row],[Ancho]],TablaFronteras[[#This Row],[Y]]<miY,miY<TablaFronteras[[#This Row],[Y]]+TablaFronteras[[#This Row],[Alto]]),SQRT((TablaFronteras[[#This Row],[Centro X]]-miX)^2+(TablaFronteras[[#This Row],[Centro Y]]-miY)^2),\"\")","v":""},{"$f":"IF(TablaFronteras[[#This Row],[Frontera]]=\"\",\"\",IFERROR(MATCH(RIGHT(TablaFronteras[[#This Row],[Frontera]],LEN(TablaFronteras[[#This Row],[Frontera]])-IFERROR(FIND(\" - \",TablaFronteras[[#This Row],[Frontera]])+2,0)),Datos[País],0),\"\"))","v":76}]
["India",493.29095458984375,114.75189208984375,56.800315856933594,69.490470886230469,{"$f":"TablaFronteras[[#This Row],[X]]+TablaFronteras[[#This Row],[Ancho]]/2","v":521.69111251831055},{"$f":"TablaFronteras[[#This Row],[Y]]+TablaFronteras[[#This Row],[Alto]]/2","v":149.49712753295898},{"$f":"IF(AND(TablaFronteras[[#This Row],[Fila]]<>\"\",TablaFronteras[[#This Row],[X]]<miX,miX<TablaFronteras[[#This Row],[X]]+TablaFronteras[[#This Row],[Ancho]],TablaFronteras[[#This Row],[Y]]<miY,miY<TablaFronteras[[#This Row],[Y]]+TablaFronteras[[#This Row],[Alto]]),SQRT((TablaFronteras[[#This Row],[Centro X]]-miX)^2+(TablaFronteras[[#This Row],[Centro Y]]-miY)^2),\"\")","v":""},{"$f":"IF(TablaFronteras[[#This Row],[Frontera]]=\"\",\"\",IFERROR(MATCH(RIGHT(TablaFronteras[[#This Row],[Frontera]],LEN(TablaFronteras[[#This Row],[Frontera]])-IFERROR(FIND(\" - \",TablaFronteras[[#This Row],[Frontera]])+2,0)),Datos[País],0),\"\"))","v":104}]
["Ucrania",396.71023559570313,74.71063232421875,32.762519836425781,16.806928634643555,{"$f":"TablaFronteras[[#This Row],[X]]+TablaFronteras[[#This Row],[Ancho]]/2","v":413.09149551391602},{"$f":"TablaFronteras[[#This Row],[Y]]+TablaFronteras[[#This Row],[Alto]]/2","v":83.114096641540527},{"$f":"IF(AND(TablaFronteras[[#This Row],[Fila]]<>\"\",TablaFronteras[[#This Row],[X]]<miX,miX<TablaFronteras[[#This Row],[X]]+TablaFronteras[[#This Row],[Ancho]],TablaFronteras[[#This Row],[Y]]<miY,miY<TablaFronteras[[#This Row],[Y]]+TablaFronteras[[#This Row],[Alto]]),SQRT((TablaFronteras[[#This Row],[Centro X]]-miX)^2+(TablaFronteras[[#This Row],[Centro Y]]-miY)^2),\"\")","v":""},{"$f":"IF(TablaFronteras[[#This Row],[Frontera]]=\"\",\"\",IFERROR(MATCH(RIGHT(TablaFronteras[[#This Row],[Frontera]],LEN(TablaFronteras[[#This Row],[Frontera]])-IFERROR(FIND(\" - \",TablaFronteras[[#This Row],[Frontera]])+2,0)),Datos[País],0),\"\"))","v":265}]
["Malasia",561.25616455078125,182.87803649902344,40.871810913085938,15.627323150634766,{"$f":"TablaFronteras[[#This Row],[X]]+TablaFronteras[[#This Row],[Ancho]]/2","v":581.69207000732422},{"$f":"TablaFronteras[[#This Row],[Y]]+TablaFronteras[[#This Row],[Alto]]/2","v":190.69169807434082},{"$f":"IF(AND(TablaFronteras[[#This Row],[Fila]]<>\"\",TablaFronteras[[#This Row],[X]]<miX,miX<TablaFronteras[[#This Row],[X]]+TablaFronteras[[#This Row],[Ancho]],TablaFronteras[[#This Row],[Y]]<miY,miY<TablaFronteras[[#This Row],[Y]]+TablaFronteras[[#This Row],[Alto]]),SQRT((TablaFronteras[[#This Row],[Centro X]]-miX)^2+(TablaFronteras[[#This Row],[Centro Y]]-miY)^2),\"\")","v":""},{"$f":"IF(TablaFronteras[[#This Row],[Frontera]]=\"\",\"\",IFERROR(MATCH(RIGHT(TablaFronteras[[#This Row],[Frontera]],LEN(TablaFronteras[[#This Row],[Frontera]])-IFERROR(FIND(\" - \",TablaFronteras[[#This Row],[Frontera]])+2,0)),Datos[País],0),\"\"))","v":158}]
["Taiwán",598.0986328125,139.52322387695313,2.9928345680236816,7.972834587097168,{"$f":"TablaFronteras[[#This Row],[X]]+TablaFronteras[[#This Row],[Ancho]]/2","v":599.59505009651184},{"$f":"TablaFronteras[[#This Row],[Y]]+TablaFronteras[[#This Row],[Alto]]/2","v":143.50964117050171},{"$f":"IF(AND(TablaFronteras[[#This Row],[Fila]]<>\"\",TablaFronteras[[#This Row],[X]]<miX,miX<TablaFronteras[[#This Row],[X]]+TablaFronteras[[#This Row],[Ancho]],TablaFronteras[[#This Row],[Y]]<miY,miY<TablaFronteras[[#This Row],[Y]]+TablaFronteras[[#This Row],[Alto]]),SQRT((TablaFronteras[[#This Row],[Centro X]]-miX)^2+(TablaFronteras[[#This Row],[Centro Y]]-miY)^2),\"\")","v":""},{"$f":"IF(TablaFronteras[[#This Row],[Frontera]]=\"\",\"\",IFERROR(MATCH(RIGHT(TablaFronteras[[#This Row],[Frontera]],LEN(TablaFronteras[[#This Row],[Frontera]])-IFERROR(FIND(\" - \",TablaFronteras[[#This Row],[Frontera]])+2,0)),Datos[País],0),\"\"))","v":250}]
["Rusia",392.03274536132813,15.167007446289063,265.05111694335938,85.883781433105469,{"$f":"TablaFronteras[[#This Row],[X]]+TablaFronteras[[#This Row],[Ancho]]/2","v":524.55830383300781},{"$f":"TablaFronteras[[#This Row],[Y]]+TablaFronteras[[#This Row],[Alto]]/2","v":58.108898162841797},{"$f":"IF(AND(TablaFronteras[[#This Row],[Fila]]<>\"\",TablaFronteras[[#This Row],[X]]<miX,miX<TablaFronteras[[#This Row],[X]]+TablaFronteras[[#This Row],[Ancho]],TablaFronteras[[#This Row],[Y]]<miY,miY<TablaFronteras[[#This Row],[Y]]+TablaFronteras[[#This Row],[Alto]]),SQRT((TablaFronteras[[#This Row],[Centro X]]-miX)^2+(TablaFronteras[[#This Row],[Centro Y]]-miY)^2),\"\")","v":""},{"$f":"IF(TablaFronteras[[#This Row],[Frontera]]=\"\",\"\",IFERROR(MATCH(RIGHT(TablaFronteras[[#This Row],[Frontera]],LEN(TablaFronteras[[#This Row],[Frontera]])-IFERROR(FIND(\" - \",TablaFronteras[[#This Row],[Frontera]])+2,0)),Datos[País],0),\"\"))","v":216}]
["Crimea - Ucrania",417.07504272460938,88.787796020507813,7.6640157699584961,4.1289763450622559,{"$f":"TablaFronteras[[#This Row],[X]]+TablaFronteras[[#This Row],[Ancho]]/2","v":420.90705060958862},{"$f":"TablaFronteras[[#This Row],[Y]]+TablaFronteras[[#This Row],[Alto]]/2","v":90.85228419303894},{"$f":"IF(AND(TablaFronteras[[#This Row],[Fila]]<>\"\",TablaFronteras[[#This Row],[X]]<miX,miX<TablaFronteras[[#This Row],[X]]+TablaFronteras[[#This Row],[Ancho]],TablaFronteras[[#This Row],[Y]]<miY,miY<TablaFronteras[[#This Row],[Y]]+TablaFronteras[[#This Row],[Alto]]),SQRT((TablaFronteras[[#This Row],[Centro X]]-miX)^2+(TablaFronteras[[#This Row],[Centro Y]]-miY)^2),\"\")","v":""},{"$f":"IF(TablaFronteras[[#This Row],[Frontera]]=\"\",\"\",IFERROR(MATCH(RIGHT(TablaFronteras[[#This Row],[Frontera]],LEN(TablaFronteras[[#This Row],[Frontera]])-IFERROR(FIND(\" - \",TablaFronteras[[#This Row],[Frontera]])+2,0)),Datos[País],0),\"\"))","v":265}]
["Islandia",321.11376953125,43.710708618164063,16.882362365722656,6.4562206268310547,{"$f":"TablaFronteras[[#This Row],[X]]+TablaFronteras[[#This Row],[Ancho]]/2","v":329.55495071411133},{"$f":"TablaFronteras[[#This Row],[Y]]+TablaFronteras[[#This Row],[Alto]]/2","v":46.93881893157959},{"$f":"IF(AND(TablaFronteras[[#This Row],[Fila]]<>\"\",TablaFronteras[[#This Row],[X]]<miX,miX<TablaFronteras[[#This Row],[X]]+TablaFronteras[[#This Row],[Ancho]],TablaFronteras[[#This Row],[Y]]<miY,miY<TablaFronteras[[#This Row],[Y]]+TablaFronteras[[#This Row],[Alto]]),SQRT((TablaFronteras[[#This Row],[Centro X]]-miX)^2+(TablaFronteras[[#This Row],[Centro Y]]-miY)^2),\"\")","v":""},{"$f":"IF(TablaFronteras[[#This Row],[Frontera]]=\"\",\"\",IFERROR(MATCH(RIGHT(TablaFronteras[[#This Row],[Frontera]],LEN(TablaFronteras[[#This Row],[Frontera]])-IFERROR(FIND(\" - \",TablaFronteras[[#This Row],[Frontera]])+2,0)),Datos[País],0),\"\"))","v":118}]
["Países Bajos",363.24606323242188,72.239524841308594,7.0876379013061523,6.2375588417053223,{"$f":"TablaFronteras[[#This Row],[X]]+TablaFronteras[[#This Row],[Ancho]]/2","v":366.78988218307495},{"$f":"TablaFronteras[[#This Row],[Y]]+TablaFronteras[[#This Row],[Alto]]/2","v":75.358304262161255},{"$f":"IF(AND(TablaFronteras[[#This Row],[Fila]]<>\"\",TablaFronteras[[#This Row],[X]]<miX,miX<TablaFronteras[[#This Row],[X]]+TablaFronteras[[#This Row],[Ancho]],TablaFronteras[[#This Row],[Y]]<miY,miY<TablaFronteras[[#This Row],[Y]]+TablaFronteras[[#This Row],[Alto]]),SQRT((TablaFronteras[[#This Row],[Centro X]]-miX)^2+(TablaFronteras[[#This Row],[Centro Y]]-miY)^2),\"\")","v":""},{"$f":"IF(TablaFronteras[[#This Row],[Frontera]]=\"\",\"\",IFERROR(MATCH(RIGHT(TablaFronteras[[#This Row],[Frontera]],LEN(TablaFronteras[[#This Row],[Frontera]])-IFERROR(FIND(\" - \",TablaFronteras[[#This Row],[Frontera]])+2,0)),Datos[País],0),\"\"))","v":199}]
["Francia",348.227783203125,77.753700256347656,26.120708465576172,22.91889762878418,{"$f":"TablaFronteras[[#This Row],[X]]+TablaFronteras[[#This Row],[Ancho]]/2","v":361.28813743591309},{"$f":"TablaFronteras[[#This Row],[Y]]+TablaFronteras[[#This Row],[Alto]]/2","v":89.213149070739746},{"$f":"IF(AND(TablaFronteras[[#This Row],[Fila]]<>\"\",TablaFronteras[[#This Row],[X]]<miX,miX<TablaFronteras[[#This Row],[X]]+TablaFronteras[[#This Row],[Ancho]],TablaFronteras[[#This Row],[Y]]<miY,miY<TablaFronteras[[#This Row],[Y]]+TablaFronteras[[#This Row],[Alto]]),SQRT((TablaFronteras[[#This Row],[Centro X]]-miX)^2+(TablaFronteras[[#This Row],[Centro Y]]-miY)^2),\"\")","v":""},{"$f":"IF(TablaFronteras[[#This Row],[Frontera]]=\"\",\"\",IFERROR(MATCH(RIGHT(TablaFronteras[[#This Row],[Frontera]],LEN(TablaFronteras[[#This Row],[Frontera]])-IFERROR(FIND(\" - \",TablaFronteras[[#This Row],[Frontera]])+2,0)),Datos[País],0),\"\"))","v":82}]
["Italia",368.89849853515625,87.087638854980469,22.491968154907227,24.752126693725586,{"$f":"TablaFronteras[[#This Row],[X]]+TablaFronteras[[#This Row],[Ancho]]/2","v":380.14448261260986},{"$f":"TablaFronteras[[#This Row],[Y]]+TablaFronteras[[#This Row],[Alto]]/2","v":99.463702201843262},{"$f":"IF(AND(TablaFronteras[[#This Row],[Fila]]<>\"\",TablaFronteras[[#This Row],[X]]<miX,miX<TablaFronteras[[#This Row],[X]]+TablaFronteras[[#This Row],[Ancho]],TablaFronteras[[#This Row],[Y]]<miY,miY<TablaFronteras[[#This Row],[Y]]+TablaFronteras[[#This Row],[Alto]]),SQRT((TablaFronteras[[#This Row],[Centro X]]-miX)^2+(TablaFronteras[[#This Row],[Centro Y]]-miY)^2),\"\")","v":""},{"$f":"IF(TablaFronteras[[#This Row],[Frontera]]=\"\",\"\",IFERROR(MATCH(RIGHT(TablaFronteras[[#This Row],[Frontera]],LEN(TablaFronteras[[#This Row],[Frontera]])-IFERROR(FIND(\" - \",TablaFronteras[[#This Row],[Frontera]])+2,0)),Datos[País],0),\"\"))","v":135}]
["España",318.81298828125,94.919845581054688,45.413070678710938,38.677875518798828,{"$f":"TablaFronteras[[#This Row],[X]]+TablaFronteras[[#This Row],[Ancho]]/2","v":341.51952362060547},{"$f":"TablaFronteras[[#This Row],[Y]]+TablaFronteras[[#This Row],[Alto]]/2","v":114.2587833404541},{"$f":"IF(AND(TablaFronteras[[#This Row],[Fila]]<>\"\",TablaFronteras[[#This Row],[X]]<miX,miX<TablaFronteras[[#This Row],[X]]+TablaFronteras[[#This Row],[Ancho]],TablaFronteras[[#This Row],[Y]]<miY,miY<TablaFronteras[[#This Row],[Y]]+TablaFronteras[[#This Row],[Alto]]),SQRT((TablaFronteras[[#This Row],[Centro X]]-miX)^2+(TablaFronteras[[#This Row],[Centro Y]]-miY)^2),\"\")","v":""},{"$f":"IF(TablaFronteras[[#This Row],[Frontera]]=\"\",\"\",IFERROR(MATCH(RIGHT(TablaFronteras[[#This Row],[Frontera]],LEN(TablaFronteras[[#This Row],[Frontera]])-IFERROR(FIND(\" - \",TablaFronteras[[#This Row],[Frontera]])+2,0)),Datos[País],0),\"\"))","v":75}]
["Portugal",299.90298461914063,98.757087707519531,44.49212646484375,23.016456604003906,{"$f":"TablaFronteras[[#This Row],[X]]+TablaFronteras[[#This Row],[Ancho]]/2","v":322.1490478515625},{"$f":"TablaFronteras[[#This Row],[Y]]+TablaFronteras[[#This Row],[Alto]]/2","v":110.26531600952148},{"$f":"IF(AND(TablaFronteras[[#This Row],[Fila]]<>\"\",TablaFronteras[[#This Row],[X]]<miX,miX<TablaFronteras[[#This Row],[X]]+TablaFronteras[[#This Row],[Ancho]],TablaFronteras[[#This Row],[Y]]<miY,miY<TablaFronteras[[#This Row],[Y]]+TablaFronteras[[#This Row],[Alto]]),SQRT((TablaFronteras[[#This Row],[Centro X]]-miX)^2+(TablaFronteras[[#This Row],[Centro Y]]-miY)^2),\"\")","v":""},{"$f":"IF(TablaFronteras[[#This Row],[Frontera]]=\"\",\"\",IFERROR(MATCH(RIGHT(TablaFronteras[[#This Row],[Frontera]],LEN(TablaFronteras[[#This Row],[Frontera]])-IFERROR(FIND(\" - \",TablaFronteras[[#This Row],[Frontera]])+2,0)),Datos[País],0),\"\"))","v":205}]
["Bélgica",361.68856811523438,76.84228515625,7.0350394248962402,4.5649604797363281,{"$f":"TablaFronteras[[#This Row],[X]]+TablaFronteras[[#This Row],[Ancho]]/2","v":365.2060878276825},{"$f":"TablaFronteras[[#This Row],[Y]]+TablaFronteras[[#This Row],[Alto]]/2","v":79.124765396118164},{"$f":"IF(AND(TablaFronteras[[#This Row],[Fila]]<>\"\",TablaFronteras[[#This Row],[X]]<miX,miX<TablaFronteras[[#This Row],[X]]+TablaFronteras[[#This Row],[Ancho]],TablaFronteras[[#This Row],[Y]]<miY,miY<TablaFronteras[[#This Row],[Y]]+TablaFronteras[[#This Row],[Alto]]),SQRT((TablaFronteras[[#This Row],[Centro X]]-miX)^2+(TablaFronteras[[#This Row],[Centro Y]]-miY)^2),\"\")","v":""},{"$f":"IF(TablaFronteras[[#This Row],[Frontera]]=\"\",\"\",IFERROR(MATCH(RIGHT(TablaFronteras[[#This Row],[Frontera]],LEN(TablaFronteras[[#This Row],[Frontera]])-IFERROR(FIND(\" - \",TablaFronteras[[#This Row],[Frontera]])+2,0)),Datos[País],0),\"\"))","v":43}]
["Irlanda",338.76095581054688,68.064491271972656,8.2440948486328125,8.8162994384765625,{"$f":"TablaFronteras[[#This Row],[X]]+TablaFronteras[[#This Row],[Ancho]]/2","v":342.88300323486328},{"$f":"TablaFronteras[[#This Row],[Y]]+TablaFronteras[[#This Row],[Alto]]/2","v":72.472640991210938},{"$f":"IF(AND(TablaFronteras[[#This Row],[Fila]]<>\"\",TablaFronteras[[#This Row],[X]]<miX,miX<TablaFronteras[[#This Row],[X]]+TablaFronteras[[#This Row],[Ancho]],TablaFronteras[[#This Row],[Y]]<miY,miY<TablaFronteras[[#This Row],[Y]]+TablaFronteras[[#This Row],[Alto]]),SQRT((TablaFronteras[[#This Row],[Centro X]]-miX)^2+(TablaFronteras[[#This Row],[Centro Y]]-miY)^2),\"\")","v":""},{"$f":"IF(TablaFronteras[[#This Row],[Frontera]]=\"\",\"\",IFERROR(MATCH(RIGHT(TablaFronteras[[#This Row],[Frontera]],LEN(TablaFronteras[[#This Row],[Frontera]])-IFERROR(FIND(\" - \",TablaFronteras[[#This Row],[Frontera]])+2,0)),Datos[País],0),\"\"))","v":107}]
["Reino Unido",343.55691528320313,55.846851348876953,16.843463897705078,24.418739318847656,{"$f":"TablaFronteras[[#This Row],[X]]+TablaFronteras[[#This Row],[Ancho]]/2","v":351.97864723205566},{"$f":"TablaFronteras[[#This Row],[Y]]+TablaFronteras[[#This Row],[Alto]]/2","v":68.056221008300781},{"$f":"IF(AND(TablaFronteras[[#This Row],[Fila]]<>\"\",TablaFronteras[[#This Row],[X]]<miX,miX<TablaFronteras[[#This Row],[X]]+TablaFronteras[[#This Row],[Ancho]],TablaFronteras[[#This Row],[Y]]<miY,miY<TablaFronteras[[#This Row],[Y]]+TablaFronteras[[#This Row],[Alto]]),SQRT((TablaFronteras[[#This Row],[Centro X]]-miX)^2+(TablaFronteras[[#This Row],[Centro Y]]-miY)^2),\"\")","v":""},{"$f":"IF(TablaFronteras[[#This Row],[Frontera]]=\"\",\"\",IFERROR(MATCH(RIGHT(TablaFronteras[[#This Row],[Frontera]],LEN(TablaFronteras[[#This Row],[Frontera]])-IFERROR(FIND(\" - \",TablaFronteras[[#This Row],[Frontera]])+2,0)),Datos[País],0),\"\"))","v":207}]
["Alemania",367.9505615234375,68.755271911621094,16.07118034362793,17.878740310668945,{"$f":"TablaFronteras[[#This Row],[X]]+TablaFronteras[[#This Row],[Ancho]]/2","v":375.98615169525146},{"$f":"TablaFronteras[[#This Row],[Y]]+TablaFronteras[[#This Row],[Alto]]/2","v":77.694642066955566},{"$f":"IF(AND(TablaFronteras[[#This Row],[Fila]]<>\"\",TablaFronteras[[#This Row],[X]]<miX,miX<TablaFronteras[[#This Row],[X]]+TablaFronteras[[#This Row],[Ancho]],TablaFronteras[[#This Row],[Y]]<miY,miY<TablaFronteras[[#This Row],[Y]]+TablaFronteras[[#This Row],[Alto]]),SQRT((TablaFronteras[[#This Row],[Centro X]]-miX)^2+(TablaFronteras[[#This Row],[Centro Y]]-miY)^2),\"\")","v":""},{"$f":"IF(TablaFronteras[[#This Row],[Frontera]]=\"\",\"\",IFERROR(MATCH(RIGHT(TablaFronteras[[#This Row],[Frontera]],LEN(TablaFronteras[[#This Row],[Frontera]])-IFERROR(FIND(\" - \",TablaFronteras[[#This Row],[Frontera]])+2,0)),Datos[País],0),\"\"))","v":5}]
["Suiza",368.23544311523438,85.593704223632813,7.743464469909668,4.431732177734375,{"$f":"TablaFronteras[[#This Row],[X]]+TablaFronteras[[#This Row],[Ancho]]/2","v":372.10717535018921},{"$f":"TablaFronteras[[#This Row],[Y]]+TablaFronteras[[#This Row],[Alto]]/2","v":87.8095703125},{"$f":"IF(AND(TablaFronteras[[#This Row],[Fila]]<>\"\",TablaFronteras[[#This Row],[X]]<miX,miX<TablaFronteras[[#This Row],[X]]+TablaFronteras[[#This Row],[Ancho]],TablaFronteras[[#This Row],[Y]]<miY,miY<TablaFronteras[[#This Row],[Y]]+TablaFronteras[[#This Row],[Alto]]),SQRT((TablaFronteras[[#This Row],[Centro X]]-miX)^2+(TablaFronteras[[#This Row],[Centro Y]]-miY)^2),\"\")","v":""},{"$f":"IF(TablaFronteras[[#This Row],[Frontera]]=\"\",\"\",IFERROR(MATCH(RIGHT(TablaFronteras[[#This Row],[Frontera]],LEN(TablaFronteras[[#This Row],[Frontera]])-IFERROR(FIND(\" - \",TablaFronteras[[#This Row],[Frontera]])+2,0)),Datos[País],0),\"\"))","v":246}]
["Austria",373.97891235351563,82.553619384765625,14.315669059753418,6.1557478904724121,{"$f":"TablaFronteras[[#This Row],[X]]+TablaFronteras[[#This Row],[Ancho]]/2","v":381.13674688339233},{"$f":"TablaFronteras[[#This Row],[Y]]+TablaFronteras[[#This Row],[Alto]]/2","v":85.631493330001831},{"$f":"IF(AND(TablaFronteras[[#This Row],[Fila]]<>\"\",TablaFronteras[[#This Row],[X]]<miX,miX<TablaFronteras[[#This Row],[X]]+TablaFronteras[[#This Row],[Ancho]],TablaFronteras[[#This Row],[Y]]<miY,miY<TablaFronteras[[#This Row],[Y]]+TablaFronteras[[#This Row],[Alto]]),SQRT((TablaFronteras[[#This Row],[Centro X]]-miX)^2+(TablaFronteras[[#This Row],[Centro Y]]-miY)^2),\"\")","v":""},{"$f":"IF(TablaFronteras[[#This Row],[Frontera]]=\"\",\"\",IFERROR(MATCH(RIGHT(TablaFronteras[[#This Row],[Frontera]],LEN(TablaFronteras[[#This Row],[Frontera]])-IFERROR(FIND(\" - \",TablaFronteras[[#This Row],[Frontera]])+2,0)),Datos[País],0),\"\"))","v":20}]
["República Checa",378.4210205078125,77.873779296875,12.984488487243652,5.7050395011901855,{"$f":"TablaFronteras[[#This Row],[X]]+TablaFronteras[[#This Row],[Ancho]]/2","v":384.91326475143433},{"$f":"TablaFronteras[[#This Row],[Y]]+TablaFronteras[[#This Row],[Alto]]/2","v":80.726299047470093},{"$f":"IF(AND(TablaFronteras[[#This Row],[Fila]]<>\"\",TablaFronteras[[#This Row],[X]]<miX,miX<TablaFronteras[[#This Row],[X]]+TablaFronteras[[#This Row],[Ancho]],TablaFronteras[[#This Row],[Y]]<miY,miY<TablaFronteras[[#This Row],[Y]]+TablaFronteras[[#This Row],[Alto]]),SQRT((TablaFronteras[[#This Row],[Centro X]]-miX)^2+(TablaFronteras[[#This Row],[Centro Y]]-miY)^2),\"\")","v":""},{"$f":"IF(TablaFronteras[[#This Row],[Frontera]]=\"\",\"\",IFERROR(MATCH(RIGHT(TablaFronteras[[#This Row],[Frontera]],LEN(TablaFronteras[[#This Row],[Frontera]])-IFERROR(FIND(\" - \",TablaFronteras[[#This Row],[Frontera]])+2,0)),Datos[País],0),\"\"))","v":209}]
["Dinamarca",371.97842407226563,62.583938598632813,11.927480697631836,7.1369290351867676,{"$f":"TablaFronteras[[#This Row],[X]]+TablaFronteras[[#This Row],[Ancho]]/2","v":377.94216442108154},{"$f":"TablaFronteras[[#This Row],[Y]]+TablaFronteras[[#This Row],[Alto]]/2","v":66.152403116226196},{"$f":"IF(AND(TablaFronteras[[#This Row],[Fila]]<>\"\",TablaFronteras[[#This Row],[X]]<miX,miX<TablaFronteras[[#This Row],[X]]+TablaFronteras[[#This Row],[Ancho]],TablaFronteras[[#This Row],[Y]]<miY,miY<TablaFronteras[[#This Row],[Y]]+TablaFronteras[[#This Row],[Alto]]),SQRT((TablaFronteras[[#This Row],[Centro X]]-miX)^2+(TablaFronteras[[#This Row],[Centro Y]]-miY)^2),\"\")","v":""},{"$f":"IF(TablaFronteras[[#This Row],[Frontera]]=\"\",\"\",IFERROR(MATCH(RIGHT(TablaFronteras[[#This Row],[Frontera]],LEN(TablaFronteras[[#This Row],[Frontera]])-IFERROR(FIND(\" - \",TablaFronteras[[#This Row],[Frontera]])+2,0)),Datos[País],0),\"\"))","v":66}]
["Polonia",382.06069946289063,69.147323608398438,18.184173583984375,13.430315017700195,{"$f":"TablaFronteras[[#This Row],[X]]+TablaFronteras[[#This Row],[Ancho]]/2","v":391.15278625488281},{"$f":"TablaFronteras[[#This Row],[Y]]+TablaFronteras[[#This Row],[Alto]]/2","v":75.862481117248535},{"$f":"IF(AND(TablaFronteras[[#This Row],[Fila]]<>\"\",TablaFronteras[[#This Row],[X]]<miX,miX<TablaFronteras[[#This Row],[X]]+TablaFronteras[[#This Row],[Ancho]],TablaFronteras[[#This Row],[Y]]<miY,miY<TablaFronteras[[#This Row],[Y]]+TablaFronteras[[#This Row],[Alto]]),SQRT((TablaFronteras[[#This Row],[Centro X]]-miX)^2+(TablaFronteras[[#This Row],[Centro Y]]-miY)^2),\"\")","v":""},{"$f":"IF(TablaFronteras[[#This Row],[Frontera]]=\"\",\"\",IFERROR(MATCH(RIGHT(TablaFronteras[[#This Row],[Frontera]],LEN(TablaFronteras[[#This Row],[Frontera]])-IFERROR(FIND(\" - \",TablaFronteras[[#This Row],[Frontera]])+2,0)),Datos[País],0),\"\"))","v":204}]
["Eslovaquia",387.77142333984375,81.244644165039063,10.615983963012695,4.3021259307861328,{"$f":"TablaFronteras[[#This Row],[X]]+TablaFronteras[[#This Row],[Ancho]]/2","v":393.0794153213501},{"$f":"TablaFronteras[[#This Row],[Y]]+TablaFronteras[[#This Row],[Alto]]/2","v":83.395707130432129},{"$f":"IF(AND(TablaFronteras[[#This Row],[Fila]]<>\"\",TablaFronteras[[#This Row],[X]]<miX,miX<TablaFronteras[[#This Row],[X]]+TablaFronteras[[#This Row],[Ancho]],TablaFronteras[[#This Row],[Y]]<miY,miY<TablaFronteras[[#This Row],[Y]]+TablaFronteras[[#This Row],[Alto]]),SQRT((TablaFronteras[[#This Row],[Centro X]]-miX)^2+(TablaFronteras[[#This Row],[Centro Y]]-miY)^2),\"\")","v":""},{"$f":"IF(TablaFronteras[[#This Row],[Frontera]]=\"\",\"\",IFERROR(MATCH(RIGHT(TablaFronteras[[#This Row],[Frontera]],LEN(TablaFronteras[[#This Row],[Frontera]])-IFERROR(FIND(\" - \",TablaFronteras[[#This Row],[Frontera]])+2,0)),Datos[País],0),\"\"))","v":73}]
["Hungría",386.33331298828125,83.582832336425781,12.10417366027832,6.5418896675109863,{"$f":"TablaFronteras[[#This Row],[X]]+TablaFronteras[[#This Row],[Ancho]]/2","v":392.38539981842041},{"$f":"TablaFronteras[[#This Row],[Y]]+TablaFronteras[[#This Row],[Alto]]/2","v":86.853777170181274},{"$f":"IF(AND(TablaFronteras[[#This Row],[Fila]]<>\"\",TablaFronteras[[#This Row],[X]]<miX,miX<TablaFronteras[[#This Row],[X]]+TablaFronteras[[#This Row],[Ancho]],TablaFronteras[[#This Row],[Y]]<miY,miY<TablaFronteras[[#This Row],[Y]]+TablaFronteras[[#This Row],[Alto]]),SQRT((TablaFronteras[[#This Row],[Centro X]]-miX)^2+(TablaFronteras[[#This Row],[Centro Y]]-miY)^2),\"\")","v":""},{"$f":"IF(TablaFronteras[[#This Row],[Frontera]]=\"\",\"\",IFERROR(MATCH(RIGHT(TablaFronteras[[#This Row],[Frontera]],LEN(TablaFronteras[[#This Row],[Frontera]])-IFERROR(FIND(\" - \",TablaFronteras[[#This Row],[Frontera]])+2,0)),Datos[País],0),\"\"))","v":103}]
["Eslovenia",380.980712890625,87.548507690429688,6.3158268928527832,3.6664566993713379,{"$f":"TablaFronteras[[#This Row],[X]]+TablaFronteras[[#This Row],[Ancho]]/2","v":384.13862633705139},{"$f":"TablaFronteras[[#This Row],[Y]]+TablaFronteras[[#This Row],[Alto]]/2","v":89.381736040115356},{"$f":"IF(AND(TablaFronteras[[#This Row],[Fila]]<>\"\",TablaFronteras[[#This Row],[X]]<miX,miX<TablaFronteras[[#This Row],[X]]+TablaFronteras[[#This Row],[Ancho]],TablaFronteras[[#This Row],[Y]]<miY,miY<TablaFronteras[[#This Row],[Y]]+TablaFronteras[[#This Row],[Alto]]),SQRT((TablaFronteras[[#This Row],[Centro X]]-miX)^2+(TablaFronteras[[#This Row],[Centro Y]]-miY)^2),\"\")","v":""},{"$f":"IF(TablaFronteras[[#This Row],[Frontera]]=\"\",\"\",IFERROR(MATCH(RIGHT(TablaFronteras[[#This Row],[Frontera]],LEN(TablaFronteras[[#This Row],[Frontera]])-IFERROR(FIND(\" - \",TablaFronteras[[#This Row],[Frontera]])+2,0)),Datos[País],0),\"\"))","v":74}]
["Croacia",381.2000732421875,88.354721069335938,11.496220588684082,9.6819686889648438,{"$f":"TablaFronteras[[#This Row],[X]]+TablaFronteras[[#This Row],[Ancho]]/2","v":386.94818353652954},{"$f":"TablaFronteras[[#This Row],[Y]]+TablaFronteras[[#This Row],[Alto]]/2","v":93.195705413818359},{"$f":"IF(AND(TablaFronteras[[#This Row],[Fila]]<>\"\",TablaFronteras[[#This Row],[X]]<miX,miX<TablaFronteras[[#This Row],[X]]+TablaFronteras[[#This Row],[Ancho]],TablaFronteras[[#This Row],[Y]]<miY,miY<TablaFronteras[[#This Row],[Y]]+TablaFronteras[[#This Row],[Alto]]),SQRT((TablaFronteras[[#This Row],[Centro X]]-miX)^2+(TablaFronteras[[#This Row],[Centro Y]]-miY)^2),\"\")","v":""},{"$f":"IF(TablaFronteras[[#This Row],[Frontera]]=\"\",\"\",IFERROR(MATCH(RIGHT(TablaFronteras[[#This Row],[Frontera]],LEN(TablaFronteras[[#This Row],[Frontera]])-IFERROR(FIND(\" - \",TablaFronteras[[#This Row],[Frontera]])+2,0)),Datos[País],0),\"\"))","v":63}]
["Bosnia y Herzegovina",385.810302734375,91.466850280761719,7.3523621559143066,6.3169293403625488,{"$f":"TablaFronteras[[#This Row],[X]]+TablaFronteras[[#This Row],[Ancho]]/2","v":389.48648381233215},{"$f":"TablaFronteras[[#This Row],[Y]]+TablaFronteras[[#This Row],[Alto]]/2","v":94.625314950942993},{"$f":"IF(AND(TablaFronteras[[#This Row],[Fila]]<>\"\",TablaFronteras[[#This Row],[X]]<miX,miX<TablaFronteras[[#This Row],[X]]+TablaFronteras[[#This Row],[Ancho]],TablaFronteras[[#This Row],[Y]]<miY,miY<TablaFronteras[[#This Row],[Y]]+TablaFronteras[[#This Row],[Alto]]),SQRT((TablaFronteras[[#This Row],[Centro X]]-miX)^2+(TablaFronteras[[#This Row],[Centro Y]]-miY)^2),\"\")","v":""},{"$f":"IF(TablaFronteras[[#This Row],[Frontera]]=\"\",\"\",IFERROR(MATCH(RIGHT(TablaFronteras[[#This Row],[Frontera]],LEN(TablaFronteras[[#This Row],[Frontera]])-IFERROR(FIND(\" - \",TablaFronteras[[#This Row],[Frontera]])+2,0)),Datos[País],0),\"\"))","v":35}]
["Montenegro",390.87802124023438,95.518028259277344,3.5859842300415039,3.9175591468811035,{"$f":"TablaFronteras[[#This Row],[X]]+TablaFronteras[[#This Row],[Ancho]]/2","v":392.67101335525513},{"$f":"TablaFronteras[[#This Row],[Y]]+TablaFronteras[[#This Row],[Alto]]/2","v":97.476807832717896},{"$f":"IF(AND(TablaFronteras[[#This Row],[Fila]]<>\"\",TablaFronteras[[#This Row],[X]]<miX,miX<TablaFronteras[[#This Row],[X]]+TablaFronteras[[#This Row],[Ancho]],TablaFronteras[[#This Row],[Y]]<miY,miY<TablaFronteras[[#This Row],[Y]]+TablaFronteras[[#This Row],[Alto]]),SQRT((TablaFronteras[[#This Row],[Centro X]]-miX)^2+(TablaFronteras[[#This Row],[Centro Y]]-miY)^2),\"\")","v":""},{"$f":"IF(TablaFronteras[[#This Row],[Frontera]]=\"\",\"\",IFERROR(MATCH(RIGHT(TablaFronteras[[#This Row],[Frontera]],LEN(TablaFronteras[[#This Row],[Frontera]])-IFERROR(FIND(\" - \",TablaFronteras[[#This Row],[Frontera]])+2,0)),Datos[País],0),\"\"))","v":173}]
["Macedonia del Norte",395.14794921875,98.269760131835938,4.3215746879577637,3.5675590038299561,{"$f":"TablaFronteras[[#This Row],[X]]+TablaFronteras[[#This Row],[Ancho]]/2","v":397.30873656272888},{"$f":"TablaFronteras[[#This Row],[Y]]+TablaFronteras[[#This Row],[Alto]]/2","v":100.05353963375092},{"$f":"IF(AND(TablaFronteras[[#This Row],[Fila]]<>\"\",TablaFronteras[[#This Row],[X]]<miX,miX<TablaFronteras[[#This Row],[X]]+TablaFronteras[[#This Row],[Ancho]],TablaFronteras[[#This Row],[Y]]<miY,miY<TablaFronteras[[#This Row],[Y]]+TablaFronteras[[#This Row],[Alto]]),SQRT((TablaFronteras[[#This Row],[Centro X]]-miX)^2+(TablaFronteras[[#This Row],[Centro Y]]-miY)^2),\"\")","v":""},{"$f":"IF(TablaFronteras[[#This Row],[Frontera]]=\"\",\"\",IFERROR(MATCH(RIGHT(TablaFronteras[[#This Row],[Frontera]],LEN(TablaFronteras[[#This Row],[Frontera]])-IFERROR(FIND(\" - \",TablaFronteras[[#This Row],[Frontera]])+2,0)),Datos[País],0),\"\"))","v":155}]
["Grecia",393.78701782226563,99.766693115234375,16.785669326782227,16.307323455810547,{"$f":"TablaFronteras[[#This Row],[X]]+TablaFronteras[[#This Row],[Ancho]]/2","v":402.17985248565674},{"$f":"TablaFronteras[[#This Row],[Y]]+TablaFronteras[[#This Row],[Alto]]/2","v":107.92035484313965},{"$f":"IF(AND(TablaFronteras[[#This Row],[Fila]]<>\"\",TablaFronteras[[#This Row],[X]]<miX,miX<TablaFronteras[[#This Row],[X]]+TablaFronteras[[#This Row],[Ancho]],TablaFronteras[[#This Row],[Y]]<miY,miY<TablaFronteras[[#This Row],[Y]]+TablaFronteras[[#This Row],[Alto]]),SQRT((TablaFronteras[[#This Row],[Centro X]]-miX)^2+(TablaFronteras[[#This Row],[Centro Y]]-miY)^2),\"\")","v":""},{"$f":"IF(TablaFronteras[[#This Row],[Frontera]]=\"\",\"\",IFERROR(MATCH(RIGHT(TablaFronteras[[#This Row],[Frontera]],LEN(TablaFronteras[[#This Row],[Frontera]])-IFERROR(FIND(\" - \",TablaFronteras[[#This Row],[Frontera]])+2,0)),Datos[País],0),\"\"))","v":89}]
["Turquía",404.728271484375,98.837326049804688,38.004489898681641,15.006220817565918,{"$f":"TablaFronteras[[#This Row],[X]]+TablaFronteras[[#This Row],[Ancho]]/2","v":423.73051643371582},{"$f":"TablaFronteras[[#This Row],[Y]]+TablaFronteras[[#This Row],[Alto]]/2","v":106.34043645858765},{"$f":"IF(AND(TablaFronteras[[#This Row],[Fila]]<>\"\",TablaFronteras[[#This Row],[X]]<miX,miX<TablaFronteras[[#This Row],[X]]+TablaFronteras[[#This Row],[Ancho]],TablaFronteras[[#This Row],[Y]]<miY,miY<TablaFronteras[[#This Row],[Y]]+TablaFronteras[[#This Row],[Alto]]),SQRT((TablaFronteras[[#This Row],[Centro X]]-miX)^2+(TablaFronteras[[#This Row],[Centro Y]]-miY)^2),\"\")","v":""},{"$f":"IF(TablaFronteras[[#This Row],[Frontera]]=\"\",\"\",IFERROR(MATCH(RIGHT(TablaFronteras[[#This Row],[Frontera]],LEN(TablaFronteras[[#This Row],[Frontera]])-IFERROR(FIND(\" - \",TablaFronteras[[#This Row],[Frontera]])+2,0)),Datos[País],0),\"\"))","v":262}]
["Rumanía",393.85110473632813,84.344253540039063,17.495275497436523,10.862992286682129,{"$f":"TablaFronteras[[#This Row],[X]]+TablaFronteras[[#This Row],[Ancho]]/2","v":402.59874248504639},{"$f":"TablaFronteras[[#This Row],[Y]]+TablaFronteras[[#This Row],[Alto]]/2","v":89.775749683380127},{"$f":"IF(AND(TablaFronteras[[#This Row],[Fila]]<>\"\",TablaFronteras[[#This Row],[X]]<miX,miX<TablaFronteras[[#This Row],[X]]+TablaFronteras[[#This Row],[Ancho]],TablaFronteras[[#This Row],[Y]]<miY,miY<TablaFronteras[[#This Row],[Y]]+TablaFronteras[[#This Row],[Alto]]),SQRT((TablaFronteras[[#This Row],[Centro X]]-miX)^2+(TablaFronteras[[#This Row],[Centro Y]]-miY)^2),\"\")","v":""},{"$f":"IF(TablaFronteras[[#This Row],[Frontera]]=\"\",\"\",IFERROR(MATCH(RIGHT(TablaFronteras[[#This Row],[Frontera]],LEN(TablaFronteras[[#This Row],[Frontera]])-IFERROR(FIND(\" - \",TablaFronteras[[#This Row],[Frontera]])+2,0)),Datos[País],0),\"\"))","v":215}]
["Bielorrusia",398.28488159179688,66.211891174316406,16.924251556396484,11.084803581237793,{"$f":"TablaFronteras[[#This Row],[X]]+TablaFronteras[[#This Row],[Ancho]]/2","v":406.74700736999512},{"$f":"TablaFronteras[[#This Row],[Y]]+TablaFronteras[[#This Row],[Alto]]/2","v":71.754292964935303},{"$f":"IF(AND(TablaFronteras[[#This Row],[Fila]]<>\"\",TablaFronteras[[#This Row],[X]]<miX,miX<TablaFronteras[[#This Row],[X]]+TablaFronteras[[#This Row],[Ancho]],TablaFronteras[[#This Row],[Y]]<miY,miY<TablaFronteras[[#This Row],[Y]]+TablaFronteras[[#This Row],[Alto]]),SQRT((TablaFronteras[[#This Row],[Centro X]]-miX)^2+(TablaFronteras[[#This Row],[Centro Y]]-miY)^2),\"\")","v":""},{"$f":"IF(TablaFronteras[[#This Row],[Frontera]]=\"\",\"\",IFERROR(MATCH(RIGHT(TablaFronteras[[#This Row],[Frontera]],LEN(TablaFronteras[[#This Row],[Frontera]])-IFERROR(FIND(\" - \",TablaFronteras[[#This Row],[Frontera]])+2,0)),Datos[País],0),\"\"))","v":31}]
["Moldavia",405.06747436523438,83.787162780761719,7.1598424911499023,7.407322883605957,{"$f":"TablaFronteras[[#This Row],[X]]+TablaFronteras[[#This Row],[Ancho]]/2","v":408.64739561080933},{"$f":"TablaFronteras[[#This Row],[Y]]+TablaFronteras[[#This Row],[Alto]]/2","v":87.490824222564697},{"$f":"IF(AND(TablaFronteras[[#This Row],[Fila]]<>\"\",TablaFronteras[[#This Row],[X]]<miX,miX<TablaFronteras[[#This Row],[X]]+TablaFronteras[[#This Row],[Ancho]],TablaFronteras[[#This Row],[Y]]<miY,miY<TablaFronteras[[#This Row],[Y]]+TablaFronteras[[#This Row],[Alto]]),SQRT((TablaFronteras[[#This Row],[Centro X]]-miX)^2+(TablaFronteras[[#This Row],[Centro Y]]-miY)^2),\"\")","v":""},{"$f":"IF(TablaFronteras[[#This Row],[Frontera]]=\"\",\"\",IFERROR(MATCH(RIGHT(TablaFronteras[[#This Row],[Frontera]],LEN(TablaFronteras[[#This Row],[Frontera]])-IFERROR(FIND(\" - \",TablaFronteras[[#This Row],[Frontera]])+2,0)),Datos[País],0),\"\"))","v":170}]
["Lituania",394.2484130859375,65.531021118164063,9.5196847915649414,5.7323622703552246,{"$f":"TablaFronteras[[#This Row],[X]]+TablaFronteras[[#This Row],[Ancho]]/2","v":399.00825548171997},{"$f":"TablaFronteras[[#This Row],[Y]]+TablaFronteras[[#This Row],[Alto]]/2","v":68.397202253341675},{"$f":"IF(AND(TablaFronteras[[#This Row],[Fila]]<>\"\",TablaFronteras[[#This Row],[X]]<miX,miX<TablaFronteras[[#This Row],[X]]+TablaFronteras[[#This Row],[Ancho]],TablaFronteras[[#This Row],[Y]]<miY,miY<TablaFronteras[[#This Row],[Y]]+TablaFronteras[[#This Row],[Alto]]),SQRT((TablaFronteras[[#This Row],[Centro X]]-miX)^2+(TablaFronteras[[#This Row],[Centro Y]]-miY)^2),\"\")","v":""},{"$f":"IF(TablaFronteras[[#This Row],[Frontera]]=\"\",\"\",IFERROR(MATCH(RIGHT(TablaFronteras[[#This Row],[Frontera]],LEN(TablaFronteras[[#This Row],[Frontera]])-IFERROR(FIND(\" - \",TablaFronteras[[#This Row],[Frontera]])+2,0)),Datos[País],0),\"\"))","v":152}]
["Letonia",394.079833984375,61.863147735595703,12.034252166748047,5.3496065139770508,{"$f":"TablaFronteras[[#This Row],[X]]+TablaFronteras[[#This Row],[Ancho]]/2","v":400.09696006774902},{"$f":"TablaFronteras[[#This Row],[Y]]+TablaFronteras[[#This Row],[Alto]]/2","v":64.537950992584229},{"$f":"IF(AND(TablaFronteras[[#This Row],[Fila]]<>\"\",TablaFronteras[[#This Row],[X]]<miX,miX<TablaFronteras[[#This Row],[X]]+TablaFronteras[[#This Row],[Ancho]],TablaFronteras[[#This Row],[Y]]<miY,miY<TablaFronteras[[#This Row],[Y]]+TablaFronteras[[#This Row],[Alto]]),SQRT((TablaFronteras[[#This Row],[Centro X]]-miX)^2+(TablaFronteras[[#This Row],[Centro Y]]-miY)^2),\"\")","v":""},{"$f":"IF(TablaFronteras[[#This Row],[Frontera]]=\"\",\"\",IFERROR(MATCH(RIGHT(TablaFronteras[[#This Row],[Frontera]],LEN(TablaFronteras[[#This Row],[Frontera]])-IFERROR(FIND(\" - \",TablaFronteras[[#This Row],[Frontera]])+2,0)),Datos[País],0),\"\"))","v":148}]
["Estonia",395.28677368164063,58.378662109375,9.8000783920288086,4.6707873344421387,{"$f":"TablaFronteras[[#This Row],[X]]+TablaFronteras[[#This Row],[Ancho]]/2","v":400.18681287765503},{"$f":"TablaFronteras[[#This Row],[Y]]+TablaFronteras[[#This Row],[Alto]]/2","v":60.714055776596069},{"$f":"IF(AND(TablaFronteras[[#This Row],[Fila]]<>\"\",TablaFronteras[[#This Row],[X]]<miX,miX<TablaFronteras[[#This Row],[X]]+TablaFronteras[[#This Row],[Ancho]],TablaFronteras[[#This Row],[Y]]<miY,miY<TablaFronteras[[#This Row],[Y]]+TablaFronteras[[#This Row],[Alto]]),SQRT((TablaFronteras[[#This Row],[Centro X]]-miX)^2+(TablaFronteras[[#This Row],[Centro Y]]-miY)^2),\"\")","v":""},{"$f":"IF(TablaFronteras[[#This Row],[Frontera]]=\"\",\"\",IFERROR(MATCH(RIGHT(TablaFronteras[[#This Row],[Frontera]],LEN(TablaFronteras[[#This Row],[Frontera]])-IFERROR(FIND(\" - \",TablaFronteras[[#This Row],[Frontera]])+2,0)),Datos[País],0),\"\"))","v":77}]
["Finlandia",390.99835205078125,36.430473327636719,18.840078353881836,21.530078887939453,{"$f":"TablaFronteras[[#This Row],[X]]+TablaFronteras[[#This Row],[Ancho]]/2","v":400.41839122772217},{"$f":"TablaFronteras[[#This Row],[Y]]+TablaFronteras[[#This Row],[Alto]]/2","v":47.195512771606445},{"$f":"IF(AND(TablaFronteras[[#This Row],[Fila]]<>\"\",TablaFronteras[[#This Row],[X]]<miX,miX<TablaFronteras[[#This Row],[X]]+TablaFronteras[[#This Row],[Ancho]],TablaFronteras[[#This Row],[Y]]<miY,miY<TablaFronteras[[#This Row],[Y]]+TablaFronteras[[#This Row],[Alto]]),SQRT((TablaFronteras[[#This Row],[Centro X]]-miX)^2+(TablaFronteras[[#This Row],[Centro Y]]-miY)^2),\"\")","v":""},{"$f":"IF(TablaFronteras[[#This Row],[Frontera]]=\"\",\"\",IFERROR(MATCH(RIGHT(TablaFronteras[[#This Row],[Frontera]],LEN(TablaFronteras[[#This Row],[Frontera]])-IFERROR(FIND(\" - \",TablaFronteras[[#This Row],[Frontera]])+2,0)),Datos[País],0),\"\"))","v":80}]
["Suecia",376.61785888671875,38.492599487304688,20.181495666503906,29.392913818359375,{"$f":"TablaFronteras[[#This Row],[X]]+TablaFronteras[[#This Row],[Ancho]]/2","v":386.7086067199707},{"$f":"TablaFronteras[[#This Row],[Y]]+TablaFronteras[[#This Row],[Alto]]/2","v":53.189056396484375},{"$f":"IF(AND(TablaFronteras[[#This Row],[Fila]]<>\"\",TablaFronteras[[#This Row],[X]]<miX,miX<TablaFronteras[[#This Row],[X]]+TablaFronteras[[#This Row],[Ancho]],TablaFronteras[[#This Row],[Y]]<miY,miY<TablaFronteras[[#This Row],[Y]]+TablaFronteras[[#This Row],[Alto]]),SQRT((TablaFronteras[[#This Row],[Centro X]]-miX)^2+(TablaFronteras[[#This Row],[Centro Y]]-miY)^2),\"\")","v":""},{"$f":"IF(TablaFronteras[[#This Row],[Frontera]]=\"\",\"\",IFERROR(MATCH(RIGHT(TablaFronteras[[#This Row],[Frontera]],LEN(TablaFronteras[[#This Row],[Frontera]])-IFERROR(FIND(\" - \",TablaFronteras[[#This Row],[Frontera]])+2,0)),Datos[País],0),\"\"))","v":245}]
["Marruecos",328.29449462890625,113.75850677490234,24.415433883666992,19.734409332275391,{"$f":"TablaFronteras[[#This Row],[X]]+TablaFronteras[[#This Row],[Ancho]]/2","v":340.50221157073975},{"$f":"TablaFronteras[[#This Row],[Y]]+TablaFronteras[[#This Row],[Alto]]/2","v":123.62571144104004},{"$f":"IF(AND(TablaFronteras[[#This Row],[Fila]]<>\"\",TablaFronteras[[#This Row],[X]]<miX,miX<TablaFronteras[[#This Row],[X]]+TablaFronteras[[#This Row],[Ancho]],TablaFronteras[[#This Row],[Y]]<miY,miY<TablaFronteras[[#This Row],[Y]]+TablaFronteras[[#This Row],[Alto]]),SQRT((TablaFronteras[[#This Row],[Centro X]]-miX)^2+(TablaFronteras[[#This Row],[Centro Y]]-miY)^2),\"\")","v":""},{"$f":"IF(TablaFronteras[[#This Row],[Frontera]]=\"\",\"\",IFERROR(MATCH(RIGHT(TablaFronteras[[#This Row],[Frontera]],LEN(TablaFronteras[[#This Row],[Frontera]])-IFERROR(FIND(\" - \",TablaFronteras[[#This Row],[Frontera]])+2,0)),Datos[País],0),\"\"))","v":163}]
["Sáhara Occidental",319.93850708007813,133.41740417480469,17.605512619018555,16.817953109741211,{"$f":"TablaFronteras[[#This Row],[X]]+TablaFronteras[[#This Row],[Ancho]]/2","v":328.7412633895874},{"$f":"TablaFronteras[[#This Row],[Y]]+TablaFronteras[[#This Row],[Alto]]/2","v":141.82638072967529},{"$f":"IF(AND(TablaFronteras[[#This Row],[Fila]]<>\"\",TablaFronteras[[#This Row],[X]]<miX,miX<TablaFronteras[[#This Row],[X]]+TablaFronteras[[#This Row],[Ancho]],TablaFronteras[[#This Row],[Y]]<miY,miY<TablaFronteras[[#This Row],[Y]]+TablaFronteras[[#This Row],[Alto]]),SQRT((TablaFronteras[[#This Row],[Centro X]]-miX)^2+(TablaFronteras[[#This Row],[Centro Y]]-miY)^2),\"\")","v":""},{"$f":"IF(TablaFronteras[[#This Row],[Frontera]]=\"\",\"\",IFERROR(MATCH(RIGHT(TablaFronteras[[#This Row],[Frontera]],LEN(TablaFronteras[[#This Row],[Frontera]])-IFERROR(FIND(\" - \",TablaFronteras[[#This Row],[Frontera]])+2,0)),Datos[País],0),\"\"))","v":248}]
["Argelia",337.51849365234375,110.89976501464844,41.123069763183594,43.664566040039063,{"$f":"TablaFronteras[[#This Row],[X]]+TablaFronteras[[#This Row],[Ancho]]/2","v":358.08002853393555},{"$f":"TablaFronteras[[#This Row],[Y]]+TablaFronteras[[#This Row],[Alto]]/2","v":132.73204803466797},{"$f":"IF(AND(TablaFronteras[[#This Row],[Fila]]<>\"\",TablaFronteras[[#This Row],[X]]<miX,miX<TablaFronteras[[#This Row],[X]]+TablaFronteras[[#This Row],[Ancho]],TablaFronteras[[#This Row],[Y]]<miY,miY<TablaFronteras[[#This Row],[Y]]+TablaFronteras[[#This Row],[Alto]]),SQRT((TablaFronteras[[#This Row],[Centro X]]-miX)^2+(TablaFronteras[[#This Row],[Centro Y]]-miY)^2),\"\")","v":""},{"$f":"IF(TablaFronteras[[#This Row],[Frontera]]=\"\",\"\",IFERROR(MATCH(RIGHT(TablaFronteras[[#This Row],[Frontera]],LEN(TablaFronteras[[#This Row],[Frontera]])-IFERROR(FIND(\" - \",TablaFronteras[[#This Row],[Frontera]])+2,0)),Datos[País],0),\"\"))","v":11}]
["Túnez",370.29266357421875,110.29086303710938,7.4303936958312988,17.159292221069336,{"$f":"TablaFronteras[[#This Row],[X]]+TablaFronteras[[#This Row],[Ancho]]/2","v":374.0078604221344},{"$f":"TablaFronteras[[#This Row],[Y]]+TablaFronteras[[#This Row],[Alto]]/2","v":118.87050914764404},{"$f":"IF(AND(TablaFronteras[[#This Row],[Fila]]<>\"\",TablaFronteras[[#This Row],[X]]<miX,miX<TablaFronteras[[#This Row],[X]]+TablaFronteras[[#This Row],[Ancho]],TablaFronteras[[#This Row],[Y]]<miY,miY<TablaFronteras[[#This Row],[Y]]+TablaFronteras[[#This Row],[Alto]]),SQRT((TablaFronteras[[#This Row],[Centro X]]-miX)^2+(TablaFronteras[[#This Row],[Centro Y]]-miY)^2),\"\")","v":""},{"$f":"IF(TablaFronteras[[#This Row],[Frontera]]=\"\",\"\",IFERROR(MATCH(RIGHT(TablaFronteras[[#This Row],[Frontera]],LEN(TablaFronteras[[#This Row],[Frontera]])-IFERROR(FIND(\" - \",TablaFronteras[[#This Row],[Frontera]])+2,0)),Datos[País],0),\"\"))","v":264}]
["Libia",373.52865600585938,120.18149566650391,31.796928405761719,33.207321166992188,{"$f":"TablaFronteras[[#This Row],[X]]+TablaFronteras[[#This Row],[Ancho]]/2","v":389.42712020874023},{"$f":"TablaFronteras[[#This Row],[Y]]+TablaFronteras[[#This Row],[Alto]]/2","v":136.78515625},{"$f":"IF(AND(TablaFronteras[[#This Row],[Fila]]<>\"\",TablaFronteras[[#This Row],[X]]<miX,miX<TablaFronteras[[#This Row],[X]]+TablaFronteras[[#This Row],[Ancho]],TablaFronteras[[#This Row],[Y]]<miY,miY<TablaFronteras[[#This Row],[Y]]+TablaFronteras[[#This Row],[Alto]]),SQRT((TablaFronteras[[#This Row],[Centro X]]-miX)^2+(TablaFronteras[[#This Row],[Centro Y]]-miY)^2),\"\")","v":""},{"$f":"IF(TablaFronteras[[#This Row],[Frontera]]=\"\",\"\",IFERROR(MATCH(RIGHT(TablaFronteras[[#This Row],[Frontera]],LEN(TablaFronteras[[#This Row],[Frontera]])-IFERROR(FIND(\" - \",TablaFronteras[[#This Row],[Frontera]])+2,0)),Datos[País],0),\"\"))","v":150}]
["Egipto",404.07772827148438,124.05377960205078,22.910865783691406,23.895118713378906,{"$f":"TablaFronteras[[#This Row],[X]]+TablaFronteras[[#This Row],[Ancho]]/2","v":415.53316116333008},{"$f":"TablaFronteras[[#This Row],[Y]]+TablaFronteras[[#This Row],[Alto]]/2","v":136.00133895874023},{"$f":"IF(AND(TablaFronteras[[#This Row],[Fila]]<>\"\",TablaFronteras[[#This Row],[X]]<miX,miX<TablaFronteras[[#This Row],[X]]+TablaFronteras[[#This Row],[Ancho]],TablaFronteras[[#This Row],[Y]]<miY,miY<TablaFronteras[[#This Row],[Y]]+TablaFronteras[[#This Row],[Alto]]),SQRT((TablaFronteras[[#This Row],[Centro X]]-miX)^2+(TablaFronteras[[#This Row],[Centro Y]]-miY)^2),\"\")","v":""},{"$f":"IF(TablaFronteras[[#This Row],[Frontera]]=\"\",\"\",IFERROR(MATCH(RIGHT(TablaFronteras[[#This Row],[Frontera]],LEN(TablaFronteras[[#This Row],[Frontera]])-IFERROR(FIND(\" - \",TablaFronteras[[#This Row],[Frontera]])+2,0)),Datos[País],0),\"\"))","v":69}]
["Malí",328.82888793945313,140.14952087402344,34.576930999755859,35.699134826660156,{"$f":"TablaFronteras[[#This Row],[X]]+TablaFronteras[[#This Row],[Ancho]]/2","v":346.11735343933105},{"$f":"TablaFronteras[[#This Row],[Y]]+TablaFronteras[[#This Row],[Alto]]/2","v":157.99908828735352},{"$f":"IF(AND(TablaFronteras[[#This Row],[Fila]]<>\"\",TablaFronteras[[#This Row],[X]]<miX,miX<TablaFronteras[[#This Row],[X]]+TablaFronteras[[#This Row],[Ancho]],TablaFronteras[[#This Row],[Y]]<miY,miY<TablaFronteras[[#This Row],[Y]]+TablaFronteras[[#This Row],[Alto]]),SQRT((TablaFronteras[[#This Row],[Centro X]]-miX)^2+(TablaFronteras[[#This Row],[Centro Y]]-miY)^2),\"\")","v":""},{"$f":"IF(TablaFronteras[[#This Row],[Frontera]]=\"\",\"\",IFERROR(MATCH(RIGHT(TablaFronteras[[#This Row],[Frontera]],LEN(TablaFronteras[[#This Row],[Frontera]])-IFERROR(FIND(\" - \",TablaFronteras[[#This Row],[Frontera]])+2,0)),Datos[País],0),\"\"))","v":162}]
["Mauritania",320.02291870117188,134.44566345214844,25.260787963867188,30.240158081054688,{"$f":"TablaFronteras[[#This Row],[X]]+TablaFronteras[[#This Row],[Ancho]]/2","v":332.65331268310547},{"$f":"TablaFronteras[[#This Row],[Y]]+TablaFronteras[[#This Row],[Alto]]/2","v":149.56574249267578},{"$f":"IF(AND(TablaFronteras[[#This Row],[Fila]]<>\"\",TablaFronteras[[#This Row],[X]]<miX,miX<TablaFronteras[[#This Row],[X]]+TablaFronteras[[#This Row],[Ancho]],TablaFronteras[[#This Row],[Y]]<miY,miY<TablaFronteras[[#This Row],[Y]]+TablaFronteras[[#This Row],[Alto]]),SQRT((TablaFronteras[[#This Row],[Centro X]]-miX)^2+(TablaFronteras[[#This Row],[Centro Y]]-miY)^2),\"\")","v":""},{"$f":"IF(TablaFronteras[[#This Row],[Frontera]]=\"\",\"\",IFERROR(MATCH(RIGHT(TablaFronteras[[#This Row],[Frontera]],LEN(TablaFronteras[[#This Row],[Frontera]])-IFERROR(FIND(\" - \",TablaFronteras[[#This Row],[Frontera]])+2,0)),Datos[País],0),\"\"))","v":166}]
["Guinea-Bisáu",320.05322265625,169.8968505859375,5.659369945526123,4.1917324066162109,{"$f":"TablaFronteras[[#This Row],[X]]+TablaFronteras[[#This Row],[Ancho]]/2","v":322.88290762901306},{"$f":"TablaFronteras[[#This Row],[Y]]+TablaFronteras[[#This Row],[Alto]]/2","v":171.99271678924561},{"$f":"IF(AND(TablaFronteras[[#This Row],[Fila]]<>\"\",TablaFronteras[[#This Row],[X]]<miX,miX<TablaFronteras[[#This Row],[X]]+TablaFronteras[[#This Row],[Ancho]],TablaFronteras[[#This Row],[Y]]<miY,miY<TablaFronteras[[#This Row],[Y]]+TablaFronteras[[#This Row],[Alto]]),SQRT((TablaFronteras[[#This Row],[Centro X]]-miX)^2+(TablaFronteras[[#This Row],[Centro Y]]-miY)^2),\"\")","v":""},{"$f":"IF(TablaFronteras[[#This Row],[Frontera]]=\"\",\"\",IFERROR(MATCH(RIGHT(TablaFronteras[[#This Row],[Frontera]],LEN(TablaFronteras[[#This Row],[Frontera]])-IFERROR(FIND(\" - \",TablaFronteras[[#This Row],[Frontera]])+2,0)),Datos[País],0),\"\"))","v":98}]
["Guinea",321.97344970703125,169.90724182128906,16.563936233520508,13.297558784484863,{"$f":"TablaFronteras[[#This Row],[X]]+TablaFronteras[[#This Row],[Ancho]]/2","v":330.2554178237915},{"$f":"TablaFronteras[[#This Row],[Y]]+TablaFronteras[[#This Row],[Alto]]/2","v":176.55602121353149},{"$f":"IF(AND(TablaFronteras[[#This Row],[Fila]]<>\"\",TablaFronteras[[#This Row],[X]]<miX,miX<TablaFronteras[[#This Row],[X]]+TablaFronteras[[#This Row],[Ancho]],TablaFronteras[[#This Row],[Y]]<miY,miY<TablaFronteras[[#This Row],[Y]]+TablaFronteras[[#This Row],[Alto]]),SQRT((TablaFronteras[[#This Row],[Centro X]]-miX)^2+(TablaFronteras[[#This Row],[Centro Y]]-miY)^2),\"\")","v":""},{"$f":"IF(TablaFronteras[[#This Row],[Frontera]]=\"\",\"\",IFERROR(MATCH(RIGHT(TablaFronteras[[#This Row],[Frontera]],LEN(TablaFronteras[[#This Row],[Frontera]])-IFERROR(FIND(\" - \",TablaFronteras[[#This Row],[Frontera]])+2,0)),Datos[País],0),\"\"))","v":96}]
["Sierra Leona",326.32748413085938,176.20126342773438,7.6894488334655762,7.6362204551696777,{"$f":"TablaFronteras[[#This Row],[X]]+TablaFronteras[[#This Row],[Ancho]]/2","v":330.17220854759216},{"$f":"TablaFronteras[[#This Row],[Y]]+TablaFronteras[[#This Row],[Alto]]/2","v":180.01937365531921},{"$f":"IF(AND(TablaFronteras[[#This Row],[Fila]]<>\"\",TablaFronteras[[#This Row],[X]]<miX,miX<TablaFronteras[[#This Row],[X]]+TablaFronteras[[#This Row],[Ancho]],TablaFronteras[[#This Row],[Y]]<miY,miY<TablaFronteras[[#This Row],[Y]]+TablaFronteras[[#This Row],[Alto]]),SQRT((TablaFronteras[[#This Row],[Centro X]]-miX)^2+(TablaFronteras[[#This Row],[Centro Y]]-miY)^2),\"\")","v":""},{"$f":"IF(TablaFronteras[[#This Row],[Frontera]]=\"\",\"\",IFERROR(MATCH(RIGHT(TablaFronteras[[#This Row],[Frontera]],LEN(TablaFronteras[[#This Row],[Frontera]])-IFERROR(FIND(\" - \",TablaFronteras[[#This Row],[Frontera]])+2,0)),Datos[País],0),\"\"))","v":234}]
["Liberia",330.08377075195313,180.09425354003906,8.9439373016357422,9.8709449768066406,{"$f":"TablaFronteras[[#This Row],[X]]+TablaFronteras[[#This Row],[Ancho]]/2","v":334.555739402771},{"$f":"TablaFronteras[[#This Row],[Y]]+TablaFronteras[[#This Row],[Alto]]/2","v":185.02972602844238},{"$f":"IF(AND(TablaFronteras[[#This Row],[Fila]]<>\"\",TablaFronteras[[#This Row],[X]]<miX,miX<TablaFronteras[[#This Row],[X]]+TablaFronteras[[#This Row],[Ancho]],TablaFronteras[[#This Row],[Y]]<miY,miY<TablaFronteras[[#This Row],[Y]]+TablaFronteras[[#This Row],[Alto]]),SQRT((TablaFronteras[[#This Row],[Centro X]]-miX)^2+(TablaFronteras[[#This Row],[Centro Y]]-miY)^2),\"\")","v":""},{"$f":"IF(TablaFronteras[[#This Row],[Frontera]]=\"\",\"\",IFERROR(MATCH(RIGHT(TablaFronteras[[#This Row],[Frontera]],LEN(TablaFronteras[[#This Row],[Frontera]])-IFERROR(FIND(\" - \",TablaFronteras[[#This Row],[Frontera]])+2,0)),Datos[País],0),\"\"))","v":149}]
["Costa de Marfil",336.5858154296875,174.56196594238281,12.465512275695801,15.33464527130127,{"$f":"TablaFronteras[[#This Row],[X]]+TablaFronteras[[#This Row],[Ancho]]/2","v":342.8185715675354},{"$f":"TablaFronteras[[#This Row],[Y]]+TablaFronteras[[#This Row],[Alto]]/2","v":182.22928857803345},{"$f":"IF(AND(TablaFronteras[[#This Row],[Fila]]<>\"\",TablaFronteras[[#This Row],[X]]<miX,miX<TablaFronteras[[#This Row],[X]]+TablaFronteras[[#This Row],[Ancho]],TablaFronteras[[#This Row],[Y]]<miY,miY<TablaFronteras[[#This Row],[Y]]+TablaFronteras[[#This Row],[Alto]]),SQRT((TablaFronteras[[#This Row],[Centro X]]-miX)^2+(TablaFronteras[[#This Row],[Centro Y]]-miY)^2),\"\")","v":""},{"$f":"IF(TablaFronteras[[#This Row],[Frontera]]=\"\",\"\",IFERROR(MATCH(RIGHT(TablaFronteras[[#This Row],[Frontera]],LEN(TablaFronteras[[#This Row],[Frontera]])-IFERROR(FIND(\" - \",TablaFronteras[[#This Row],[Frontera]])+2,0)),Datos[País],0),\"\"))","v":62}]
["Burkina Faso",343.07659912109375,163.90196228027344,16.178583145141602,13.789763450622559,{"$f":"TablaFronteras[[#This Row],[X]]+TablaFronteras[[#This Row],[Ancho]]/2","v":351.16589069366455},{"$f":"TablaFronteras[[#This Row],[Y]]+TablaFronteras[[#This Row],[Alto]]/2","v":170.79684400558472},{"$f":"IF(AND(TablaFronteras[[#This Row],[Fila]]<>\"\",TablaFronteras[[#This Row],[X]]<miX,miX<TablaFronteras[[#This Row],[X]]+TablaFronteras[[#This Row],[Ancho]],TablaFronteras[[#This Row],[Y]]<miY,miY<TablaFronteras[[#This Row],[Y]]+TablaFronteras[[#This Row],[Alto]]),SQRT((TablaFronteras[[#This Row],[Centro X]]-miX)^2+(TablaFronteras[[#This Row],[Centro Y]]-miY)^2),\"\")","v":""},{"$f":"IF(TablaFronteras[[#This Row],[Frontera]]=\"\",\"\",IFERROR(MATCH(RIGHT(TablaFronteras[[#This Row],[Frontera]],LEN(TablaFronteras[[#This Row],[Frontera]])-IFERROR(FIND(\" - \",TablaFronteras[[#This Row],[Frontera]])+2,0)),Datos[País],0),\"\"))","v":40}]
["Ghana",347.76708984375,173.63252258300781,8.2970075607299805,15.458425521850586,{"$f":"TablaFronteras[[#This Row],[X]]+TablaFronteras[[#This Row],[Ancho]]/2","v":351.91559362411499},{"$f":"TablaFronteras[[#This Row],[Y]]+TablaFronteras[[#This Row],[Alto]]/2","v":181.36173534393311},{"$f":"IF(AND(TablaFronteras[[#This Row],[Fila]]<>\"\",TablaFronteras[[#This Row],[X]]<miX,miX<TablaFronteras[[#This Row],[X]]+TablaFronteras[[#This Row],[Ancho]],TablaFronteras[[#This Row],[Y]]<miY,miY<TablaFronteras[[#This Row],[Y]]+TablaFronteras[[#This Row],[Alto]]),SQRT((TablaFronteras[[#This Row],[Centro X]]-miX)^2+(TablaFronteras[[#This Row],[Centro Y]]-miY)^2),\"\")","v":""},{"$f":"IF(TablaFronteras[[#This Row],[Frontera]]=\"\",\"\",IFERROR(MATCH(RIGHT(TablaFronteras[[#This Row],[Frontera]],LEN(TablaFronteras[[#This Row],[Frontera]])-IFERROR(FIND(\" - \",TablaFronteras[[#This Row],[Frontera]])+2,0)),Datos[País],0),\"\"))","v":86}]
["Togo",353.53179931640625,173.60307312011719,5.3624410629272461,12.218424797058105,{"$f":"TablaFronteras[[#This Row],[X]]+TablaFronteras[[#This Row],[Ancho]]/2","v":356.21301984786987},{"$f":"TablaFronteras[[#This Row],[Y]]+TablaFronteras[[#This Row],[Alto]]/2","v":179.71228551864624},{"$f":"IF(AND(TablaFronteras[[#This Row],[Fila]]<>\"\",TablaFronteras[[#This Row],[X]]<miX,miX<TablaFronteras[[#This Row],[X]]+TablaFronteras[[#This Row],[Ancho]],TablaFronteras[[#This Row],[Y]]<miY,miY<TablaFronteras[[#This Row],[Y]]+TablaFronteras[[#This Row],[Alto]]),SQRT((TablaFronteras[[#This Row],[Centro X]]-miX)^2+(TablaFronteras[[#This Row],[Centro Y]]-miY)^2),\"\")","v":""},{"$f":"IF(TablaFronteras[[#This Row],[Frontera]]=\"\",\"\",IFERROR(MATCH(RIGHT(TablaFronteras[[#This Row],[Frontera]],LEN(TablaFronteras[[#This Row],[Frontera]])-IFERROR(FIND(\" - \",TablaFronteras[[#This Row],[Frontera]])+2,0)),Datos[País],0),\"\"))","v":256}]
["Benín",355.75857543945313,170.5860595703125,6.7681889533996582,14.954803466796875,{"$f":"TablaFronteras[[#This Row],[X]]+TablaFronteras[[#This Row],[Ancho]]/2","v":359.14266991615295},{"$f":"TablaFronteras[[#This Row],[Y]]+TablaFronteras[[#This Row],[Alto]]/2","v":178.06346130371094},{"$f":"IF(AND(TablaFronteras[[#This Row],[Fila]]<>\"\",TablaFronteras[[#This Row],[X]]<miX,miX<TablaFronteras[[#This Row],[X]]+TablaFronteras[[#This Row],[Ancho]],TablaFronteras[[#This Row],[Y]]<miY,miY<TablaFronteras[[#This Row],[Y]]+TablaFronteras[[#This Row],[Alto]]),SQRT((TablaFronteras[[#This Row],[Centro X]]-miX)^2+(TablaFronteras[[#This Row],[Centro Y]]-miY)^2),\"\")","v":""},{"$f":"IF(TablaFronteras[[#This Row],[Frontera]]=\"\",\"\",IFERROR(MATCH(RIGHT(TablaFronteras[[#This Row],[Frontera]],LEN(TablaFronteras[[#This Row],[Frontera]])-IFERROR(FIND(\" - \",TablaFronteras[[#This Row],[Frontera]])+2,0)),Datos[País],0),\"\"))","v":29}]
["Nigeria",360.242431640625,166.99676513671875,24.822992324829102,23.118581771850586,{"$f":"TablaFronteras[[#This Row],[X]]+TablaFronteras[[#This Row],[Ancho]]/2","v":372.65392780303955},{"$f":"TablaFronteras[[#This Row],[Y]]+TablaFronteras[[#This Row],[Alto]]/2","v":178.55605602264404},{"$f":"IF(AND(TablaFronteras[[#This Row],[Fila]]<>\"\",TablaFronteras[[#This Row],[X]]<miX,miX<TablaFronteras[[#This Row],[X]]+TablaFronteras[[#This Row],[Ancho]],TablaFronteras[[#This Row],[Y]]<miY,miY<TablaFronteras[[#This Row],[Y]]+TablaFronteras[[#This Row],[Alto]]),SQRT((TablaFronteras[[#This Row],[Centro X]]-miX)^2+(TablaFronteras[[#This Row],[Centro Y]]-miY)^2),\"\")","v":""},{"$f":"IF(TablaFronteras[[#This Row],[Frontera]]=\"\",\"\",IFERROR(MATCH(RIGHT(TablaFronteras[[#This Row],[Frontera]],LEN(TablaFronteras[[#This Row],[Frontera]])-IFERROR(FIND(\" - \",TablaFronteras[[#This Row],[Frontera]])+2,0)),Datos[País],0),\"\"))","v":182}]
["Níger",354.66464233398438,144.05874633789063,32.84228515625,28.449920654296875,{"$f":"TablaFronteras[[#This Row],[X]]+TablaFronteras[[#This Row],[Ancho]]/2","v":371.08578491210938},{"$f":"TablaFronteras[[#This Row],[Y]]+TablaFronteras[[#This Row],[Alto]]/2","v":158.28370666503906},{"$f":"IF(AND(TablaFronteras[[#This Row],[Fila]]<>\"\",TablaFronteras[[#This Row],[X]]<miX,miX<TablaFronteras[[#This Row],[X]]+TablaFronteras[[#This Row],[Ancho]],TablaFronteras[[#This Row],[Y]]<miY,miY<TablaFronteras[[#This Row],[Y]]+TablaFronteras[[#This Row],[Alto]]),SQRT((TablaFronteras[[#This Row],[Centro X]]-miX)^2+(TablaFronteras[[#This Row],[Centro Y]]-miY)^2),\"\")","v":""},{"$f":"IF(TablaFronteras[[#This Row],[Frontera]]=\"\",\"\",IFERROR(MATCH(RIGHT(TablaFronteras[[#This Row],[Frontera]],LEN(TablaFronteras[[#This Row],[Frontera]])-IFERROR(FIND(\" - \",TablaFronteras[[#This Row],[Frontera]])+2,0)),Datos[País],0),\"\"))","v":187}]
["Chad",381.85250854492188,143.97857666015625,21.590787887573242,38.425197601318359,{"$f":"TablaFronteras[[#This Row],[X]]+TablaFronteras[[#This Row],[Ancho]]/2","v":392.6479024887085},{"$f":"TablaFronteras[[#This Row],[Y]]+TablaFronteras[[#This Row],[Alto]]/2","v":163.19117546081543},{"$f":"IF(AND(TablaFronteras[[#This Row],[Fila]]<>\"\",TablaFronteras[[#This Row],[X]]<miX,miX<TablaFronteras[[#This Row],[X]]+TablaFronteras[[#This Row],[Ancho]],TablaFronteras[[#This Row],[Y]]<miY,miY<TablaFronteras[[#This Row],[Y]]+TablaFronteras[[#This Row],[Alto]]),SQRT((TablaFronteras[[#This Row],[Centro X]]-miX)^2+(TablaFronteras[[#This Row],[Centro Y]]-miY)^2),\"\")","v":""},{"$f":"IF(TablaFronteras[[#This Row],[Frontera]]=\"\",\"\",IFERROR(MATCH(RIGHT(TablaFronteras[[#This Row],[Frontera]],LEN(TablaFronteras[[#This Row],[Frontera]])-IFERROR(FIND(\" - \",TablaFronteras[[#This Row],[Frontera]])+2,0)),Datos[País],0),\"\"))","v":51}]
["Sudán",399.24826049804688,144.64961242675781,34.668190002441406,33.188976287841797,{"$f":"TablaFronteras[[#This Row],[X]]+TablaFronteras[[#This Row],[Ancho]]/2","v":416.58235549926758},{"$f":"TablaFronteras[[#This Row],[Y]]+TablaFronteras[[#This Row],[Alto]]/2","v":161.24410057067871},{"$f":"IF(AND(TablaFronteras[[#This Row],[Fila]]<>\"\",TablaFronteras[[#This Row],[X]]<miX,miX<TablaFronteras[[#This Row],[X]]+TablaFronteras[[#This Row],[Ancho]],TablaFronteras[[#This Row],[Y]]<miY,miY<TablaFronteras[[#This Row],[Y]]+TablaFronteras[[#This Row],[Alto]]),SQRT((TablaFronteras[[#This Row],[Centro X]]-miX)^2+(TablaFronteras[[#This Row],[Centro Y]]-miY)^2),\"\")","v":""},{"$f":"IF(TablaFronteras[[#This Row],[Frontera]]=\"\",\"\",IFERROR(MATCH(RIGHT(TablaFronteras[[#This Row],[Frontera]],LEN(TablaFronteras[[#This Row],[Frontera]])-IFERROR(FIND(\" - \",TablaFronteras[[#This Row],[Frontera]])+2,0)),Datos[País],0),\"\"))","v":243}]
["Sudán del Sur",402.53298950195313,170.74763488769531,26.024251937866211,21.246219635009766,{"$f":"TablaFronteras[[#This Row],[X]]+TablaFronteras[[#This Row],[Ancho]]/2","v":415.54511547088623},{"$f":"TablaFronteras[[#This Row],[Y]]+TablaFronteras[[#This Row],[Alto]]/2","v":181.3707447052002},{"$f":"IF(AND(TablaFronteras[[#This Row],[Fila]]<>\"\",TablaFronteras[[#This Row],[X]]<miX,miX<TablaFronteras[[#This Row],[X]]+TablaFronteras[[#This Row],[Ancho]],TablaFronteras[[#This Row],[Y]]<miY,miY<TablaFronteras[[#This Row],[Y]]+TablaFronteras[[#This Row],[Alto]]),SQRT((TablaFronteras[[#This Row],[Centro X]]-miX)^2+(TablaFronteras[[#This Row],[Centro Y]]-miY)^2),\"\")","v":""},{"$f":"IF(TablaFronteras[[#This Row],[Frontera]]=\"\",\"\",IFERROR(MATCH(RIGHT(TablaFronteras[[#This Row],[Frontera]],LEN(TablaFronteras[[#This Row],[Frontera]])-IFERROR(FIND(\" - \",TablaFronteras[[#This Row],[Frontera]])+2,0)),Datos[País],0),\"\"))","v":244}]
["Eritrea",429.10140991210938,157.00874328613281,14.55370044708252,13.630393981933594,{"$f":"TablaFronteras[[#This Row],[X]]+TablaFronteras[[#This Row],[Ancho]]/2","v":436.37826013565063},{"$f":"TablaFronteras[[#This Row],[Y]]+TablaFronteras[[#This Row],[Alto]]/2","v":163.82394027709961},{"$f":"IF(AND(TablaFronteras[[#This Row],[Fila]]<>\"\",TablaFronteras[[#This Row],[X]]<miX,miX<TablaFronteras[[#This Row],[X]]+TablaFronteras[[#This Row],[Ancho]],TablaFronteras[[#This Row],[Y]]<miY,miY<TablaFronteras[[#This Row],[Y]]+TablaFronteras[[#This Row],[Alto]]),SQRT((TablaFronteras[[#This Row],[Centro X]]-miX)^2+(TablaFronteras[[#This Row],[Centro Y]]-miY)^2),\"\")","v":""},{"$f":"IF(TablaFronteras[[#This Row],[Frontera]]=\"\",\"\",IFERROR(MATCH(RIGHT(TablaFronteras[[#This Row],[Frontera]],LEN(TablaFronteras[[#This Row],[Frontera]])-IFERROR(FIND(\" - \",TablaFronteras[[#This Row],[Frontera]])+2,0)),Datos[País],0),\"\"))","v":72}]
["Somalia",439.30166625976563,171.61164855957031,21.218189239501953,32.924095153808594,{"$f":"TablaFronteras[[#This Row],[X]]+TablaFronteras[[#This Row],[Ancho]]/2","v":449.9107608795166},{"$f":"TablaFronteras[[#This Row],[Y]]+TablaFronteras[[#This Row],[Alto]]/2","v":188.07369613647461},{"$f":"IF(AND(TablaFronteras[[#This Row],[Fila]]<>\"\",TablaFronteras[[#This Row],[X]]<miX,miX<TablaFronteras[[#This Row],[X]]+TablaFronteras[[#This Row],[Ancho]],TablaFronteras[[#This Row],[Y]]<miY,miY<TablaFronteras[[#This Row],[Y]]+TablaFronteras[[#This Row],[Alto]]),SQRT((TablaFronteras[[#This Row],[Centro X]]-miX)^2+(TablaFronteras[[#This Row],[Centro Y]]-miY)^2),\"\")","v":""},{"$f":"IF(TablaFronteras[[#This Row],[Frontera]]=\"\",\"\",IFERROR(MATCH(RIGHT(TablaFronteras[[#This Row],[Frontera]],LEN(TablaFronteras[[#This Row],[Frontera]])-IFERROR(FIND(\" - \",TablaFronteras[[#This Row],[Frontera]])+2,0)),Datos[País],0),\"\"))","v":238}]
["Etiopía",422.98883056640625,164.39370727539063,30.171180725097656,27.814723968505859,{"$f":"TablaFronteras[[#This Row],[X]]+TablaFronteras[[#This Row],[Ancho]]/2","v":438.07442092895508},{"$f":"TablaFronteras[[#This Row],[Y]]+TablaFronteras[[#This Row],[Alto]]/2","v":178.30106925964355},{"$f":"IF(AND(TablaFronteras[[#This Row],[Fila]]<>\"\",TablaFronteras[[#This Row],[X]]<miX,miX<TablaFronteras[[#This Row],[X]]+TablaFronteras[[#This Row],[Ancho]],TablaFronteras[[#This Row],[Y]]<miY,miY<TablaFronteras[[#This Row],[Y]]+TablaFronteras[[#This Row],[Alto]]),SQRT((TablaFronteras[[#This Row],[Centro X]]-miX)^2+(TablaFronteras[[#This Row],[Centro Y]]-miY)^2),\"\")","v":""},{"$f":"IF(TablaFronteras[[#This Row],[Frontera]]=\"\",\"\",IFERROR(MATCH(RIGHT(TablaFronteras[[#This Row],[Frontera]],LEN(TablaFronteras[[#This Row],[Frontera]])-IFERROR(FIND(\" - \",TablaFronteras[[#This Row],[Frontera]])+2,0)),Datos[País],0),\"\"))","v":78}]
["Yibuti",440.88290405273438,169.82534790039063,3.4285826683044434,4.2349605560302734,{"$f":"TablaFronteras[[#This Row],[X]]+TablaFronteras[[#This Row],[Ancho]]/2","v":442.5971953868866},{"$f":"TablaFronteras[[#This Row],[Y]]+TablaFronteras[[#This Row],[Alto]]/2","v":171.94282817840576},{"$f":"IF(AND(TablaFronteras[[#This Row],[Fila]]<>\"\",TablaFronteras[[#This Row],[X]]<miX,miX<TablaFronteras[[#This Row],[X]]+TablaFronteras[[#This Row],[Ancho]],TablaFronteras[[#This Row],[Y]]<miY,miY<TablaFronteras[[#This Row],[Y]]+TablaFronteras[[#This Row],[Alto]]),SQRT((TablaFronteras[[#This Row],[Centro X]]-miX)^2+(TablaFronteras[[#This Row],[Centro Y]]-miY)^2),\"\")","v":""},{"$f":"IF(TablaFronteras[[#This Row],[Frontera]]=\"\",\"\",IFERROR(MATCH(RIGHT(TablaFronteras[[#This Row],[Frontera]],LEN(TablaFronteras[[#This Row],[Frontera]])-IFERROR(FIND(\" - \",TablaFronteras[[#This Row],[Frontera]])+2,0)),Datos[País],0),\"\"))","v":274}]
["Kenia",424.7054443359375,189.36102294921875,16.780786514282227,22.604488372802734,{"$f":"TablaFronteras[[#This Row],[X]]+TablaFronteras[[#This Row],[Ancho]]/2","v":433.09583759307861},{"$f":"TablaFronteras[[#This Row],[Y]]+TablaFronteras[[#This Row],[Alto]]/2","v":200.66326713562012},{"$f":"IF(AND(TablaFronteras[[#This Row],[Fila]]<>\"\",TablaFronteras[[#This Row],[X]]<miX,miX<TablaFronteras[[#This Row],[X]]+TablaFronteras[[#This Row],[Ancho]],TablaFronteras[[#This Row],[Y]]<miY,miY<TablaFronteras[[#This Row],[Y]]+TablaFronteras[[#This Row],[Alto]]),SQRT((TablaFronteras[[#This Row],[Centro X]]-miX)^2+(TablaFronteras[[#This Row],[Centro Y]]-miY)^2),\"\")","v":""},{"$f":"IF(TablaFronteras[[#This Row],[Frontera]]=\"\",\"\",IFERROR(MATCH(RIGHT(TablaFronteras[[#This Row],[Frontera]],LEN(TablaFronteras[[#This Row],[Frontera]])-IFERROR(FIND(\" - \",TablaFronteras[[#This Row],[Frontera]])+2,0)),Datos[País],0),\"\"))","v":141}]
["Uganda",415.7947998046875,190.24960327148438,10.988031387329102,13.839920997619629,{"$f":"TablaFronteras[[#This Row],[X]]+TablaFronteras[[#This Row],[Ancho]]/2","v":421.28881549835205},{"$f":"TablaFronteras[[#This Row],[Y]]+TablaFronteras[[#This Row],[Alto]]/2","v":197.16956377029419},{"$f":"IF(AND(TablaFronteras[[#This Row],[Fila]]<>\"\",TablaFronteras[[#This Row],[X]]<miX,miX<TablaFronteras[[#This Row],[X]]+TablaFronteras[[#This Row],[Ancho]],TablaFronteras[[#This Row],[Y]]<miY,miY<TablaFronteras[[#This Row],[Y]]+TablaFronteras[[#This Row],[Alto]]),SQRT((TablaFronteras[[#This Row],[Centro X]]-miX)^2+(TablaFronteras[[#This Row],[Centro Y]]-miY)^2),\"\")","v":""},{"$f":"IF(TablaFronteras[[#This Row],[Frontera]]=\"\",\"\",IFERROR(MATCH(RIGHT(TablaFronteras[[#This Row],[Frontera]],LEN(TablaFronteras[[#This Row],[Frontera]])-IFERROR(FIND(\" - \",TablaFronteras[[#This Row],[Frontera]])+2,0)),Datos[País],0),\"\"))","v":266}]
["Ruanda",414.3795166015625,203.14707946777344,4.2485041618347168,4.1122832298278809,{"$f":"TablaFronteras[[#This Row],[X]]+TablaFronteras[[#This Row],[Ancho]]/2","v":416.50376868247986},{"$f":"TablaFronteras[[#This Row],[Y]]+TablaFronteras[[#This Row],[Alto]]/2","v":205.20322108268738},{"$f":"IF(AND(TablaFronteras[[#This Row],[Fila]]<>\"\",TablaFronteras[[#This Row],[X]]<miX,miX<TablaFronteras[[#This Row],[X]]+TablaFronteras[[#This Row],[Ancho]],TablaFronteras[[#This Row],[Y]]<miY,miY<TablaFronteras[[#This Row],[Y]]+TablaFronteras[[#This Row],[Alto]]),SQRT((TablaFronteras[[#This Row],[Centro X]]-miX)^2+(TablaFronteras[[#This Row],[Centro Y]]-miY)^2),\"\")","v":""},{"$f":"IF(TablaFronteras[[#This Row],[Frontera]]=\"\",\"\",IFERROR(MATCH(RIGHT(TablaFronteras[[#This Row],[Frontera]],LEN(TablaFronteras[[#This Row],[Frontera]])-IFERROR(FIND(\" - \",TablaFronteras[[#This Row],[Frontera]])+2,0)),Datos[País],0),\"\"))","v":214}]
["Burundi",414.6954345703125,206.06550598144531,3.8731496334075928,5.3285040855407715,{"$f":"TablaFronteras[[#This Row],[X]]+TablaFronteras[[#This Row],[Ancho]]/2","v":416.6320093870163},{"$f":"TablaFronteras[[#This Row],[Y]]+TablaFronteras[[#This Row],[Alto]]/2","v":208.7297580242157},{"$f":"IF(AND(TablaFronteras[[#This Row],[Fila]]<>\"\",TablaFronteras[[#This Row],[X]]<miX,miX<TablaFronteras[[#This Row],[X]]+TablaFronteras[[#This Row],[Ancho]],TablaFronteras[[#This Row],[Y]]<miY,miY<TablaFronteras[[#This Row],[Y]]+TablaFronteras[[#This Row],[Alto]]),SQRT((TablaFronteras[[#This Row],[Centro X]]-miX)^2+(TablaFronteras[[#This Row],[Centro Y]]-miY)^2),\"\")","v":""},{"$f":"IF(TablaFronteras[[#This Row],[Frontera]]=\"\",\"\",IFERROR(MATCH(RIGHT(TablaFronteras[[#This Row],[Frontera]],LEN(TablaFronteras[[#This Row],[Frontera]])-IFERROR(FIND(\" - \",TablaFronteras[[#This Row],[Frontera]])+2,0)),Datos[País],0),\"\"))","v":41}]
["Tanzania",415.88174438476563,202.95747375488281,22.177244186401367,26.10456657409668,{"$f":"TablaFronteras[[#This Row],[X]]+TablaFronteras[[#This Row],[Ancho]]/2","v":426.97036647796631},{"$f":"TablaFronteras[[#This Row],[Y]]+TablaFronteras[[#This Row],[Alto]]/2","v":216.00975704193115},{"$f":"IF(AND(TablaFronteras[[#This Row],[Fila]]<>\"\",TablaFronteras[[#This Row],[X]]<miX,miX<TablaFronteras[[#This Row],[X]]+TablaFronteras[[#This Row],[Ancho]],TablaFronteras[[#This Row],[Y]]<miY,miY<TablaFronteras[[#This Row],[Y]]+TablaFronteras[[#This Row],[Alto]]),SQRT((TablaFronteras[[#This Row],[Centro X]]-miX)^2+(TablaFronteras[[#This Row],[Centro Y]]-miY)^2),\"\")","v":""},{"$f":"IF(TablaFronteras[[#This Row],[Frontera]]=\"\",\"\",IFERROR(MATCH(RIGHT(TablaFronteras[[#This Row],[Frontera]],LEN(TablaFronteras[[#This Row],[Frontera]])-IFERROR(FIND(\" - \",TablaFronteras[[#This Row],[Frontera]])+2,0)),Datos[País],0),\"\"))","v":251}]
["Zambia",399.52581787109375,220.40614318847656,24.279685974121094,23.975196838378906,{"$f":"TablaFronteras[[#This Row],[X]]+TablaFronteras[[#This Row],[Ancho]]/2","v":411.6656608581543},{"$f":"TablaFronteras[[#This Row],[Y]]+TablaFronteras[[#This Row],[Alto]]/2","v":232.39374160766602},{"$f":"IF(AND(TablaFronteras[[#This Row],[Fila]]<>\"\",TablaFronteras[[#This Row],[X]]<miX,miX<TablaFronteras[[#This Row],[X]]+TablaFronteras[[#This Row],[Ancho]],TablaFronteras[[#This Row],[Y]]<miY,miY<TablaFronteras[[#This Row],[Y]]+TablaFronteras[[#This Row],[Alto]]),SQRT((TablaFronteras[[#This Row],[Centro X]]-miX)^2+(TablaFronteras[[#This Row],[Centro Y]]-miY)^2),\"\")","v":""},{"$f":"IF(TablaFronteras[[#This Row],[Frontera]]=\"\",\"\",IFERROR(MATCH(RIGHT(TablaFronteras[[#This Row],[Frontera]],LEN(TablaFronteras[[#This Row],[Frontera]])-IFERROR(FIND(\" - \",TablaFronteras[[#This Row],[Frontera]])+2,0)),Datos[País],0),\"\"))","v":275}]
["Mozambique",416.3218994140625,226.1422119140625,21.825511932373047,39.475040435791016,{"$f":"TablaFronteras[[#This Row],[X]]+TablaFronteras[[#This Row],[Ancho]]/2","v":427.23465538024902},{"$f":"TablaFronteras[[#This Row],[Y]]+TablaFronteras[[#This Row],[Alto]]/2","v":245.87973213195801},{"$f":"IF(AND(TablaFronteras[[#This Row],[Fila]]<>\"\",TablaFronteras[[#This Row],[X]]<miX,miX<TablaFronteras[[#This Row],[X]]+TablaFronteras[[#This Row],[Ancho]],TablaFronteras[[#This Row],[Y]]<miY,miY<TablaFronteras[[#This Row],[Y]]+TablaFronteras[[#This Row],[Alto]]),SQRT((TablaFronteras[[#This Row],[Centro X]]-miX)^2+(TablaFronteras[[#This Row],[Centro Y]]-miY)^2),\"\")","v":""},{"$f":"IF(TablaFronteras[[#This Row],[Frontera]]=\"\",\"\",IFERROR(MATCH(RIGHT(TablaFronteras[[#This Row],[Frontera]],LEN(TablaFronteras[[#This Row],[Frontera]])-IFERROR(FIND(\" - \",TablaFronteras[[#This Row],[Frontera]])+2,0)),Datos[País],0),\"\"))","v":175}]
["Malaui",422.11654663085938,223.50244140625,4.8651180267333984,18.668268203735352,{"$f":"TablaFronteras[[#This Row],[X]]+TablaFronteras[[#This Row],[Ancho]]/2","v":424.54910564422607},{"$f":"TablaFronteras[[#This Row],[Y]]+TablaFronteras[[#This Row],[Alto]]/2","v":232.83657550811768},{"$f":"IF(AND(TablaFronteras[[#This Row],[Fila]]<>\"\",TablaFronteras[[#This Row],[X]]<miX,miX<TablaFronteras[[#This Row],[X]]+TablaFronteras[[#This Row],[Ancho]],TablaFronteras[[#This Row],[Y]]<miY,miY<TablaFronteras[[#This Row],[Y]]+TablaFronteras[[#This Row],[Alto]]),SQRT((TablaFronteras[[#This Row],[Centro X]]-miX)^2+(TablaFronteras[[#This Row],[Centro Y]]-miY)^2),\"\")","v":""},{"$f":"IF(TablaFronteras[[#This Row],[Frontera]]=\"\",\"\",IFERROR(MATCH(RIGHT(TablaFronteras[[#This Row],[Frontera]],LEN(TablaFronteras[[#This Row],[Frontera]])-IFERROR(FIND(\" - \",TablaFronteras[[#This Row],[Frontera]])+2,0)),Datos[País],0),\"\"))","v":159}]
["Madagascar",442.78826904296875,229.63424682617188,14.515196800231934,32.844646453857422,{"$f":"TablaFronteras[[#This Row],[X]]+TablaFronteras[[#This Row],[Ancho]]/2","v":450.04586744308472},{"$f":"TablaFronteras[[#This Row],[Y]]+TablaFronteras[[#This Row],[Alto]]/2","v":246.05657005310059},{"$f":"IF(AND(TablaFronteras[[#This Row],[Fila]]<>\"\",TablaFronteras[[#This Row],[X]]<miX,miX<TablaFronteras[[#This Row],[X]]+TablaFronteras[[#This Row],[Ancho]],TablaFronteras[[#This Row],[Y]]<miY,miY<TablaFronteras[[#This Row],[Y]]+TablaFronteras[[#This Row],[Alto]]),SQRT((TablaFronteras[[#This Row],[Centro X]]-miX)^2+(TablaFronteras[[#This Row],[Centro Y]]-miY)^2),\"\")","v":""},{"$f":"IF(TablaFronteras[[#This Row],[Frontera]]=\"\",\"\",IFERROR(MATCH(RIGHT(TablaFronteras[[#This Row],[Frontera]],LEN(TablaFronteras[[#This Row],[Frontera]])-IFERROR(FIND(\" - \",TablaFronteras[[#This Row],[Frontera]])+2,0)),Datos[País],0),\"\"))","v":156}]
["Zimbabue",405.9722900390625,238.52299499511719,15.809921264648438,16.540315628051758,{"$f":"TablaFronteras[[#This Row],[X]]+TablaFronteras[[#This Row],[Ancho]]/2","v":413.87725067138672},{"$f":"TablaFronteras[[#This Row],[Y]]+TablaFronteras[[#This Row],[Alto]]/2","v":246.79315280914307},{"$f":"IF(AND(TablaFronteras[[#This Row],[Fila]]<>\"\",TablaFronteras[[#This Row],[X]]<miX,miX<TablaFronteras[[#This Row],[X]]+TablaFronteras[[#This Row],[Ancho]],TablaFronteras[[#This Row],[Y]]<miY,miY<TablaFronteras[[#This Row],[Y]]+TablaFronteras[[#This Row],[Alto]]),SQRT((TablaFronteras[[#This Row],[Centro X]]-miX)^2+(TablaFronteras[[#This Row],[Centro Y]]-miY)^2),\"\")","v":""},{"$f":"IF(TablaFronteras[[#This Row],[Frontera]]=\"\",\"\",IFERROR(MATCH(RIGHT(TablaFronteras[[#This Row],[Frontera]],LEN(TablaFronteras[[#This Row],[Frontera]])-IFERROR(FIND(\" - \",TablaFronteras[[#This Row],[Frontera]])+2,0)),Datos[País],0),\"\"))","v":276}]
["Botsuana",395.50607299804688,243.63456726074219,19.014410018920898,21.996456146240234,{"$f":"TablaFronteras[[#This Row],[X]]+TablaFronteras[[#This Row],[Ancho]]/2","v":405.01327800750732},{"$f":"TablaFronteras[[#This Row],[Y]]+TablaFronteras[[#This Row],[Alto]]/2","v":254.6327953338623},{"$f":"IF(AND(TablaFronteras[[#This Row],[Fila]]<>\"\",TablaFronteras[[#This Row],[X]]<miX,miX<TablaFronteras[[#This Row],[X]]+TablaFronteras[[#This Row],[Ancho]],TablaFronteras[[#This Row],[Y]]<miY,miY<TablaFronteras[[#This Row],[Y]]+TablaFronteras[[#This Row],[Alto]]),SQRT((TablaFronteras[[#This Row],[Centro X]]-miX)^2+(TablaFronteras[[#This Row],[Centro Y]]-miY)^2),\"\")","v":""},{"$f":"IF(TablaFronteras[[#This Row],[Frontera]]=\"\",\"\",IFERROR(MATCH(RIGHT(TablaFronteras[[#This Row],[Frontera]],LEN(TablaFronteras[[#This Row],[Frontera]])-IFERROR(FIND(\" - \",TablaFronteras[[#This Row],[Frontera]])+2,0)),Datos[País],0),\"\"))","v":36}]
["Angola",378.24087524414063,211.29960632324219,25.517951965332031,32.926219940185547,{"$f":"TablaFronteras[[#This Row],[X]]+TablaFronteras[[#This Row],[Ancho]]/2","v":390.99985122680664},{"$f":"TablaFronteras[[#This Row],[Y]]+TablaFronteras[[#This Row],[Alto]]/2","v":227.76271629333496},{"$f":"IF(AND(TablaFronteras[[#This Row],[Fila]]<>\"\",TablaFronteras[[#This Row],[X]]<miX,miX<TablaFronteras[[#This Row],[X]]+TablaFronteras[[#This Row],[Ancho]],TablaFronteras[[#This Row],[Y]]<miY,miY<TablaFronteras[[#This Row],[Y]]+TablaFronteras[[#This Row],[Alto]]),SQRT((TablaFronteras[[#This Row],[Centro X]]-miX)^2+(TablaFronteras[[#This Row],[Centro Y]]-miY)^2),\"\")","v":""},{"$f":"IF(TablaFronteras[[#This Row],[Frontera]]=\"\",\"\",IFERROR(MATCH(RIGHT(TablaFronteras[[#This Row],[Frontera]],LEN(TablaFronteras[[#This Row],[Frontera]])-IFERROR(FIND(\" - \",TablaFronteras[[#This Row],[Frontera]])+2,0)),Datos[País],0),\"\"))","v":7}]
["Camerún",372.88235473632813,168.92488098144531,14.758110046386719,28.001810073852539,{"$f":"TablaFronteras[[#This Row],[X]]+TablaFronteras[[#This Row],[Ancho]]/2","v":380.26140975952148},{"$f":"TablaFronteras[[#This Row],[Y]]+TablaFronteras[[#This Row],[Alto]]/2","v":182.92578601837158},{"$f":"IF(AND(TablaFronteras[[#This Row],[Fila]]<>\"\",TablaFronteras[[#This Row],[X]]<miX,miX<TablaFronteras[[#This Row],[X]]+TablaFronteras[[#This Row],[Ancho]],TablaFronteras[[#This Row],[Y]]<miY,miY<TablaFronteras[[#This Row],[Y]]+TablaFronteras[[#This Row],[Alto]]),SQRT((TablaFronteras[[#This Row],[Centro X]]-miX)^2+(TablaFronteras[[#This Row],[Centro Y]]-miY)^2),\"\")","v":""},{"$f":"IF(TablaFronteras[[#This Row],[Frontera]]=\"\",\"\",IFERROR(MATCH(RIGHT(TablaFronteras[[#This Row],[Frontera]],LEN(TablaFronteras[[#This Row],[Frontera]])-IFERROR(FIND(\" - \",TablaFronteras[[#This Row],[Frontera]])+2,0)),Datos[País],0),\"\"))","v":46}]
["República Centroafricana",384.1927490234375,173.92669677734375,27.146141052246094,21.357481002807617,{"$f":"TablaFronteras[[#This Row],[X]]+TablaFronteras[[#This Row],[Ancho]]/2","v":397.76581954956055},{"$f":"TablaFronteras[[#This Row],[Y]]+TablaFronteras[[#This Row],[Alto]]/2","v":184.60543727874756},{"$f":"IF(AND(TablaFronteras[[#This Row],[Fila]]<>\"\",TablaFronteras[[#This Row],[X]]<miX,miX<TablaFronteras[[#This Row],[X]]+TablaFronteras[[#This Row],[Ancho]],TablaFronteras[[#This Row],[Y]]<miY,miY<TablaFronteras[[#This Row],[Y]]+TablaFronteras[[#This Row],[Alto]]),SQRT((TablaFronteras[[#This Row],[Centro X]]-miX)^2+(TablaFronteras[[#This Row],[Centro Y]]-miY)^2),\"\")","v":""},{"$f":"IF(TablaFronteras[[#This Row],[Frontera]]=\"\",\"\",IFERROR(MATCH(RIGHT(TablaFronteras[[#This Row],[Frontera]],LEN(TablaFronteras[[#This Row],[Frontera]])-IFERROR(FIND(\" - \",TablaFronteras[[#This Row],[Frontera]])+2,0)),Datos[País],0),\"\"))","v":208}]
["Namibia",378.20724487304688,241.72904968261719,27.709684371948242,28.968818664550781,{"$f":"TablaFronteras[[#This Row],[X]]+TablaFronteras[[#This Row],[Ancho]]/2","v":392.062087059021},{"$f":"TablaFronteras[[#This Row],[Y]]+TablaFronteras[[#This Row],[Alto]]/2","v":256.21345901489258},{"$f":"IF(AND(TablaFronteras[[#This Row],[Fila]]<>\"\",TablaFronteras[[#This Row],[X]]<miX,miX<TablaFronteras[[#This Row],[X]]+TablaFronteras[[#This Row],[Ancho]],TablaFronteras[[#This Row],[Y]]<miY,miY<TablaFronteras[[#This Row],[Y]]+TablaFronteras[[#This Row],[Alto]]),SQRT((TablaFronteras[[#This Row],[Centro X]]-miX)^2+(TablaFronteras[[#This Row],[Centro Y]]-miY)^2),\"\")","v":""},{"$f":"IF(TablaFronteras[[#This Row],[Frontera]]=\"\",\"\",IFERROR(MATCH(RIGHT(TablaFronteras[[#This Row],[Frontera]],LEN(TablaFronteras[[#This Row],[Frontera]])-IFERROR(FIND(\" - \",TablaFronteras[[#This Row],[Frontera]])+2,0)),Datos[País],0),\"\"))","v":178}]
["Sudáfrica",388.13229370117188,254.30244445800781,33.173385620117188,30.466377258300781,{"$f":"TablaFronteras[[#This Row],[X]]+TablaFronteras[[#This Row],[Ancho]]/2","v":404.71898651123047},{"$f":"TablaFronteras[[#This Row],[Y]]+TablaFronteras[[#This Row],[Alto]]/2","v":269.5356330871582},{"$f":"IF(AND(TablaFronteras[[#This Row],[Fila]]<>\"\",TablaFronteras[[#This Row],[X]]<miX,miX<TablaFronteras[[#This Row],[X]]+TablaFronteras[[#This Row],[Ancho]],TablaFronteras[[#This Row],[Y]]<miY,miY<TablaFronteras[[#This Row],[Y]]+TablaFronteras[[#This Row],[Alto]]),SQRT((TablaFronteras[[#This Row],[Centro X]]-miX)^2+(TablaFronteras[[#This Row],[Centro Y]]-miY)^2),\"\")","v":""},{"$f":"IF(TablaFronteras[[#This Row],[Frontera]]=\"\",\"\",IFERROR(MATCH(RIGHT(TablaFronteras[[#This Row],[Frontera]],LEN(TablaFronteras[[#This Row],[Frontera]])-IFERROR(FIND(\" - \",TablaFronteras[[#This Row],[Frontera]])+2,0)),Datos[País],0),\"\"))","v":242}]
["Lesoto",409.0401611328125,269.90353393554688,5.0054330825805664,4.9841732978820801,{"$f":"TablaFronteras[[#This Row],[X]]+TablaFronteras[[#This Row],[Ancho]]/2","v":411.54287767410278},{"$f":"TablaFronteras[[#This Row],[Y]]+TablaFronteras[[#This Row],[Alto]]/2","v":272.39562058448792},{"$f":"IF(AND(TablaFronteras[[#This Row],[Fila]]<>\"\",TablaFronteras[[#This Row],[X]]<miX,miX<TablaFronteras[[#This Row],[X]]+TablaFronteras[[#This Row],[Ancho]],TablaFronteras[[#This Row],[Y]]<miY,miY<TablaFronteras[[#This Row],[Y]]+TablaFronteras[[#This Row],[Alto]]),SQRT((TablaFronteras[[#This Row],[Centro X]]-miX)^2+(TablaFronteras[[#This Row],[Centro Y]]-miY)^2),\"\")","v":""},{"$f":"IF(TablaFronteras[[#This Row],[Frontera]]=\"\",\"\",IFERROR(MATCH(RIGHT(TablaFronteras[[#This Row],[Frontera]],LEN(TablaFronteras[[#This Row],[Frontera]])-IFERROR(FIND(\" - \",TablaFronteras[[#This Row],[Frontera]])+2,0)),Datos[País],0),\"\"))","v":147}]
["Suazilandia",417.06912231445313,263.12960815429688,3.331496000289917,3.4473228454589844,{"$f":"TablaFronteras[[#This Row],[X]]+TablaFronteras[[#This Row],[Ancho]]/2","v":418.73487031459808},{"$f":"TablaFronteras[[#This Row],[Y]]+TablaFronteras[[#This Row],[Alto]]/2","v":264.85326957702637},{"$f":"IF(AND(TablaFronteras[[#This Row],[Fila]]<>\"\",TablaFronteras[[#This Row],[X]]<miX,miX<TablaFronteras[[#This Row],[X]]+TablaFronteras[[#This Row],[Ancho]],TablaFronteras[[#This Row],[Y]]<miY,miY<TablaFronteras[[#This Row],[Y]]+TablaFronteras[[#This Row],[Alto]]),SQRT((TablaFronteras[[#This Row],[Centro X]]-miX)^2+(TablaFronteras[[#This Row],[Centro Y]]-miY)^2),\"\")","v":""},{"$f":"IF(TablaFronteras[[#This Row],[Frontera]]=\"\",\"\",IFERROR(MATCH(RIGHT(TablaFronteras[[#This Row],[Frontera]],LEN(TablaFronteras[[#This Row],[Frontera]])-IFERROR(FIND(\" - \",TablaFronteras[[#This Row],[Frontera]])+2,0)),Datos[País],0),\"\"))","v":241}]
["Gabón",371.9625244140625,194.98432922363281,12.488661766052246,15.194015502929688,{"$f":"TablaFronteras[[#This Row],[X]]+TablaFronteras[[#This Row],[Ancho]]/2","v":378.20685529708862},{"$f":"TablaFronteras[[#This Row],[Y]]+TablaFronteras[[#This Row],[Alto]]/2","v":202.58133697509766},{"$f":"IF(AND(TablaFronteras[[#This Row],[Fila]]<>\"\",TablaFronteras[[#This Row],[X]]<miX,miX<TablaFronteras[[#This Row],[X]]+TablaFronteras[[#This Row],[Ancho]],TablaFronteras[[#This Row],[Y]]<miY,miY<TablaFronteras[[#This Row],[Y]]+TablaFronteras[[#This Row],[Alto]]),SQRT((TablaFronteras[[#This Row],[Centro X]]-miX)^2+(TablaFronteras[[#This Row],[Centro Y]]-miY)^2),\"\")","v":""},{"$f":"IF(TablaFronteras[[#This Row],[Frontera]]=\"\",\"\",IFERROR(MATCH(RIGHT(TablaFronteras[[#This Row],[Frontera]],LEN(TablaFronteras[[#This Row],[Frontera]])-IFERROR(FIND(\" - \",TablaFronteras[[#This Row],[Frontera]])+2,0)),Datos[País],0),\"\"))","v":83}]
["Guinea Ecuatorial",371.95639038085938,191.35858154296875,5.4345669746398926,6.8585038185119629,{"$f":"TablaFronteras[[#This Row],[X]]+TablaFronteras[[#This Row],[Ancho]]/2","v":374.67367386817932},{"$f":"TablaFronteras[[#This Row],[Y]]+TablaFronteras[[#This Row],[Alto]]/2","v":194.78783345222473},{"$f":"IF(AND(TablaFronteras[[#This Row],[Fila]]<>\"\",TablaFronteras[[#This Row],[X]]<miX,miX<TablaFronteras[[#This Row],[X]]+TablaFronteras[[#This Row],[Ancho]],TablaFronteras[[#This Row],[Y]]<miY,miY<TablaFronteras[[#This Row],[Y]]+TablaFronteras[[#This Row],[Alto]]),SQRT((TablaFronteras[[#This Row],[Centro X]]-miX)^2+(TablaFronteras[[#This Row],[Centro Y]]-miY)^2),\"\")","v":""},{"$f":"IF(TablaFronteras[[#This Row],[Frontera]]=\"\",\"\",IFERROR(MATCH(RIGHT(TablaFronteras[[#This Row],[Frontera]],LEN(TablaFronteras[[#This Row],[Frontera]])-IFERROR(FIND(\" - \",TablaFronteras[[#This Row],[Frontera]])+2,0)),Datos[País],0),\"\"))","v":97}]
["Kazajistán",441.85000610351563,67.748031616210938,73.781341552734375,34.695037841796875,{"$f":"TablaFronteras[[#This Row],[X]]+TablaFronteras[[#This Row],[Ancho]]/2","v":478.74067687988281},{"$f":"TablaFronteras[[#This Row],[Y]]+TablaFronteras[[#This Row],[Alto]]/2","v":85.095550537109375},{"$f":"IF(AND(TablaFronteras[[#This Row],[Fila]]<>\"\",TablaFronteras[[#This Row],[X]]<miX,miX<TablaFronteras[[#This Row],[X]]+TablaFronteras[[#This Row],[Ancho]],TablaFronteras[[#This Row],[Y]]<miY,miY<TablaFronteras[[#This Row],[Y]]+TablaFronteras[[#This Row],[Alto]]),SQRT((TablaFronteras[[#This Row],[Centro X]]-miX)^2+(TablaFronteras[[#This Row],[Centro Y]]-miY)^2),\"\")","v":""},{"$f":"IF(TablaFronteras[[#This Row],[Frontera]]=\"\",\"\",IFERROR(MATCH(RIGHT(TablaFronteras[[#This Row],[Frontera]],LEN(TablaFronteras[[#This Row],[Frontera]])-IFERROR(FIND(\" - \",TablaFronteras[[#This Row],[Frontera]])+2,0)),Datos[País],0),\"\"))","v":140}]
["Mongolia",516.453125,75.5423583984375,60.878505706787109,24.456062316894531,{"$f":"TablaFronteras[[#This Row],[X]]+TablaFronteras[[#This Row],[Ancho]]/2","v":546.89237785339355},{"$f":"TablaFronteras[[#This Row],[Y]]+TablaFronteras[[#This Row],[Alto]]/2","v":87.770389556884766},{"$f":"IF(AND(TablaFronteras[[#This Row],[Fila]]<>\"\",TablaFronteras[[#This Row],[X]]<miX,miX<TablaFronteras[[#This Row],[X]]+TablaFronteras[[#This Row],[Ancho]],TablaFronteras[[#This Row],[Y]]<miY,miY<TablaFronteras[[#This Row],[Y]]+TablaFronteras[[#This Row],[Alto]]),SQRT((TablaFronteras[[#This Row],[Centro X]]-miX)^2+(TablaFronteras[[#This Row],[Centro Y]]-miY)^2),\"\")","v":""},{"$f":"IF(TablaFronteras[[#This Row],[Frontera]]=\"\",\"\",IFERROR(MATCH(RIGHT(TablaFronteras[[#This Row],[Frontera]],LEN(TablaFronteras[[#This Row],[Frontera]])-IFERROR(FIND(\" - \",TablaFronteras[[#This Row],[Frontera]])+2,0)),Datos[País],0),\"\"))","v":172}]
["Japón",605.1763916015625,91.0885009765625,25.385984420776367,50.823226928710938,{"$f":"TablaFronteras[[#This Row],[X]]+TablaFronteras[[#This Row],[Ancho]]/2","v":617.86938381195068},{"$f":"TablaFronteras[[#This Row],[Y]]+TablaFronteras[[#This Row],[Alto]]/2","v":116.50011444091797},{"$f":"IF(AND(TablaFronteras[[#This Row],[Fila]]<>\"\",TablaFronteras[[#This Row],[X]]<miX,miX<TablaFronteras[[#This Row],[X]]+TablaFronteras[[#This Row],[Ancho]],TablaFronteras[[#This Row],[Y]]<miY,miY<TablaFronteras[[#This Row],[Y]]+TablaFronteras[[#This Row],[Alto]]),SQRT((TablaFronteras[[#This Row],[Centro X]]-miX)^2+(TablaFronteras[[#This Row],[Centro Y]]-miY)^2),\"\")","v":""},{"$f":"IF(TablaFronteras[[#This Row],[Frontera]]=\"\",\"\",IFERROR(MATCH(RIGHT(TablaFronteras[[#This Row],[Frontera]],LEN(TablaFronteras[[#This Row],[Frontera]])-IFERROR(FIND(\" - \",TablaFronteras[[#This Row],[Frontera]])+2,0)),Datos[País],0),\"\"))","v":137}]
["Corea del Norte",594.41851806640625,96.833465576171875,8.8395271301269531,12.642519950866699,{"$f":"TablaFronteras[[#This Row],[X]]+TablaFronteras[[#This Row],[Ancho]]/2","v":598.83828163146973},{"$f":"TablaFronteras[[#This Row],[Y]]+TablaFronteras[[#This Row],[Alto]]/2","v":103.15472555160522},{"$f":"IF(AND(TablaFronteras[[#This Row],[Fila]]<>\"\",TablaFronteras[[#This Row],[X]]<miX,miX<TablaFronteras[[#This Row],[X]]+TablaFronteras[[#This Row],[Ancho]],TablaFronteras[[#This Row],[Y]]<miY,miY<TablaFronteras[[#This Row],[Y]]+TablaFronteras[[#This Row],[Alto]]),SQRT((TablaFronteras[[#This Row],[Centro X]]-miX)^2+(TablaFronteras[[#This Row],[Centro Y]]-miY)^2),\"\")","v":""},{"$f":"IF(TablaFronteras[[#This Row],[Frontera]]=\"\",\"\",IFERROR(MATCH(RIGHT(TablaFronteras[[#This Row],[Frontera]],LEN(TablaFronteras[[#This Row],[Frontera]])-IFERROR(FIND(\" - \",TablaFronteras[[#This Row],[Frontera]])+2,0)),Datos[País],0),\"\"))","v":59}]
["Corea del Sur",600.12548828125,107.30645751953125,8.6724405288696289,12.826220512390137,{"$f":"TablaFronteras[[#This Row],[X]]+TablaFronteras[[#This Row],[Ancho]]/2","v":604.46170854568481},{"$f":"TablaFronteras[[#This Row],[Y]]+TablaFronteras[[#This Row],[Alto]]/2","v":113.71956777572632},{"$f":"IF(AND(TablaFronteras[[#This Row],[Fila]]<>\"\",TablaFronteras[[#This Row],[X]]<miX,miX<TablaFronteras[[#This Row],[X]]+TablaFronteras[[#This Row],[Ancho]],TablaFronteras[[#This Row],[Y]]<miY,miY<TablaFronteras[[#This Row],[Y]]+TablaFronteras[[#This Row],[Alto]]),SQRT((TablaFronteras[[#This Row],[Centro X]]-miX)^2+(TablaFronteras[[#This Row],[Centro Y]]-miY)^2),\"\")","v":""},{"$f":"IF(TablaFronteras[[#This Row],[Frontera]]=\"\",\"\",IFERROR(MATCH(RIGHT(TablaFronteras[[#This Row],[Frontera]],LEN(TablaFronteras[[#This Row],[Frontera]])-IFERROR(FIND(\" - \",TablaFronteras[[#This Row],[Frontera]])+2,0)),Datos[País],0),\"\"))","v":60}]
["Irán",440.6033935546875,104.39039611816406,41.471733093261719,35.504802703857422,{"$f":"TablaFronteras[[#This Row],[X]]+TablaFronteras[[#This Row],[Ancho]]/2","v":461.33926010131836},{"$f":"TablaFronteras[[#This Row],[Y]]+TablaFronteras[[#This Row],[Alto]]/2","v":122.14279747009277},{"$f":"IF(AND(TablaFronteras[[#This Row],[Fila]]<>\"\",TablaFronteras[[#This Row],[X]]<miX,miX<TablaFronteras[[#This Row],[X]]+TablaFronteras[[#This Row],[Ancho]],TablaFronteras[[#This Row],[Y]]<miY,miY<TablaFronteras[[#This Row],[Y]]+TablaFronteras[[#This Row],[Alto]]),SQRT((TablaFronteras[[#This Row],[Centro X]]-miX)^2+(TablaFronteras[[#This Row],[Centro Y]]-miY)^2),\"\")","v":""},{"$f":"IF(TablaFronteras[[#This Row],[Frontera]]=\"\",\"\",IFERROR(MATCH(RIGHT(TablaFronteras[[#This Row],[Frontera]],LEN(TablaFronteras[[#This Row],[Frontera]])-IFERROR(FIND(\" - \",TablaFronteras[[#This Row],[Frontera]])+2,0)),Datos[País],0),\"\"))","v":108}]
["Turkmenistán",455.32025146484375,97.356063842773438,29.597400665283203,18.177480697631836,{"$f":"TablaFronteras[[#This Row],[X]]+TablaFronteras[[#This Row],[Ancho]]/2","v":470.11895179748535},{"$f":"TablaFronteras[[#This Row],[Y]]+TablaFronteras[[#This Row],[Alto]]/2","v":106.44480419158936},{"$f":"IF(AND(TablaFronteras[[#This Row],[Fila]]<>\"\",TablaFronteras[[#This Row],[X]]<miX,miX<TablaFronteras[[#This Row],[X]]+TablaFronteras[[#This Row],[Ancho]],TablaFronteras[[#This Row],[Y]]<miY,miY<TablaFronteras[[#This Row],[Y]]+TablaFronteras[[#This Row],[Alto]]),SQRT((TablaFronteras[[#This Row],[Centro X]]-miX)^2+(TablaFronteras[[#This Row],[Centro Y]]-miY)^2),\"\")","v":""},{"$f":"IF(TablaFronteras[[#This Row],[Frontera]]=\"\",\"\",IFERROR(MATCH(RIGHT(TablaFronteras[[#This Row],[Frontera]],LEN(TablaFronteras[[#This Row],[Frontera]])-IFERROR(FIND(\" - \",TablaFronteras[[#This Row],[Frontera]])+2,0)),Datos[País],0),\"\"))","v":261}]
["Uzbekistán",460.80331420898438,90.565750122070313,34.939212799072266,20.249685287475586,{"$f":"TablaFronteras[[#This Row],[X]]+TablaFronteras[[#This Row],[Ancho]]/2","v":478.27292060852051},{"$f":"TablaFronteras[[#This Row],[Y]]+TablaFronteras[[#This Row],[Alto]]/2","v":100.69059276580811},{"$f":"IF(AND(TablaFronteras[[#This Row],[Fila]]<>\"\",TablaFronteras[[#This Row],[X]]<miX,miX<TablaFronteras[[#This Row],[X]]+TablaFronteras[[#This Row],[Ancho]],TablaFronteras[[#This Row],[Y]]<miY,miY<TablaFronteras[[#This Row],[Y]]+TablaFronteras[[#This Row],[Alto]]),SQRT((TablaFronteras[[#This Row],[Centro X]]-miX)^2+(TablaFronteras[[#This Row],[Centro Y]]-miY)^2),\"\")","v":""},{"$f":"IF(TablaFronteras[[#This Row],[Frontera]]=\"\",\"\",IFERROR(MATCH(RIGHT(TablaFronteras[[#This Row],[Frontera]],LEN(TablaFronteras[[#This Row],[Frontera]])-IFERROR(FIND(\" - \",TablaFronteras[[#This Row],[Frontera]])+2,0)),Datos[País],0),\"\"))","v":268}]
["Kirguistán",488.9296875,96.117164611816406,18.224016189575195,9.6053543090820313,{"$f":"TablaFronteras[[#This Row],[X]]+TablaFronteras[[#This Row],[Ancho]]/2","v":498.0416955947876},{"$f":"TablaFronteras[[#This Row],[Y]]+TablaFronteras[[#This Row],[Alto]]/2","v":100.91984176635742},{"$f":"IF(AND(TablaFronteras[[#This Row],[Fila]]<>\"\",TablaFronteras[[#This Row],[X]]<miX,miX<TablaFronteras[[#This Row],[X]]+TablaFronteras[[#This Row],[Ancho]],TablaFronteras[[#This Row],[Y]]<miY,miY<TablaFronteras[[#This Row],[Y]]+TablaFronteras[[#This Row],[Alto]]),SQRT((TablaFronteras[[#This Row],[Centro X]]-miX)^2+(TablaFronteras[[#This Row],[Centro Y]]-miY)^2),\"\")","v":""},{"$f":"IF(TablaFronteras[[#This Row],[Frontera]]=\"\",\"\",IFERROR(MATCH(RIGHT(TablaFronteras[[#This Row],[Frontera]],LEN(TablaFronteras[[#This Row],[Frontera]])-IFERROR(FIND(\" - \",TablaFronteras[[#This Row],[Frontera]])+2,0)),Datos[País],0),\"\"))","v":142}]
["Tayikistán",485.4063720703125,101.41401672363281,15.558267593383789,10.408819198608398,{"$f":"TablaFronteras[[#This Row],[X]]+TablaFronteras[[#This Row],[Ancho]]/2","v":493.18550586700439},{"$f":"TablaFronteras[[#This Row],[Y]]+TablaFronteras[[#This Row],[Alto]]/2","v":106.61842632293701},{"$f":"IF(AND(TablaFronteras[[#This Row],[Fila]]<>\"\",TablaFronteras[[#This Row],[X]]<miX,miX<TablaFronteras[[#This Row],[X]]+TablaFronteras[[#This Row],[Ancho]],TablaFronteras[[#This Row],[Y]]<miY,miY<TablaFronteras[[#This Row],[Y]]+TablaFronteras[[#This Row],[Alto]]),SQRT((TablaFronteras[[#This Row],[Centro X]]-miX)^2+(TablaFronteras[[#This Row],[Centro Y]]-miY)^2),\"\")","v":""},{"$f":"IF(TablaFronteras[[#This Row],[Frontera]]=\"\",\"\",IFERROR(MATCH(RIGHT(TablaFronteras[[#This Row],[Frontera]],LEN(TablaFronteras[[#This Row],[Frontera]])-IFERROR(FIND(\" - \",TablaFronteras[[#This Row],[Frontera]])+2,0)),Datos[País],0),\"\"))","v":252}]
["Afganistán",474.24740600585938,107.63070678710938,26.44212532043457,21.786220550537109,{"$f":"TablaFronteras[[#This Row],[X]]+TablaFronteras[[#This Row],[Ancho]]/2","v":487.46846866607666},{"$f":"TablaFronteras[[#This Row],[Y]]+TablaFronteras[[#This Row],[Alto]]/2","v":118.52381706237793},{"$f":"IF(AND(TablaFronteras[[#This Row],[Fila]]<>\"\",TablaFronteras[[#This Row],[X]]<miX,miX<TablaFronteras[[#This Row],[X]]+TablaFronteras[[#This Row],[Ancho]],TablaFronteras[[#This Row],[Y]]<miY,miY<TablaFronteras[[#This Row],[Y]]+TablaFronteras[[#This Row],[Alto]]),SQRT((TablaFronteras[[#This Row],[Centro X]]-miX)^2+(TablaFronteras[[#This Row],[Centro Y]]-miY)^2),\"\")","v":""},{"$f":"IF(TablaFronteras[[#This Row],[Frontera]]=\"\",\"\",IFERROR(MATCH(RIGHT(TablaFronteras[[#This Row],[Frontera]],LEN(TablaFronteras[[#This Row],[Frontera]])-IFERROR(FIND(\" - \",TablaFronteras[[#This Row],[Frontera]])+2,0)),Datos[País],0),\"\"))","v":3}]
["Georgia",431.1585693359375,95.357955932617188,14.002991676330566,5.914881706237793,{"$f":"TablaFronteras[[#This Row],[X]]+TablaFronteras[[#This Row],[Ancho]]/2","v":438.16006517410278},{"$f":"TablaFronteras[[#This Row],[Y]]+TablaFronteras[[#This Row],[Alto]]/2","v":98.315396785736084},{"$f":"IF(AND(TablaFronteras[[#This Row],[Fila]]<>\"\",TablaFronteras[[#This Row],[X]]<miX,miX<TablaFronteras[[#This Row],[X]]+TablaFronteras[[#This Row],[Ancho]],TablaFronteras[[#This Row],[Y]]<miY,miY<TablaFronteras[[#This Row],[Y]]+TablaFronteras[[#This Row],[Alto]]),SQRT((TablaFronteras[[#This Row],[Centro X]]-miX)^2+(TablaFronteras[[#This Row],[Centro Y]]-miY)^2),\"\")","v":""},{"$f":"IF(TablaFronteras[[#This Row],[Frontera]]=\"\",\"\",IFERROR(MATCH(RIGHT(TablaFronteras[[#This Row],[Frontera]],LEN(TablaFronteras[[#This Row],[Frontera]])-IFERROR(FIND(\" - \",TablaFronteras[[#This Row],[Frontera]])+2,0)),Datos[País],0),\"\"))","v":85}]
["Azerbaiyán",441.86376953125,99.263618469238281,10.105433464050293,8.4377164840698242,{"$f":"TablaFronteras[[#This Row],[X]]+TablaFronteras[[#This Row],[Ancho]]/2","v":446.91648626327515},{"$f":"TablaFronteras[[#This Row],[Y]]+TablaFronteras[[#This Row],[Alto]]/2","v":103.48247671127319},{"$f":"IF(AND(TablaFronteras[[#This Row],[Fila]]<>\"\",TablaFronteras[[#This Row],[X]]<miX,miX<TablaFronteras[[#This Row],[X]]+TablaFronteras[[#This Row],[Ancho]],TablaFronteras[[#This Row],[Y]]<miY,miY<TablaFronteras[[#This Row],[Y]]+TablaFronteras[[#This Row],[Alto]]),SQRT((TablaFronteras[[#This Row],[Centro X]]-miX)^2+(TablaFronteras[[#This Row],[Centro Y]]-miY)^2),\"\")","v":""},{"$f":"IF(TablaFronteras[[#This Row],[Frontera]]=\"\",\"\",IFERROR(MATCH(RIGHT(TablaFronteras[[#This Row],[Frontera]],LEN(TablaFronteras[[#This Row],[Frontera]])-IFERROR(FIND(\" - \",TablaFronteras[[#This Row],[Frontera]])+2,0)),Datos[País],0),\"\"))","v":21}]
["Armenia",438.78488159179688,100.78905487060547,6.9351181983947754,5.8479528427124023,{"$f":"TablaFronteras[[#This Row],[X]]+TablaFronteras[[#This Row],[Ancho]]/2","v":442.25244069099426},{"$f":"TablaFronteras[[#This Row],[Y]]+TablaFronteras[[#This Row],[Alto]]/2","v":103.71303129196167},{"$f":"IF(AND(TablaFronteras[[#This Row],[Fila]]<>\"\",TablaFronteras[[#This Row],[X]]<miX,miX<TablaFronteras[[#This Row],[X]]+TablaFronteras[[#This Row],[Ancho]],TablaFronteras[[#This Row],[Y]]<miY,miY<TablaFronteras[[#This Row],[Y]]+TablaFronteras[[#This Row],[Alto]]),SQRT((TablaFronteras[[#This Row],[Centro X]]-miX)^2+(TablaFronteras[[#This Row],[Centro Y]]-miY)^2),\"\")","v":""},{"$f":"IF(TablaFronteras[[#This Row],[Frontera]]=\"\",\"\",IFERROR(MATCH(RIGHT(TablaFronteras[[#This Row],[Frontera]],LEN(TablaFronteras[[#This Row],[Frontera]])-IFERROR(FIND(\" - \",TablaFronteras[[#This Row],[Frontera]])+2,0)),Datos[País],0),\"\"))","v":13}]
["Pakistán",476.21701049804688,110.99622344970703,32.707874298095703,32.134330749511719,{"$f":"TablaFronteras[[#This Row],[X]]+TablaFronteras[[#This Row],[Ancho]]/2","v":492.57094764709473},{"$f":"TablaFronteras[[#This Row],[Y]]+TablaFronteras[[#This Row],[Alto]]/2","v":127.06338882446289},{"$f":"IF(AND(TablaFronteras[[#This Row],[Fila]]<>\"\",TablaFronteras[[#This Row],[X]]<miX,miX<TablaFronteras[[#This Row],[X]]+TablaFronteras[[#This Row],[Ancho]],TablaFronteras[[#This Row],[Y]]<miY,miY<TablaFronteras[[#This Row],[Y]]+TablaFronteras[[#This Row],[Alto]]),SQRT((TablaFronteras[[#This Row],[Centro X]]-miX)^2+(TablaFronteras[[#This Row],[Centro Y]]-miY)^2),\"\")","v":""},{"$f":"IF(TablaFronteras[[#This Row],[Frontera]]=\"\",\"\",IFERROR(MATCH(RIGHT(TablaFronteras[[#This Row],[Frontera]],LEN(TablaFronteras[[#This Row],[Frontera]])-IFERROR(FIND(\" - \",TablaFronteras[[#This Row],[Frontera]])+2,0)),Datos[País],0),\"\"))","v":190}]
["Nepal",515.55792236328125,126.98062896728516,16.724330902099609,9.8367719650268555,{"$f":"TablaFronteras[[#This Row],[X]]+TablaFronteras[[#This Row],[Ancho]]/2","v":523.92008781433105},{"$f":"TablaFronteras[[#This Row],[Y]]+TablaFronteras[[#This Row],[Alto]]/2","v":131.89901494979858},{"$f":"IF(AND(TablaFronteras[[#This Row],[Fila]]<>\"\",TablaFronteras[[#This Row],[X]]<miX,miX<TablaFronteras[[#This Row],[X]]+TablaFronteras[[#This Row],[Ancho]],TablaFronteras[[#This Row],[Y]]<miY,miY<TablaFronteras[[#This Row],[Y]]+TablaFronteras[[#This Row],[Alto]]),SQRT((TablaFronteras[[#This Row],[Centro X]]-miX)^2+(TablaFronteras[[#This Row],[Centro Y]]-miY)^2),\"\")","v":""},{"$f":"IF(TablaFronteras[[#This Row],[Frontera]]=\"\",\"\",IFERROR(MATCH(RIGHT(TablaFronteras[[#This Row],[Frontera]],LEN(TablaFronteras[[#This Row],[Frontera]])-IFERROR(FIND(\" - \",TablaFronteras[[#This Row],[Frontera]])+2,0)),Datos[País],0),\"\"))","v":180}]
["Bután",533.8751220703125,132.01567077636719,6.6633858680725098,4.1015748977661133,{"$f":"TablaFronteras[[#This Row],[X]]+TablaFronteras[[#This Row],[Ancho]]/2","v":537.20681500434875},{"$f":"TablaFronteras[[#This Row],[Y]]+TablaFronteras[[#This Row],[Alto]]/2","v":134.06645822525024},{"$f":"IF(AND(TablaFronteras[[#This Row],[Fila]]<>\"\",TablaFronteras[[#This Row],[X]]<miX,miX<TablaFronteras[[#This Row],[X]]+TablaFronteras[[#This Row],[Ancho]],TablaFronteras[[#This Row],[Y]]<miY,miY<TablaFronteras[[#This Row],[Y]]+TablaFronteras[[#This Row],[Alto]]),SQRT((TablaFronteras[[#This Row],[Centro X]]-miX)^2+(TablaFronteras[[#This Row],[Centro Y]]-miY)^2),\"\")","v":""},{"$f":"IF(TablaFronteras[[#This Row],[Frontera]]=\"\",\"\",IFERROR(MATCH(RIGHT(TablaFronteras[[#This Row],[Frontera]],LEN(TablaFronteras[[#This Row],[Frontera]])-IFERROR(FIND(\" - \",TablaFronteras[[#This Row],[Frontera]])+2,0)),Datos[País],0),\"\"))","v":42}]
["Bangladés",532.95733642578125,136.31211853027344,9.8110237121582031,13.862992286682129,{"$f":"TablaFronteras[[#This Row],[X]]+TablaFronteras[[#This Row],[Ancho]]/2","v":537.86284828186035},{"$f":"TablaFronteras[[#This Row],[Y]]+TablaFronteras[[#This Row],[Alto]]/2","v":143.2436146736145},{"$f":"IF(AND(TablaFronteras[[#This Row],[Fila]]<>\"\",TablaFronteras[[#This Row],[X]]<miX,miX<TablaFronteras[[#This Row],[X]]+TablaFronteras[[#This Row],[Ancho]],TablaFronteras[[#This Row],[Y]]<miY,miY<TablaFronteras[[#This Row],[Y]]+TablaFronteras[[#This Row],[Alto]]),SQRT((TablaFronteras[[#This Row],[Centro X]]-miX)^2+(TablaFronteras[[#This Row],[Centro Y]]-miY)^2),\"\")","v":""},{"$f":"IF(TablaFronteras[[#This Row],[Frontera]]=\"\",\"\",IFERROR(MATCH(RIGHT(TablaFronteras[[#This Row],[Frontera]],LEN(TablaFronteras[[#This Row],[Frontera]])-IFERROR(FIND(\" - \",TablaFronteras[[#This Row],[Frontera]])+2,0)),Datos[País],0),\"\"))","v":25}]
["Birmania",542.407958984375,131.51054382324219,17.99110221862793,44.9405517578125,{"$f":"TablaFronteras[[#This Row],[X]]+TablaFronteras[[#This Row],[Ancho]]/2","v":551.40351009368896},{"$f":"TablaFronteras[[#This Row],[Y]]+TablaFronteras[[#This Row],[Alto]]/2","v":153.98081970214844},{"$f":"IF(AND(TablaFronteras[[#This Row],[Fila]]<>\"\",TablaFronteras[[#This Row],[X]]<miX,miX<TablaFronteras[[#This Row],[X]]+TablaFronteras[[#This Row],[Ancho]],TablaFronteras[[#This Row],[Y]]<miY,miY<TablaFronteras[[#This Row],[Y]]+TablaFronteras[[#This Row],[Alto]]),SQRT((TablaFronteras[[#This Row],[Centro X]]-miX)^2+(TablaFronteras[[#This Row],[Centro Y]]-miY)^2),\"\")","v":""},{"$f":"IF(TablaFronteras[[#This Row],[Frontera]]=\"\",\"\",IFERROR(MATCH(RIGHT(TablaFronteras[[#This Row],[Frontera]],LEN(TablaFronteras[[#This Row],[Frontera]])-IFERROR(FIND(\" - \",TablaFronteras[[#This Row],[Frontera]])+2,0)),Datos[País],0),\"\"))","v":32}]
["Vietnam",562.555419921875,144.04708862304688,17.509763717651367,35.986534118652344,{"$f":"TablaFronteras[[#This Row],[X]]+TablaFronteras[[#This Row],[Ancho]]/2","v":571.31030178070068},{"$f":"TablaFronteras[[#This Row],[Y]]+TablaFronteras[[#This Row],[Alto]]/2","v":162.04035568237305},{"$f":"IF(AND(TablaFronteras[[#This Row],[Fila]]<>\"\",TablaFronteras[[#This Row],[X]]<miX,miX<TablaFronteras[[#This Row],[X]]+TablaFronteras[[#This Row],[Ancho]],TablaFronteras[[#This Row],[Y]]<miY,miY<TablaFronteras[[#This Row],[Y]]+TablaFronteras[[#This Row],[Alto]]),SQRT((TablaFronteras[[#This Row],[Centro X]]-miX)^2+(TablaFronteras[[#This Row],[Centro Y]]-miY)^2),\"\")","v":""},{"$f":"IF(TablaFronteras[[#This Row],[Frontera]]=\"\",\"\",IFERROR(MATCH(RIGHT(TablaFronteras[[#This Row],[Frontera]],LEN(TablaFronteras[[#This Row],[Frontera]])-IFERROR(FIND(\" - \",TablaFronteras[[#This Row],[Frontera]])+2,0)),Datos[País],0),\"\"))","v":271}]
["Tailandia",553.6048583984375,151.18038940429688,19.561182022094727,35.692756652832031,{"$f":"TablaFronteras[[#This Row],[X]]+TablaFronteras[[#This Row],[Ancho]]/2","v":563.38544940948486},{"$f":"TablaFronteras[[#This Row],[Y]]+TablaFronteras[[#This Row],[Alto]]/2","v":169.02676773071289},{"$f":"IF(AND(TablaFronteras[[#This Row],[Fila]]<>\"\",TablaFronteras[[#This Row],[X]]<miX,miX<TablaFronteras[[#This Row],[X]]+TablaFronteras[[#This Row],[Ancho]],TablaFronteras[[#This Row],[Y]]<miY,miY<TablaFronteras[[#This Row],[Y]]+TablaFronteras[[#This Row],[Alto]]),SQRT((TablaFronteras[[#This Row],[Centro X]]-miX)^2+(TablaFronteras[[#This Row],[Centro Y]]-miY)^2),\"\")","v":""},{"$f":"IF(TablaFronteras[[#This Row],[Frontera]]=\"\",\"\",IFERROR(MATCH(RIGHT(TablaFronteras[[#This Row],[Frontera]],LEN(TablaFronteras[[#This Row],[Frontera]])-IFERROR(FIND(\" - \",TablaFronteras[[#This Row],[Frontera]])+2,0)),Datos[País],0),\"\"))","v":249}]
["Laos",558.99072265625,146.16314697265625,16.732599258422852,20.739999771118164,{"$f":"TablaFronteras[[#This Row],[X]]+TablaFronteras[[#This Row],[Ancho]]/2","v":567.35702228546143},{"$f":"TablaFronteras[[#This Row],[Y]]+TablaFronteras[[#This Row],[Alto]]/2","v":156.53314685821533},{"$f":"IF(AND(TablaFronteras[[#This Row],[Fila]]<>\"\",TablaFronteras[[#This Row],[X]]<miX,miX<TablaFronteras[[#This Row],[X]]+TablaFronteras[[#This Row],[Ancho]],TablaFronteras[[#This Row],[Y]]<miY,miY<TablaFronteras[[#This Row],[Y]]+TablaFronteras[[#This Row],[Alto]]),SQRT((TablaFronteras[[#This Row],[Centro X]]-miX)^2+(TablaFronteras[[#This Row],[Centro Y]]-miY)^2),\"\")","v":""},{"$f":"IF(TablaFronteras[[#This Row],[Frontera]]=\"\",\"\",IFERROR(MATCH(RIGHT(TablaFronteras[[#This Row],[Frontera]],LEN(TablaFronteras[[#This Row],[Frontera]])-IFERROR(FIND(\" - \",TablaFronteras[[#This Row],[Frontera]])+2,0)),Datos[País],0),\"\"))","v":146}]
["Filipinas",598.14190673828125,151.05087280273438,18.934410095214844,37.308109283447266,{"$f":"TablaFronteras[[#This Row],[X]]+TablaFronteras[[#This Row],[Ancho]]/2","v":607.60911178588867},{"$f":"TablaFronteras[[#This Row],[Y]]+TablaFronteras[[#This Row],[Alto]]/2","v":169.70492744445801},{"$f":"IF(AND(TablaFronteras[[#This Row],[Fila]]<>\"\",TablaFronteras[[#This Row],[X]]<miX,miX<TablaFronteras[[#This Row],[X]]+TablaFronteras[[#This Row],[Ancho]],TablaFronteras[[#This Row],[Y]]<miY,miY<TablaFronteras[[#This Row],[Y]]+TablaFronteras[[#This Row],[Alto]]),SQRT((TablaFronteras[[#This Row],[Centro X]]-miX)^2+(TablaFronteras[[#This Row],[Centro Y]]-miY)^2),\"\")","v":""},{"$f":"IF(TablaFronteras[[#This Row],[Frontera]]=\"\",\"\",IFERROR(MATCH(RIGHT(TablaFronteras[[#This Row],[Frontera]],LEN(TablaFronteras[[#This Row],[Frontera]])-IFERROR(FIND(\" - \",TablaFronteras[[#This Row],[Frontera]])+2,0)),Datos[País],0),\"\"))","v":79}]
["Brunéi",590.942626953125,188.10929870605469,3.331496000289917,3.2422046661376953,{"$f":"TablaFronteras[[#This Row],[X]]+TablaFronteras[[#This Row],[Ancho]]/2","v":592.60837495326996},{"$f":"TablaFronteras[[#This Row],[Y]]+TablaFronteras[[#This Row],[Alto]]/2","v":189.73040103912354},{"$f":"IF(AND(TablaFronteras[[#This Row],[Fila]]<>\"\",TablaFronteras[[#This Row],[X]]<miX,miX<TablaFronteras[[#This Row],[X]]+TablaFronteras[[#This Row],[Ancho]],TablaFronteras[[#This Row],[Y]]<miY,miY<TablaFronteras[[#This Row],[Y]]+TablaFronteras[[#This Row],[Alto]]),SQRT((TablaFronteras[[#This Row],[Centro X]]-miX)^2+(TablaFronteras[[#This Row],[Centro Y]]-miY)^2),\"\")","v":""},{"$f":"IF(TablaFronteras[[#This Row],[Frontera]]=\"\",\"\",IFERROR(MATCH(RIGHT(TablaFronteras[[#This Row],[Frontera]],LEN(TablaFronteras[[#This Row],[Frontera]])-IFERROR(FIND(\" - \",TablaFronteras[[#This Row],[Frontera]])+2,0)),Datos[País],0),\"\"))","v":38}]
["Singapur",569.0574951171875,195.76071166992188,4.3488974571228027,3.331496000289917,{"$f":"TablaFronteras[[#This Row],[X]]+TablaFronteras[[#This Row],[Ancho]]/2","v":571.2319438457489},{"$f":"TablaFronteras[[#This Row],[Y]]+TablaFronteras[[#This Row],[Alto]]/2","v":197.42645967006683},{"$f":"IF(AND(TablaFronteras[[#This Row],[Fila]]<>\"\",TablaFronteras[[#This Row],[X]]<miX,miX<TablaFronteras[[#This Row],[X]]+TablaFronteras[[#This Row],[Ancho]],TablaFronteras[[#This Row],[Y]]<miY,miY<TablaFronteras[[#This Row],[Y]]+TablaFronteras[[#This Row],[Alto]]),SQRT((TablaFronteras[[#This Row],[Centro X]]-miX)^2+(TablaFronteras[[#This Row],[Centro Y]]-miY)^2),\"\")","v":""},{"$f":"IF(TablaFronteras[[#This Row],[Frontera]]=\"\",\"\",IFERROR(MATCH(RIGHT(TablaFronteras[[#This Row],[Frontera]],LEN(TablaFronteras[[#This Row],[Frontera]])-IFERROR(FIND(\" - \",TablaFronteras[[#This Row],[Frontera]])+2,0)),Datos[País],0),\"\"))","v":235}]
["Papúa Nueva Guinea",646.7479248046875,203.922119140625,31.080629348754883,24.912519454956055,{"$f":"TablaFronteras[[#This Row],[X]]+TablaFronteras[[#This Row],[Ancho]]/2","v":662.28823947906494},{"$f":"TablaFronteras[[#This Row],[Y]]+TablaFronteras[[#This Row],[Alto]]/2","v":216.37837886810303},{"$f":"IF(AND(TablaFronteras[[#This Row],[Fila]]<>\"\",TablaFronteras[[#This Row],[X]]<miX,miX<TablaFronteras[[#This Row],[X]]+TablaFronteras[[#This Row],[Ancho]],TablaFronteras[[#This Row],[Y]]<miY,miY<TablaFronteras[[#This Row],[Y]]+TablaFronteras[[#This Row],[Alto]]),SQRT((TablaFronteras[[#This Row],[Centro X]]-miX)^2+(TablaFronteras[[#This Row],[Centro Y]]-miY)^2),\"\")","v":""},{"$f":"IF(TablaFronteras[[#This Row],[Frontera]]=\"\",\"\",IFERROR(MATCH(RIGHT(TablaFronteras[[#This Row],[Frontera]],LEN(TablaFronteras[[#This Row],[Frontera]])-IFERROR(FIND(\" - \",TablaFronteras[[#This Row],[Frontera]])+2,0)),Datos[País],0),\"\"))","v":196}]
["Islas Salomón",678.5521240234375,216.61622619628906,20.727638244628906,12.676456451416016,{"$f":"TablaFronteras[[#This Row],[X]]+TablaFronteras[[#This Row],[Ancho]]/2","v":688.91594314575195},{"$f":"TablaFronteras[[#This Row],[Y]]+TablaFronteras[[#This Row],[Alto]]/2","v":222.95445442199707},{"$f":"IF(AND(TablaFronteras[[#This Row],[Fila]]<>\"\",TablaFronteras[[#This Row],[X]]<miX,miX<TablaFronteras[[#This Row],[X]]+TablaFronteras[[#This Row],[Ancho]],TablaFronteras[[#This Row],[Y]]<miY,miY<TablaFronteras[[#This Row],[Y]]+TablaFronteras[[#This Row],[Alto]]),SQRT((TablaFronteras[[#This Row],[Centro X]]-miX)^2+(TablaFronteras[[#This Row],[Centro Y]]-miY)^2),\"\")","v":""},{"$f":"IF(TablaFronteras[[#This Row],[Frontera]]=\"\",\"\",IFERROR(MATCH(RIGHT(TablaFronteras[[#This Row],[Frontera]],LEN(TablaFronteras[[#This Row],[Frontera]])-IFERROR(FIND(\" - \",TablaFronteras[[#This Row],[Frontera]])+2,0)),Datos[País],0),\"\"))","v":130}]
["Nueva Zelanda",654.6282958984375,283.84274291992188,46.600551605224609,38.977321624755859,{"$f":"TablaFronteras[[#This Row],[X]]+TablaFronteras[[#This Row],[Ancho]]/2","v":677.9285717010498},{"$f":"TablaFronteras[[#This Row],[Y]]+TablaFronteras[[#This Row],[Alto]]/2","v":303.3314037322998},{"$f":"IF(AND(TablaFronteras[[#This Row],[Fila]]<>\"\",TablaFronteras[[#This Row],[X]]<miX,miX<TablaFronteras[[#This Row],[X]]+TablaFronteras[[#This Row],[Ancho]],TablaFronteras[[#This Row],[Y]]<miY,miY<TablaFronteras[[#This Row],[Y]]+TablaFronteras[[#This Row],[Alto]]),SQRT((TablaFronteras[[#This Row],[Centro X]]-miX)^2+(TablaFronteras[[#This Row],[Centro Y]]-miY)^2),\"\")","v":""},{"$f":"IF(TablaFronteras[[#This Row],[Frontera]]=\"\",\"\",IFERROR(MATCH(RIGHT(TablaFronteras[[#This Row],[Frontera]],LEN(TablaFronteras[[#This Row],[Frontera]])-IFERROR(FIND(\" - \",TablaFronteras[[#This Row],[Frontera]])+2,0)),Datos[País],0),\"\"))","v":186}]
["Sri Lanka",519.718017578125,176.69401550292969,4.3437008857727051,9.5837793350219727,{"$f":"TablaFronteras[[#This Row],[X]]+TablaFronteras[[#This Row],[Ancho]]/2","v":521.88986802101135},{"$f":"TablaFronteras[[#This Row],[Y]]+TablaFronteras[[#This Row],[Alto]]/2","v":181.48590517044067},{"$f":"IF(AND(TablaFronteras[[#This Row],[Fila]]<>\"\",TablaFronteras[[#This Row],[X]]<miX,miX<TablaFronteras[[#This Row],[X]]+TablaFronteras[[#This Row],[Ancho]],TablaFronteras[[#This Row],[Y]]<miY,miY<TablaFronteras[[#This Row],[Y]]+TablaFronteras[[#This Row],[Alto]]),SQRT((TablaFronteras[[#This Row],[Centro X]]-miX)^2+(TablaFronteras[[#This Row],[Centro Y]]-miY)^2),\"\")","v":""},{"$f":"IF(TablaFronteras[[#This Row],[Frontera]]=\"\",\"\",IFERROR(MATCH(RIGHT(TablaFronteras[[#This Row],[Frontera]],LEN(TablaFronteras[[#This Row],[Frontera]])-IFERROR(FIND(\" - \",TablaFronteras[[#This Row],[Frontera]])+2,0)),Datos[País],0),\"\"))","v":240}]
["Yemen",442.31991577148438,154.40432739257813,24.752126693725586,16.786613464355469,{"$f":"TablaFronteras[[#This Row],[X]]+TablaFronteras[[#This Row],[Ancho]]/2","v":454.69597911834717},{"$f":"TablaFronteras[[#This Row],[Y]]+TablaFronteras[[#This Row],[Alto]]/2","v":162.79763412475586},{"$f":"IF(AND(TablaFronteras[[#This Row],[Fila]]<>\"\",TablaFronteras[[#This Row],[X]]<miX,miX<TablaFronteras[[#This Row],[X]]+TablaFronteras[[#This Row],[Ancho]],TablaFronteras[[#This Row],[Y]]<miY,miY<TablaFronteras[[#This Row],[Y]]+TablaFronteras[[#This Row],[Alto]]),SQRT((TablaFronteras[[#This Row],[Centro X]]-miX)^2+(TablaFronteras[[#This Row],[Centro Y]]-miY)^2),\"\")","v":""},{"$f":"IF(TablaFronteras[[#This Row],[Frontera]]=\"\",\"\",IFERROR(MATCH(RIGHT(TablaFronteras[[#This Row],[Frontera]],LEN(TablaFronteras[[#This Row],[Frontera]])-IFERROR(FIND(\" - \",TablaFronteras[[#This Row],[Frontera]])+2,0)),Datos[País],0),\"\"))","v":273}]
["Omán",461.03927612304688,136.87126159667969,14.976377487182617,23.280786514282227,{"$f":"TablaFronteras[[#This Row],[X]]+TablaFronteras[[#This Row],[Ancho]]/2","v":468.52746486663818},{"$f":"TablaFronteras[[#This Row],[Y]]+TablaFronteras[[#This Row],[Alto]]/2","v":148.5116548538208},{"$f":"IF(AND(TablaFronteras[[#This Row],[Fila]]<>\"\",TablaFronteras[[#This Row],[X]]<miX,miX<TablaFronteras[[#This Row],[X]]+TablaFronteras[[#This Row],[Ancho]],TablaFronteras[[#This Row],[Y]]<miY,miY<TablaFronteras[[#This Row],[Y]]+TablaFronteras[[#This Row],[Alto]]),SQRT((TablaFronteras[[#This Row],[Centro X]]-miX)^2+(TablaFronteras[[#This Row],[Centro Y]]-miY)^2),\"\")","v":""},{"$f":"IF(TablaFronteras[[#This Row],[Frontera]]=\"\",\"\",IFERROR(MATCH(RIGHT(TablaFronteras[[#This Row],[Frontera]],LEN(TablaFronteras[[#This Row],[Frontera]])-IFERROR(FIND(\" - \",TablaFronteras[[#This Row],[Frontera]])+2,0)),Datos[País],0),\"\"))","v":188}]
["Emiratos Árabes Unidos",459.28463745117188,137.8846435546875,9.8600788116455078,7.9468502998352051,{"$f":"TablaFronteras[[#This Row],[X]]+TablaFronteras[[#This Row],[Ancho]]/2","v":464.21467685699463},{"$f":"TablaFronteras[[#This Row],[Y]]+TablaFronteras[[#This Row],[Alto]]/2","v":141.8580687046051},{"$f":"IF(AND(TablaFronteras[[#This Row],[Fila]]<>\"\",TablaFronteras[[#This Row],[X]]<miX,miX<TablaFronteras[[#This Row],[X]]+TablaFronteras[[#This Row],[Ancho]],TablaFronteras[[#This Row],[Y]]<miY,miY<TablaFronteras[[#This Row],[Y]]+TablaFronteras[[#This Row],[Alto]]),SQRT((TablaFronteras[[#This Row],[Centro X]]-miX)^2+(TablaFronteras[[#This Row],[Centro Y]]-miY)^2),\"\")","v":""},{"$f":"IF(TablaFronteras[[#This Row],[Frontera]]=\"\",\"\",IFERROR(MATCH(RIGHT(TablaFronteras[[#This Row],[Frontera]],LEN(TablaFronteras[[#This Row],[Frontera]])-IFERROR(FIND(\" - \",TablaFronteras[[#This Row],[Frontera]])+2,0)),Datos[País],0),\"\"))","v":71}]
["Arabia Saudita",424.30630493164063,122.89606475830078,43.920314788818359,38.030551910400391,{"$f":"TablaFronteras[[#This Row],[X]]+TablaFronteras[[#This Row],[Ancho]]/2","v":446.2664623260498},{"$f":"TablaFronteras[[#This Row],[Y]]+TablaFronteras[[#This Row],[Alto]]/2","v":141.91134071350098},{"$f":"IF(AND(TablaFronteras[[#This Row],[Fila]]<>\"\",TablaFronteras[[#This Row],[X]]<miX,miX<TablaFronteras[[#This Row],[X]]+TablaFronteras[[#This Row],[Ancho]],TablaFronteras[[#This Row],[Y]]<miY,miY<TablaFronteras[[#This Row],[Y]]+TablaFronteras[[#This Row],[Alto]]),SQRT((TablaFronteras[[#This Row],[Centro X]]-miX)^2+(TablaFronteras[[#This Row],[Centro Y]]-miY)^2),\"\")","v":""},{"$f":"IF(TablaFronteras[[#This Row],[Frontera]]=\"\",\"\",IFERROR(MATCH(RIGHT(TablaFronteras[[#This Row],[Frontera]],LEN(TablaFronteras[[#This Row],[Frontera]])-IFERROR(FIND(\" - \",TablaFronteras[[#This Row],[Frontera]])+2,0)),Datos[País],0),\"\"))","v":10}]
["Baréin",454.32638549804688,134.99842834472656,4.6266927719116211,3.5458266735076904,{"$f":"TablaFronteras[[#This Row],[X]]+TablaFronteras[[#This Row],[Ancho]]/2","v":456.63973188400269},{"$f":"TablaFronteras[[#This Row],[Y]]+TablaFronteras[[#This Row],[Alto]]/2","v":136.77134168148041},{"$f":"IF(AND(TablaFronteras[[#This Row],[Fila]]<>\"\",TablaFronteras[[#This Row],[X]]<miX,miX<TablaFronteras[[#This Row],[X]]+TablaFronteras[[#This Row],[Ancho]],TablaFronteras[[#This Row],[Y]]<miY,miY<TablaFronteras[[#This Row],[Y]]+TablaFronteras[[#This Row],[Alto]]),SQRT((TablaFronteras[[#This Row],[Centro X]]-miX)^2+(TablaFronteras[[#This Row],[Centro Y]]-miY)^2),\"\")","v":""},{"$f":"IF(TablaFronteras[[#This Row],[Frontera]]=\"\",\"\",IFERROR(MATCH(RIGHT(TablaFronteras[[#This Row],[Frontera]],LEN(TablaFronteras[[#This Row],[Frontera]])-IFERROR(FIND(\" - \",TablaFronteras[[#This Row],[Frontera]])+2,0)),Datos[País],0),\"\"))","v":27}]
["Catar",456.24197387695313,137.77944946289063,3.6062204837799072,3.6898424625396729,{"$f":"TablaFronteras[[#This Row],[X]]+TablaFronteras[[#This Row],[Ancho]]/2","v":458.04508411884308},{"$f":"TablaFronteras[[#This Row],[Y]]+TablaFronteras[[#This Row],[Alto]]/2","v":139.62437069416046},{"$f":"IF(AND(TablaFronteras[[#This Row],[Fila]]<>\"\",TablaFronteras[[#This Row],[X]]<miX,miX<TablaFronteras[[#This Row],[X]]+TablaFronteras[[#This Row],[Ancho]],TablaFronteras[[#This Row],[Y]]<miY,miY<TablaFronteras[[#This Row],[Y]]+TablaFronteras[[#This Row],[Alto]]),SQRT((TablaFronteras[[#This Row],[Centro X]]-miX)^2+(TablaFronteras[[#This Row],[Centro Y]]-miY)^2),\"\")","v":""},{"$f":"IF(TablaFronteras[[#This Row],[Frontera]]=\"\",\"\",IFERROR(MATCH(RIGHT(TablaFronteras[[#This Row],[Frontera]],LEN(TablaFronteras[[#This Row],[Frontera]])-IFERROR(FIND(\" - \",TablaFronteras[[#This Row],[Frontera]])+2,0)),Datos[País],0),\"\"))","v":49}]
["Irak",431.55282592773438,110.20433044433594,20.063779830932617,20.071102142333984,{"$f":"TablaFronteras[[#This Row],[X]]+TablaFronteras[[#This Row],[Ancho]]/2","v":441.58471584320068},{"$f":"TablaFronteras[[#This Row],[Y]]+TablaFronteras[[#This Row],[Alto]]/2","v":120.23988151550293},{"$f":"IF(AND(TablaFronteras[[#This Row],[Fila]]<>\"\",TablaFronteras[[#This Row],[X]]<miX,miX<TablaFronteras[[#This Row],[X]]+TablaFronteras[[#This Row],[Ancho]],TablaFronteras[[#This Row],[Y]]<miY,miY<TablaFronteras[[#This Row],[Y]]+TablaFronteras[[#This Row],[Alto]]),SQRT((TablaFronteras[[#This Row],[Centro X]]-miX)^2+(TablaFronteras[[#This Row],[Centro Y]]-miY)^2),\"\")","v":""},{"$f":"IF(TablaFronteras[[#This Row],[Frontera]]=\"\",\"\",IFERROR(MATCH(RIGHT(TablaFronteras[[#This Row],[Frontera]],LEN(TablaFronteras[[#This Row],[Frontera]])-IFERROR(FIND(\" - \",TablaFronteras[[#This Row],[Frontera]])+2,0)),Datos[País],0),\"\"))","v":106}]
["Jordania",424.78591918945313,119.70172882080078,9.2484254837036133,10.262125968933105,{"$f":"TablaFronteras[[#This Row],[X]]+TablaFronteras[[#This Row],[Ancho]]/2","v":429.41013193130493},{"$f":"TablaFronteras[[#This Row],[Y]]+TablaFronteras[[#This Row],[Alto]]/2","v":124.83279180526733},{"$f":"IF(AND(TablaFronteras[[#This Row],[Fila]]<>\"\",TablaFronteras[[#This Row],[X]]<miX,miX<TablaFronteras[[#This Row],[X]]+TablaFronteras[[#This Row],[Ancho]],TablaFronteras[[#This Row],[Y]]<miY,miY<TablaFronteras[[#This Row],[Y]]+TablaFronteras[[#This Row],[Alto]]),SQRT((TablaFronteras[[#This Row],[Centro X]]-miX)^2+(TablaFronteras[[#This Row],[Centro Y]]-miY)^2),\"\")","v":""},{"$f":"IF(TablaFronteras[[#This Row],[Frontera]]=\"\",\"\",IFERROR(MATCH(RIGHT(TablaFronteras[[#This Row],[Frontera]],LEN(TablaFronteras[[#This Row],[Frontera]])-IFERROR(FIND(\" - \",TablaFronteras[[#This Row],[Frontera]])+2,0)),Datos[País],0),\"\"))","v":139}]
["Siria",425.12557983398438,110.37882232666016,12.890235900878906,12.045196533203125,{"$f":"TablaFronteras[[#This Row],[X]]+TablaFronteras[[#This Row],[Ancho]]/2","v":431.57069778442383},{"$f":"TablaFronteras[[#This Row],[Y]]+TablaFronteras[[#This Row],[Alto]]/2","v":116.40142059326172},{"$f":"IF(AND(TablaFronteras[[#This Row],[Fila]]<>\"\",TablaFronteras[[#This Row],[X]]<miX,miX<TablaFronteras[[#This Row],[X]]+TablaFronteras[[#This Row],[Ancho]],TablaFronteras[[#This Row],[Y]]<miY,miY<TablaFronteras[[#This Row],[Y]]+TablaFronteras[[#This Row],[Alto]]),SQRT((TablaFronteras[[#This Row],[Centro X]]-miX)^2+(TablaFronteras[[#This Row],[Centro Y]]-miY)^2),\"\")","v":""},{"$f":"IF(TablaFronteras[[#This Row],[Frontera]]=\"\",\"\",IFERROR(MATCH(RIGHT(TablaFronteras[[#This Row],[Frontera]],LEN(TablaFronteras[[#This Row],[Frontera]])-IFERROR(FIND(\" - \",TablaFronteras[[#This Row],[Frontera]])+2,0)),Datos[País],0),\"\"))","v":236}]
["Israel",422.09906005859375,119.90244293212891,3.3734645843505859,9.3500785827636719,{"$f":"TablaFronteras[[#This Row],[X]]+TablaFronteras[[#This Row],[Ancho]]/2","v":423.78579235076904},{"$f":"TablaFronteras[[#This Row],[Y]]+TablaFronteras[[#This Row],[Alto]]/2","v":124.57748222351074},{"$f":"IF(AND(TablaFronteras[[#This Row],[Fila]]<>\"\",TablaFronteras[[#This Row],[X]]<miX,miX<TablaFronteras[[#This Row],[X]]+TablaFronteras[[#This Row],[Ancho]],TablaFronteras[[#This Row],[Y]]<miY,miY<TablaFronteras[[#This Row],[Y]]+TablaFronteras[[#This Row],[Alto]]),SQRT((TablaFronteras[[#This Row],[Centro X]]-miX)^2+(TablaFronteras[[#This Row],[Centro Y]]-miY)^2),\"\")","v":""},{"$f":"IF(TablaFronteras[[#This Row],[Frontera]]=\"\",\"\",IFERROR(MATCH(RIGHT(TablaFronteras[[#This Row],[Frontera]],LEN(TablaFronteras[[#This Row],[Frontera]])-IFERROR(FIND(\" - \",TablaFronteras[[#This Row],[Frontera]])+2,0)),Datos[País],0),\"\"))","v":134}]
["Camboya",565.6732177734375,164.80842590332031,10.559370040893555,11.404330253601074,{"$f":"TablaFronteras[[#This Row],[X]]+TablaFronteras[[#This Row],[Ancho]]/2","v":570.95290279388428},{"$f":"TablaFronteras[[#This Row],[Y]]+TablaFronteras[[#This Row],[Alto]]/2","v":170.51059103012085},{"$f":"IF(AND(TablaFronteras[[#This Row],[Fila]]<>\"\",TablaFronteras[[#This Row],[X]]<miX,miX<TablaFronteras[[#This Row],[X]]+TablaFronteras[[#This Row],[Ancho]],TablaFronteras[[#This Row],[Y]]<miY,miY<TablaFronteras[[#This Row],[Y]]+TablaFronteras[[#This Row],[Alto]]),SQRT((TablaFronteras[[#This Row],[Centro X]]-miX)^2+(TablaFronteras[[#This Row],[Centro Y]]-miY)^2),\"\")","v":""},{"$f":"IF(TablaFronteras[[#This Row],[Frontera]]=\"\",\"\",IFERROR(MATCH(RIGHT(TablaFronteras[[#This Row],[Frontera]],LEN(TablaFronteras[[#This Row],[Frontera]])-IFERROR(FIND(\" - \",TablaFronteras[[#This Row],[Frontera]])+2,0)),Datos[País],0),\"\"))","v":45}]
["México",118.15873718261719,121.50125885009766,59.104015350341797,44.033149719238281,{"$f":"TablaFronteras[[#This Row],[X]]+TablaFronteras[[#This Row],[Ancho]]/2","v":147.71074485778809},{"$f":"TablaFronteras[[#This Row],[Y]]+TablaFronteras[[#This Row],[Alto]]/2","v":143.5178337097168},{"$f":"IF(AND(TablaFronteras[[#This Row],[Fila]]<>\"\",TablaFronteras[[#This Row],[X]]<miX,miX<TablaFronteras[[#This Row],[X]]+TablaFronteras[[#This Row],[Ancho]],TablaFronteras[[#This Row],[Y]]<miY,miY<TablaFronteras[[#This Row],[Y]]+TablaFronteras[[#This Row],[Alto]]),SQRT((TablaFronteras[[#This Row],[Centro X]]-miX)^2+(TablaFronteras[[#This Row],[Centro Y]]-miY)^2),\"\")","v":""},{"$f":"IF(TablaFronteras[[#This Row],[Frontera]]=\"\",\"\",IFERROR(MATCH(RIGHT(TablaFronteras[[#This Row],[Frontera]],LEN(TablaFronteras[[#This Row],[Frontera]])-IFERROR(FIND(\" - \",TablaFronteras[[#This Row],[Frontera]])+2,0)),Datos[País],0),\"\"))","v":176}]
["Cuba",181.3897705078125,144.48826599121094,21.375354766845703,8.1044092178344727,{"$f":"TablaFronteras[[#This Row],[X]]+TablaFronteras[[#This Row],[Ancho]]/2","v":192.07744789123535},{"$f":"TablaFronteras[[#This Row],[Y]]+TablaFronteras[[#This Row],[Alto]]/2","v":148.54047060012817},{"$f":"IF(AND(TablaFronteras[[#This Row],[Fila]]<>\"\",TablaFronteras[[#This Row],[X]]<miX,miX<TablaFronteras[[#This Row],[X]]+TablaFronteras[[#This Row],[Ancho]],TablaFronteras[[#This Row],[Y]]<miY,miY<TablaFronteras[[#This Row],[Y]]+TablaFronteras[[#This Row],[Alto]]),SQRT((TablaFronteras[[#This Row],[Centro X]]-miX)^2+(TablaFronteras[[#This Row],[Centro Y]]-miY)^2),\"\")","v":""},{"$f":"IF(TablaFronteras[[#This Row],[Frontera]]=\"\",\"\",IFERROR(MATCH(RIGHT(TablaFronteras[[#This Row],[Frontera]],LEN(TablaFronteras[[#This Row],[Frontera]])-IFERROR(FIND(\" - \",TablaFronteras[[#This Row],[Frontera]])+2,0)),Datos[País],0),\"\"))","v":64}]
["República Dominicana",206.77133178710938,152.42440795898438,7.8925986289978027,5.5292911529541016,{"$f":"TablaFronteras[[#This Row],[X]]+TablaFronteras[[#This Row],[Ancho]]/2","v":210.71763110160828},{"$f":"TablaFronteras[[#This Row],[Y]]+TablaFronteras[[#This Row],[Alto]]/2","v":155.18905353546143},{"$f":"IF(AND(TablaFronteras[[#This Row],[Fila]]<>\"\",TablaFronteras[[#This Row],[X]]<miX,miX<TablaFronteras[[#This Row],[X]]+TablaFronteras[[#This Row],[Ancho]],TablaFronteras[[#This Row],[Y]]<miY,miY<TablaFronteras[[#This Row],[Y]]+TablaFronteras[[#This Row],[Alto]]),SQRT((TablaFronteras[[#This Row],[Centro X]]-miX)^2+(TablaFronteras[[#This Row],[Centro Y]]-miY)^2),\"\")","v":""},{"$f":"IF(TablaFronteras[[#This Row],[Frontera]]=\"\",\"\",IFERROR(MATCH(RIGHT(TablaFronteras[[#This Row],[Frontera]],LEN(TablaFronteras[[#This Row],[Frontera]])-IFERROR(FIND(\" - \",TablaFronteras[[#This Row],[Frontera]])+2,0)),Datos[País],0),\"\"))","v":211}]
["Belice",170.30094909667969,156.19984436035156,2.9366142749786377,6.1560630798339844,{"$f":"TablaFronteras[[#This Row],[X]]+TablaFronteras[[#This Row],[Ancho]]/2","v":171.76925623416901},{"$f":"TablaFronteras[[#This Row],[Y]]+TablaFronteras[[#This Row],[Alto]]/2","v":159.27787590026855},{"$f":"IF(AND(TablaFronteras[[#This Row],[Fila]]<>\"\",TablaFronteras[[#This Row],[X]]<miX,miX<TablaFronteras[[#This Row],[X]]+TablaFronteras[[#This Row],[Ancho]],TablaFronteras[[#This Row],[Y]]<miY,miY<TablaFronteras[[#This Row],[Y]]+TablaFronteras[[#This Row],[Alto]]),SQRT((TablaFronteras[[#This Row],[Centro X]]-miX)^2+(TablaFronteras[[#This Row],[Centro Y]]-miY)^2),\"\")","v":""},{"$f":"IF(TablaFronteras[[#This Row],[Frontera]]=\"\",\"\",IFERROR(MATCH(RIGHT(TablaFronteras[[#This Row],[Frontera]],LEN(TablaFronteras[[#This Row],[Frontera]])-IFERROR(FIND(\" - \",TablaFronteras[[#This Row],[Frontera]])+2,0)),Datos[País],0),\"\"))","v":28}]
["Guatemala",164.43354797363281,157.36189270019531,7.2960629463195801,9.9841728210449219,{"$f":"TablaFronteras[[#This Row],[X]]+TablaFronteras[[#This Row],[Ancho]]/2","v":168.0815794467926},{"$f":"TablaFronteras[[#This Row],[Y]]+TablaFronteras[[#This Row],[Alto]]/2","v":162.35397911071777},{"$f":"IF(AND(TablaFronteras[[#This Row],[Fila]]<>\"\",TablaFronteras[[#This Row],[X]]<miX,miX<TablaFronteras[[#This Row],[X]]+TablaFronteras[[#This Row],[Ancho]],TablaFronteras[[#This Row],[Y]]<miY,miY<TablaFronteras[[#This Row],[Y]]+TablaFronteras[[#This Row],[Alto]]),SQRT((TablaFronteras[[#This Row],[Centro X]]-miX)^2+(TablaFronteras[[#This Row],[Centro Y]]-miY)^2),\"\")","v":""},{"$f":"IF(TablaFronteras[[#This Row],[Frontera]]=\"\",\"\",IFERROR(MATCH(RIGHT(TablaFronteras[[#This Row],[Frontera]],LEN(TablaFronteras[[#This Row],[Frontera]])-IFERROR(FIND(\" - \",TablaFronteras[[#This Row],[Frontera]])+2,0)),Datos[País],0),\"\"))","v":93}]
["El Salvador",168.35661315917969,165.72079467773438,4.5190548896789551,3.0512597560882568,{"$f":"TablaFronteras[[#This Row],[X]]+TablaFronteras[[#This Row],[Ancho]]/2","v":170.61614060401917},{"$f":"TablaFronteras[[#This Row],[Y]]+TablaFronteras[[#This Row],[Alto]]/2","v":167.2464245557785},{"$f":"IF(AND(TablaFronteras[[#This Row],[Fila]]<>\"\",TablaFronteras[[#This Row],[X]]<miX,miX<TablaFronteras[[#This Row],[X]]+TablaFronteras[[#This Row],[Ancho]],TablaFronteras[[#This Row],[Y]]<miY,miY<TablaFronteras[[#This Row],[Y]]+TablaFronteras[[#This Row],[Alto]]),SQRT((TablaFronteras[[#This Row],[Centro X]]-miX)^2+(TablaFronteras[[#This Row],[Centro Y]]-miY)^2),\"\")","v":""},{"$f":"IF(TablaFronteras[[#This Row],[Frontera]]=\"\",\"\",IFERROR(MATCH(RIGHT(TablaFronteras[[#This Row],[Frontera]],LEN(TablaFronteras[[#This Row],[Frontera]])-IFERROR(FIND(\" - \",TablaFronteras[[#This Row],[Frontera]])+2,0)),Datos[País],0),\"\"))","v":70}]
["Honduras",169.99118041992188,160.51606750488281,11.689212799072266,8.3998422622680664,{"$f":"TablaFronteras[[#This Row],[X]]+TablaFronteras[[#This Row],[Ancho]]/2","v":175.83578681945801},{"$f":"TablaFronteras[[#This Row],[Y]]+TablaFronteras[[#This Row],[Alto]]/2","v":164.71598863601685},{"$f":"IF(AND(TablaFronteras[[#This Row],[Fila]]<>\"\",TablaFronteras[[#This Row],[X]]<miX,miX<TablaFronteras[[#This Row],[X]]+TablaFronteras[[#This Row],[Ancho]],TablaFronteras[[#This Row],[Y]]<miY,miY<TablaFronteras[[#This Row],[Y]]+TablaFronteras[[#This Row],[Alto]]),SQRT((TablaFronteras[[#This Row],[Centro X]]-miX)^2+(TablaFronteras[[#This Row],[Centro Y]]-miY)^2),\"\")","v":""},{"$f":"IF(TablaFronteras[[#This Row],[Frontera]]=\"\",\"\",IFERROR(MATCH(RIGHT(TablaFronteras[[#This Row],[Frontera]],LEN(TablaFronteras[[#This Row],[Frontera]])-IFERROR(FIND(\" - \",TablaFronteras[[#This Row],[Frontera]])+2,0)),Datos[País],0),\"\"))","v":102}]
["Nicaragua",173.26504516601563,164.11936950683594,8.9144096374511719,10.440550804138184,{"$f":"TablaFronteras[[#This Row],[X]]+TablaFronteras[[#This Row],[Ancho]]/2","v":177.72224998474121},{"$f":"TablaFronteras[[#This Row],[Y]]+TablaFronteras[[#This Row],[Alto]]/2","v":169.33964490890503},{"$f":"IF(AND(TablaFronteras[[#This Row],[Fila]]<>\"\",TablaFronteras[[#This Row],[X]]<miX,miX<TablaFronteras[[#This Row],[X]]+TablaFronteras[[#This Row],[Ancho]],TablaFronteras[[#This Row],[Y]]<miY,miY<TablaFronteras[[#This Row],[Y]]+TablaFronteras[[#This Row],[Alto]]),SQRT((TablaFronteras[[#This Row],[Centro X]]-miX)^2+(TablaFronteras[[#This Row],[Centro Y]]-miY)^2),\"\")","v":""},{"$f":"IF(TablaFronteras[[#This Row],[Frontera]]=\"\",\"\",IFERROR(MATCH(RIGHT(TablaFronteras[[#This Row],[Frontera]],LEN(TablaFronteras[[#This Row],[Frontera]])-IFERROR(FIND(\" - \",TablaFronteras[[#This Row],[Frontera]])+2,0)),Datos[País],0),\"\"))","v":181}]
["Costa Rica",174.71676635742188,173.59597778320313,7.768897533416748,14.155117988586426,{"$f":"TablaFronteras[[#This Row],[X]]+TablaFronteras[[#This Row],[Ancho]]/2","v":178.60121512413025},{"$f":"TablaFronteras[[#This Row],[Y]]+TablaFronteras[[#This Row],[Alto]]/2","v":180.67353677749634},{"$f":"IF(AND(TablaFronteras[[#This Row],[Fila]]<>\"\",TablaFronteras[[#This Row],[X]]<miX,miX<TablaFronteras[[#This Row],[X]]+TablaFronteras[[#This Row],[Ancho]],TablaFronteras[[#This Row],[Y]]<miY,miY<TablaFronteras[[#This Row],[Y]]+TablaFronteras[[#This Row],[Alto]]),SQRT((TablaFronteras[[#This Row],[Centro X]]-miX)^2+(TablaFronteras[[#This Row],[Centro Y]]-miY)^2),\"\")","v":""},{"$f":"IF(TablaFronteras[[#This Row],[Frontera]]=\"\",\"\",IFERROR(MATCH(RIGHT(TablaFronteras[[#This Row],[Frontera]],LEN(TablaFronteras[[#This Row],[Frontera]])-IFERROR(FIND(\" - \",TablaFronteras[[#This Row],[Frontera]])+2,0)),Datos[País],0),\"\"))","v":61}]
["Panamá",181.90432739257813,177.20928955078125,12.470157623291016,5.9740157127380371,{"$f":"TablaFronteras[[#This Row],[X]]+TablaFronteras[[#This Row],[Ancho]]/2","v":188.13940620422363},{"$f":"TablaFronteras[[#This Row],[Y]]+TablaFronteras[[#This Row],[Alto]]/2","v":180.19629740715027},{"$f":"IF(AND(TablaFronteras[[#This Row],[Fila]]<>\"\",TablaFronteras[[#This Row],[X]]<miX,miX<TablaFronteras[[#This Row],[X]]+TablaFronteras[[#This Row],[Ancho]],TablaFronteras[[#This Row],[Y]]<miY,miY<TablaFronteras[[#This Row],[Y]]+TablaFronteras[[#This Row],[Alto]]),SQRT((TablaFronteras[[#This Row],[Centro X]]-miX)^2+(TablaFronteras[[#This Row],[Centro Y]]-miY)^2),\"\")","v":""},{"$f":"IF(TablaFronteras[[#This Row],[Frontera]]=\"\",\"\",IFERROR(MATCH(RIGHT(TablaFronteras[[#This Row],[Frontera]],LEN(TablaFronteras[[#This Row],[Frontera]])-IFERROR(FIND(\" - \",TablaFronteras[[#This Row],[Frontera]])+2,0)),Datos[País],0),\"\"))","v":193}]
["Colombia",189.93968200683594,170.52748107910156,25.365354537963867,40.679370880126953,{"$f":"TablaFronteras[[#This Row],[X]]+TablaFronteras[[#This Row],[Ancho]]/2","v":202.62235927581787},{"$f":"TablaFronteras[[#This Row],[Y]]+TablaFronteras[[#This Row],[Alto]]/2","v":190.86716651916504},{"$f":"IF(AND(TablaFronteras[[#This Row],[Fila]]<>\"\",TablaFronteras[[#This Row],[X]]<miX,miX<TablaFronteras[[#This Row],[X]]+TablaFronteras[[#This Row],[Ancho]],TablaFronteras[[#This Row],[Y]]<miY,miY<TablaFronteras[[#This Row],[Y]]+TablaFronteras[[#This Row],[Alto]]),SQRT((TablaFronteras[[#This Row],[Centro X]]-miX)^2+(TablaFronteras[[#This Row],[Centro Y]]-miY)^2),\"\")","v":""},{"$f":"IF(TablaFronteras[[#This Row],[Frontera]]=\"\",\"\",IFERROR(MATCH(RIGHT(TablaFronteras[[#This Row],[Frontera]],LEN(TablaFronteras[[#This Row],[Frontera]])-IFERROR(FIND(\" - \",TablaFronteras[[#This Row],[Frontera]])+2,0)),Datos[País],0),\"\"))","v":57}]
["Venezuela",201.85733032226563,171.03378295898438,28.041574478149414,28.022520065307617,{"$f":"TablaFronteras[[#This Row],[X]]+TablaFronteras[[#This Row],[Ancho]]/2","v":215.87811756134033},{"$f":"TablaFronteras[[#This Row],[Y]]+TablaFronteras[[#This Row],[Alto]]/2","v":185.04504299163818},{"$f":"IF(AND(TablaFronteras[[#This Row],[Fila]]<>\"\",TablaFronteras[[#This Row],[X]]<miX,miX<TablaFronteras[[#This Row],[X]]+TablaFronteras[[#This Row],[Ancho]],TablaFronteras[[#This Row],[Y]]<miY,miY<TablaFronteras[[#This Row],[Y]]+TablaFronteras[[#This Row],[Alto]]),SQRT((TablaFronteras[[#This Row],[Centro X]]-miX)^2+(TablaFronteras[[#This Row],[Centro Y]]-miY)^2),\"\")","v":""},{"$f":"IF(TablaFronteras[[#This Row],[Frontera]]=\"\",\"\",IFERROR(MATCH(RIGHT(TablaFronteras[[#This Row],[Frontera]],LEN(TablaFronteras[[#This Row],[Frontera]])-IFERROR(FIND(\" - \",TablaFronteras[[#This Row],[Frontera]])+2,0)),Datos[País],0),\"\"))","v":270}]
["Guyana",226.38432312011719,180.10346984863281,10.449448585510254,17.562440872192383,{"$f":"TablaFronteras[[#This Row],[X]]+TablaFronteras[[#This Row],[Ancho]]/2","v":231.60904741287231},{"$f":"TablaFronteras[[#This Row],[Y]]+TablaFronteras[[#This Row],[Alto]]/2","v":188.884690284729},{"$f":"IF(AND(TablaFronteras[[#This Row],[Fila]]<>\"\",TablaFronteras[[#This Row],[X]]<miX,miX<TablaFronteras[[#This Row],[X]]+TablaFronteras[[#This Row],[Ancho]],TablaFronteras[[#This Row],[Y]]<miY,miY<TablaFronteras[[#This Row],[Y]]+TablaFronteras[[#This Row],[Alto]]),SQRT((TablaFronteras[[#This Row],[Centro X]]-miX)^2+(TablaFronteras[[#This Row],[Centro Y]]-miY)^2),\"\")","v":""},{"$f":"IF(TablaFronteras[[#This Row],[Frontera]]=\"\",\"\",IFERROR(MATCH(RIGHT(TablaFronteras[[#This Row],[Frontera]],LEN(TablaFronteras[[#This Row],[Frontera]])-IFERROR(FIND(\" - \",TablaFronteras[[#This Row],[Frontera]])+2,0)),Datos[País],0),\"\"))","v":99}]
["Surinam",233.93173217773438,186.04811096191406,8.2827558517456055,10.082204818725586,{"$f":"TablaFronteras[[#This Row],[X]]+TablaFronteras[[#This Row],[Ancho]]/2","v":238.07311010360718},{"$f":"TablaFronteras[[#This Row],[Y]]+TablaFronteras[[#This Row],[Alto]]/2","v":191.08921337127686},{"$f":"IF(AND(TablaFronteras[[#This Row],[Fila]]<>\"\",TablaFronteras[[#This Row],[X]]<miX,miX<TablaFronteras[[#This Row],[X]]+TablaFronteras[[#This Row],[Ancho]],TablaFronteras[[#This Row],[Y]]<miY,miY<TablaFronteras[[#This Row],[Y]]+TablaFronteras[[#This Row],[Alto]]),SQRT((TablaFronteras[[#This Row],[Centro X]]-miX)^2+(TablaFronteras[[#This Row],[Centro Y]]-miY)^2),\"\")","v":""},{"$f":"IF(TablaFronteras[[#This Row],[Frontera]]=\"\",\"\",IFERROR(MATCH(RIGHT(TablaFronteras[[#This Row],[Frontera]],LEN(TablaFronteras[[#This Row],[Frontera]])-IFERROR(FIND(\" - \",TablaFronteras[[#This Row],[Frontera]])+2,0)),Datos[País],0),\"\"))","v":247}]
["Guayana Francesa",240.85952758789063,186.68684387207031,7.3321261405944824,8.8312597274780273,{"$f":"TablaFronteras[[#This Row],[X]]+TablaFronteras[[#This Row],[Ancho]]/2","v":244.52559065818787},{"$f":"TablaFronteras[[#This Row],[Y]]+TablaFronteras[[#This Row],[Alto]]/2","v":191.10247373580933},{"$f":"IF(AND(TablaFronteras[[#This Row],[Fila]]<>\"\",TablaFronteras[[#This Row],[X]]<miX,miX<TablaFronteras[[#This Row],[X]]+TablaFronteras[[#This Row],[Ancho]],TablaFronteras[[#This Row],[Y]]<miY,miY<TablaFronteras[[#This Row],[Y]]+TablaFronteras[[#This Row],[Alto]]),SQRT((TablaFronteras[[#This Row],[Centro X]]-miX)^2+(TablaFronteras[[#This Row],[Centro Y]]-miY)^2),\"\")","v":""},{"$f":"IF(TablaFronteras[[#This Row],[Frontera]]=\"\",\"\",IFERROR(MATCH(RIGHT(TablaFronteras[[#This Row],[Frontera]],LEN(TablaFronteras[[#This Row],[Frontera]])-IFERROR(FIND(\" - \",TablaFronteras[[#This Row],[Frontera]])+2,0)),Datos[País],0),\"\"))","v":94}]
["Brasil",200.35810852050781,187.82015991210938,81.415985107421875,94.521499633789063,{"$f":"TablaFronteras[[#This Row],[X]]+TablaFronteras[[#This Row],[Ancho]]/2","v":241.06610107421875},{"$f":"TablaFronteras[[#This Row],[Y]]+TablaFronteras[[#This Row],[Alto]]/2","v":235.08090972900391},{"$f":"IF(AND(TablaFronteras[[#This Row],[Fila]]<>\"\",TablaFronteras[[#This Row],[X]]<miX,miX<TablaFronteras[[#This Row],[X]]+TablaFronteras[[#This Row],[Ancho]],TablaFronteras[[#This Row],[Y]]<miY,miY<TablaFronteras[[#This Row],[Y]]+TablaFronteras[[#This Row],[Alto]]),SQRT((TablaFronteras[[#This Row],[Centro X]]-miX)^2+(TablaFronteras[[#This Row],[Centro Y]]-miY)^2),\"\")","v":""},{"$f":"IF(TablaFronteras[[#This Row],[Frontera]]=\"\",\"\",IFERROR(MATCH(RIGHT(TablaFronteras[[#This Row],[Frontera]],LEN(TablaFronteras[[#This Row],[Frontera]])-IFERROR(FIND(\" - \",TablaFronteras[[#This Row],[Frontera]])+2,0)),Datos[País],0),\"\"))","v":37}]
["Ecuador",163.71315002441406,197.16102600097656,34.590629577636719,15.501890182495117,{"$f":"TablaFronteras[[#This Row],[X]]+TablaFronteras[[#This Row],[Ancho]]/2","v":181.00846481323242},{"$f":"TablaFronteras[[#This Row],[Y]]+TablaFronteras[[#This Row],[Alto]]/2","v":204.91197109222412},{"$f":"IF(AND(TablaFronteras[[#This Row],[Fila]]<>\"\",TablaFronteras[[#This Row],[X]]<miX,miX<TablaFronteras[[#This Row],[X]]+TablaFronteras[[#This Row],[Ancho]],TablaFronteras[[#This Row],[Y]]<miY,miY<TablaFronteras[[#This Row],[Y]]+TablaFronteras[[#This Row],[Alto]]),SQRT((TablaFronteras[[#This Row],[Centro X]]-miX)^2+(TablaFronteras[[#This Row],[Centro Y]]-miY)^2),\"\")","v":""},{"$f":"IF(TablaFronteras[[#This Row],[Frontera]]=\"\",\"\",IFERROR(MATCH(RIGHT(TablaFronteras[[#This Row],[Frontera]],LEN(TablaFronteras[[#This Row],[Frontera]])-IFERROR(FIND(\" - \",TablaFronteras[[#This Row],[Frontera]])+2,0)),Datos[País],0),\"\"))","v":68}]
["Perú",185.28054809570313,200.73991394042969,27.492046356201172,44.248977661132813,{"$f":"TablaFronteras[[#This Row],[X]]+TablaFronteras[[#This Row],[Ancho]]/2","v":199.02657127380371},{"$f":"TablaFronteras[[#This Row],[Y]]+TablaFronteras[[#This Row],[Alto]]/2","v":222.86440277099609},{"$f":"IF(AND(TablaFronteras[[#This Row],[Fila]]<>\"\",TablaFronteras[[#This Row],[X]]<miX,miX<TablaFronteras[[#This Row],[X]]+TablaFronteras[[#This Row],[Ancho]],TablaFronteras[[#This Row],[Y]]<miY,miY<TablaFronteras[[#This Row],[Y]]+TablaFronteras[[#This Row],[Alto]]),SQRT((TablaFronteras[[#This Row],[Centro X]]-miX)^2+(TablaFronteras[[#This Row],[Centro Y]]-miY)^2),\"\")","v":""},{"$f":"IF(TablaFronteras[[#This Row],[Frontera]]=\"\",\"\",IFERROR(MATCH(RIGHT(TablaFronteras[[#This Row],[Frontera]],LEN(TablaFronteras[[#This Row],[Frontera]])-IFERROR(FIND(\" - \",TablaFronteras[[#This Row],[Frontera]])+2,0)),Datos[País],0),\"\"))","v":200}]
["Bolivia",210.42779541015625,224.11740112304688,26.204959869384766,32.001731872558594,{"$f":"TablaFronteras[[#This Row],[X]]+TablaFronteras[[#This Row],[Ancho]]/2","v":223.53027534484863},{"$f":"TablaFronteras[[#This Row],[Y]]+TablaFronteras[[#This Row],[Alto]]/2","v":240.11826705932617},{"$f":"IF(AND(TablaFronteras[[#This Row],[Fila]]<>\"\",TablaFronteras[[#This Row],[X]]<miX,miX<TablaFronteras[[#This Row],[X]]+TablaFronteras[[#This Row],[Ancho]],TablaFronteras[[#This Row],[Y]]<miY,miY<TablaFronteras[[#This Row],[Y]]+TablaFronteras[[#This Row],[Alto]]),SQRT((TablaFronteras[[#This Row],[Centro X]]-miX)^2+(TablaFronteras[[#This Row],[Centro Y]]-miY)^2),\"\")","v":""},{"$f":"IF(TablaFronteras[[#This Row],[Frontera]]=\"\",\"\",IFERROR(MATCH(RIGHT(TablaFronteras[[#This Row],[Frontera]],LEN(TablaFronteras[[#This Row],[Frontera]])-IFERROR(FIND(\" - \",TablaFronteras[[#This Row],[Frontera]])+2,0)),Datos[País],0),\"\"))","v":33}]
["Paraguay",226.78323364257813,247.27748107910156,18.165826797485352,20.230550765991211,{"$f":"TablaFronteras[[#This Row],[X]]+TablaFronteras[[#This Row],[Ancho]]/2","v":235.8661470413208},{"$f":"TablaFronteras[[#This Row],[Y]]+TablaFronteras[[#This Row],[Alto]]/2","v":257.39275646209717},{"$f":"IF(AND(TablaFronteras[[#This Row],[Fila]]<>\"\",TablaFronteras[[#This Row],[X]]<miX,miX<TablaFronteras[[#This Row],[X]]+TablaFronteras[[#This Row],[Ancho]],TablaFronteras[[#This Row],[Y]]<miY,miY<TablaFronteras[[#This Row],[Y]]+TablaFronteras[[#This Row],[Alto]]),SQRT((TablaFronteras[[#This Row],[Centro X]]-miX)^2+(TablaFronteras[[#This Row],[Centro Y]]-miY)^2),\"\")","v":""},{"$f":"IF(TablaFronteras[[#This Row],[Frontera]]=\"\",\"\",IFERROR(MATCH(RIGHT(TablaFronteras[[#This Row],[Frontera]],LEN(TablaFronteras[[#This Row],[Frontera]])-IFERROR(FIND(\" - \",TablaFronteras[[#This Row],[Frontera]])+2,0)),Datos[País],0),\"\"))","v":198}]
["Uruguay",239.79299926757813,273.50054931640625,10.096771240234375,11.588425636291504,{"$f":"TablaFronteras[[#This Row],[X]]+TablaFronteras[[#This Row],[Ancho]]/2","v":244.84138488769531},{"$f":"TablaFronteras[[#This Row],[Y]]+TablaFronteras[[#This Row],[Alto]]/2","v":279.294762134552},{"$f":"IF(AND(TablaFronteras[[#This Row],[Fila]]<>\"\",TablaFronteras[[#This Row],[X]]<miX,miX<TablaFronteras[[#This Row],[X]]+TablaFronteras[[#This Row],[Ancho]],TablaFronteras[[#This Row],[Y]]<miY,miY<TablaFronteras[[#This Row],[Y]]+TablaFronteras[[#This Row],[Alto]]),SQRT((TablaFronteras[[#This Row],[Centro X]]-miX)^2+(TablaFronteras[[#This Row],[Centro Y]]-miY)^2),\"\")","v":""},{"$f":"IF(TablaFronteras[[#This Row],[Frontera]]=\"\",\"\",IFERROR(MATCH(RIGHT(TablaFronteras[[#This Row],[Frontera]],LEN(TablaFronteras[[#This Row],[Frontera]])-IFERROR(FIND(\" - \",TablaFronteras[[#This Row],[Frontera]])+2,0)),Datos[País],0),\"\"))","v":267}]
["Chile",134.86369323730469,243.02952575683594,107.19882202148438,91.601417541503906,{"$f":"TablaFronteras[[#This Row],[X]]+TablaFronteras[[#This Row],[Ancho]]/2","v":188.46310424804688},{"$f":"TablaFronteras[[#This Row],[Y]]+TablaFronteras[[#This Row],[Alto]]/2","v":288.83023452758789},{"$f":"IF(AND(TablaFronteras[[#This Row],[Fila]]<>\"\",TablaFronteras[[#This Row],[X]]<miX,miX<TablaFronteras[[#This Row],[X]]+TablaFronteras[[#This Row],[Ancho]],TablaFronteras[[#This Row],[Y]]<miY,miY<TablaFronteras[[#This Row],[Y]]+TablaFronteras[[#This Row],[Alto]]),SQRT((TablaFronteras[[#This Row],[Centro X]]-miX)^2+(TablaFronteras[[#This Row],[Centro Y]]-miY)^2),\"\")","v":""},{"$f":"IF(TablaFronteras[[#This Row],[Frontera]]=\"\",\"\",IFERROR(MATCH(RIGHT(TablaFronteras[[#This Row],[Frontera]],LEN(TablaFronteras[[#This Row],[Frontera]])-IFERROR(FIND(\" - \",TablaFronteras[[#This Row],[Frontera]])+2,0)),Datos[País],0),\"\"))","v":52}]
["Argentina",214.96385192871094,253.43055725097656,31.879291534423828,79.166297912597656,{"$f":"TablaFronteras[[#This Row],[X]]+TablaFronteras[[#This Row],[Ancho]]/2","v":230.90349769592285},{"$f":"TablaFronteras[[#This Row],[Y]]+TablaFronteras[[#This Row],[Alto]]/2","v":293.01370620727539},{"$f":"IF(AND(TablaFronteras[[#This Row],[Fila]]<>\"\",TablaFronteras[[#This Row],[X]]<miX,miX<TablaFronteras[[#This Row],[X]]+TablaFronteras[[#This Row],[Ancho]],TablaFronteras[[#This Row],[Y]]<miY,miY<TablaFronteras[[#This Row],[Y]]+TablaFronteras[[#This Row],[Alto]]),SQRT((TablaFronteras[[#This Row],[Centro X]]-miX)^2+(TablaFronteras[[#This Row],[Centro Y]]-miY)^2),\"\")","v":""},{"$f":"IF(TablaFronteras[[#This Row],[Frontera]]=\"\",\"\",IFERROR(MATCH(RIGHT(TablaFronteras[[#This Row],[Frontera]],LEN(TablaFronteras[[#This Row],[Frontera]])-IFERROR(FIND(\" - \",TablaFronteras[[#This Row],[Frontera]])+2,0)),Datos[País],0),\"\"))","v":12}]
["Antigua y Barbuda",225.01960754394531,156.84716796875,0.147480309009552,8.9370079338550568E-2,{"$f":"TablaFronteras[[#This Row],[X]]+TablaFronteras[[#This Row],[Ancho]]/2","v":225.09334769845009},{"$f":"TablaFronteras[[#This Row],[Y]]+TablaFronteras[[#This Row],[Alto]]/2","v":156.89185300841928},{"$f":"IF(AND(TablaFronteras[[#This Row],[Fila]]<>\"\",TablaFronteras[[#This Row],[X]]<miX,miX<TablaFronteras[[#This Row],[X]]+TablaFronteras[[#This Row],[Ancho]],TablaFronteras[[#This Row],[Y]]<miY,miY<TablaFronteras[[#This Row],[Y]]+TablaFronteras[[#This Row],[Alto]]),SQRT((TablaFronteras[[#This Row],[Centro X]]-miX)^2+(TablaFronteras[[#This Row],[Centro Y]]-miY)^2),\"\")","v":""},{"$f":"IF(TablaFronteras[[#This Row],[Frontera]]=\"\",\"\",IFERROR(MATCH(RIGHT(TablaFronteras[[#This Row],[Frontera]],LEN(TablaFronteras[[#This Row],[Frontera]])-IFERROR(FIND(\" - \",TablaFronteras[[#This Row],[Frontera]])+2,0)),Datos[País],0),\"\"))","v":9}]
["Islas Vírgenes Británicas",221.78094482421875,155.23307800292969,1.6633858680725098,1.0143307447433472,{"$f":"TablaFronteras[[#This Row],[X]]+TablaFronteras[[#This Row],[Ancho]]/2","v":222.612637758255},{"$f":"TablaFronteras[[#This Row],[Y]]+TablaFronteras[[#This Row],[Alto]]/2","v":155.74024337530136},{"$f":"IF(AND(TablaFronteras[[#This Row],[Fila]]<>\"\",TablaFronteras[[#This Row],[X]]<miX,miX<TablaFronteras[[#This Row],[X]]+TablaFronteras[[#This Row],[Ancho]],TablaFronteras[[#This Row],[Y]]<miY,miY<TablaFronteras[[#This Row],[Y]]+TablaFronteras[[#This Row],[Alto]]),SQRT((TablaFronteras[[#This Row],[Centro X]]-miX)^2+(TablaFronteras[[#This Row],[Centro Y]]-miY)^2),\"\")","v":""},{"$f":"IF(TablaFronteras[[#This Row],[Frontera]]=\"\",\"\",IFERROR(MATCH(RIGHT(TablaFronteras[[#This Row],[Frontera]],LEN(TablaFronteras[[#This Row],[Frontera]])-IFERROR(FIND(\" - \",TablaFronteras[[#This Row],[Frontera]])+2,0)),Datos[País],0),\"\"))","v":132}]
["Islas Vírgenes de Estados Unidos",220.89614868164063,156.6104736328125,2.4066140651702881,1.1562204360961914,{"$f":"TablaFronteras[[#This Row],[X]]+TablaFronteras[[#This Row],[Ancho]]/2","v":222.09945571422577},{"$f":"TablaFronteras[[#This Row],[Y]]+TablaFronteras[[#This Row],[Alto]]/2","v":157.1885838508606},{"$f":"IF(AND(TablaFronteras[[#This Row],[Fila]]<>\"\",TablaFronteras[[#This Row],[X]]<miX,miX<TablaFronteras[[#This Row],[X]]+TablaFronteras[[#This Row],[Ancho]],TablaFronteras[[#This Row],[Y]]<miY,miY<TablaFronteras[[#This Row],[Y]]+TablaFronteras[[#This Row],[Alto]]),SQRT((TablaFronteras[[#This Row],[Centro X]]-miX)^2+(TablaFronteras[[#This Row],[Centro Y]]-miY)^2),\"\")","v":""},{"$f":"IF(TablaFronteras[[#This Row],[Frontera]]=\"\",\"\",IFERROR(MATCH(RIGHT(TablaFronteras[[#This Row],[Frontera]],LEN(TablaFronteras[[#This Row],[Frontera]])-IFERROR(FIND(\" - \",TablaFronteras[[#This Row],[Frontera]])+2,0)),Datos[País],0),\"\"))","v":133}]
["Montserrat",226.31440734863281,160.06953430175781,8.6771652102470398E-2,0.19314961135387421,{"$f":"TablaFronteras[[#This Row],[X]]+TablaFronteras[[#This Row],[Ancho]]/2","v":226.35779317468405},{"$f":"TablaFronteras[[#This Row],[Y]]+TablaFronteras[[#This Row],[Alto]]/2","v":160.16610910743475},{"$f":"IF(AND(TablaFronteras[[#This Row],[Fila]]<>\"\",TablaFronteras[[#This Row],[X]]<miX,miX<TablaFronteras[[#This Row],[X]]+TablaFronteras[[#This Row],[Ancho]],TablaFronteras[[#This Row],[Y]]<miY,miY<TablaFronteras[[#This Row],[Y]]+TablaFronteras[[#This Row],[Alto]]),SQRT((TablaFronteras[[#This Row],[Centro X]]-miX)^2+(TablaFronteras[[#This Row],[Centro Y]]-miY)^2),\"\")","v":""},{"$f":"IF(TablaFronteras[[#This Row],[Frontera]]=\"\",\"\",IFERROR(MATCH(RIGHT(TablaFronteras[[#This Row],[Frontera]],LEN(TablaFronteras[[#This Row],[Frontera]])-IFERROR(FIND(\" - \",TablaFronteras[[#This Row],[Frontera]])+2,0)),Datos[País],0),\"\"))","v":174}]
["Guadalupe",227.00117492675781,160.54551696777344,1.2813385725021362,1.4451968669891357,{"$f":"TablaFronteras[[#This Row],[X]]+TablaFronteras[[#This Row],[Ancho]]/2","v":227.64184421300888},{"$f":"TablaFronteras[[#This Row],[Y]]+TablaFronteras[[#This Row],[Alto]]/2","v":161.26811540126801},{"$f":"IF(AND(TablaFronteras[[#This Row],[Fila]]<>\"\",TablaFronteras[[#This Row],[X]]<miX,miX<TablaFronteras[[#This Row],[X]]+TablaFronteras[[#This Row],[Ancho]],TablaFronteras[[#This Row],[Y]]<miY,miY<TablaFronteras[[#This Row],[Y]]+TablaFronteras[[#This Row],[Alto]]),SQRT((TablaFronteras[[#This Row],[Centro X]]-miX)^2+(TablaFronteras[[#This Row],[Centro Y]]-miY)^2),\"\")","v":""},{"$f":"IF(TablaFronteras[[#This Row],[Frontera]]=\"\",\"\",IFERROR(MATCH(RIGHT(TablaFronteras[[#This Row],[Frontera]],LEN(TablaFronteras[[#This Row],[Frontera]])-IFERROR(FIND(\" - \",TablaFronteras[[#This Row],[Frontera]])+2,0)),Datos[País],0),\"\"))","v":91}]
["Santa Lucía",228.06268310546875,166.76921081542969,0.3990551233291626,0.61543309688568115,{"$f":"TablaFronteras[[#This Row],[X]]+TablaFronteras[[#This Row],[Ancho]]/2","v":228.26221066713333},{"$f":"TablaFronteras[[#This Row],[Y]]+TablaFronteras[[#This Row],[Alto]]/2","v":167.07692736387253},{"$f":"IF(AND(TablaFronteras[[#This Row],[Fila]]<>\"\",TablaFronteras[[#This Row],[X]]<miX,miX<TablaFronteras[[#This Row],[X]]+TablaFronteras[[#This Row],[Ancho]],TablaFronteras[[#This Row],[Y]]<miY,miY<TablaFronteras[[#This Row],[Y]]+TablaFronteras[[#This Row],[Alto]]),SQRT((TablaFronteras[[#This Row],[Centro X]]-miX)^2+(TablaFronteras[[#This Row],[Centro Y]]-miY)^2),\"\")","v":""},{"$f":"IF(TablaFronteras[[#This Row],[Frontera]]=\"\",\"\",IFERROR(MATCH(RIGHT(TablaFronteras[[#This Row],[Frontera]],LEN(TablaFronteras[[#This Row],[Frontera]])-IFERROR(FIND(\" - \",TablaFronteras[[#This Row],[Frontera]])+2,0)),Datos[País],0),\"\"))","v":229}]
["Martinica",227.98504638671875,164.37007141113281,0.70015746355056763,1.4899212121963501,{"$f":"TablaFronteras[[#This Row],[X]]+TablaFronteras[[#This Row],[Ancho]]/2","v":228.33512511849403},{"$f":"TablaFronteras[[#This Row],[Y]]+TablaFronteras[[#This Row],[Alto]]/2","v":165.11503201723099},{"$f":"IF(AND(TablaFronteras[[#This Row],[Fila]]<>\"\",TablaFronteras[[#This Row],[X]]<miX,miX<TablaFronteras[[#This Row],[X]]+TablaFronteras[[#This Row],[Ancho]],TablaFronteras[[#This Row],[Y]]<miY,miY<TablaFronteras[[#This Row],[Y]]+TablaFronteras[[#This Row],[Alto]]),SQRT((TablaFronteras[[#This Row],[Centro X]]-miX)^2+(TablaFronteras[[#This Row],[Centro Y]]-miY)^2),\"\")","v":""},{"$f":"IF(TablaFronteras[[#This Row],[Frontera]]=\"\",\"\",IFERROR(MATCH(RIGHT(TablaFronteras[[#This Row],[Frontera]],LEN(TablaFronteras[[#This Row],[Frontera]])-IFERROR(FIND(\" - \",TablaFronteras[[#This Row],[Frontera]])+2,0)),Datos[País],0),\"\"))","v":164}]
["Dominica",227.51275634765625,162.61463928222656,0.48007872700691223,1.0193700790405273,{"$f":"TablaFronteras[[#This Row],[X]]+TablaFronteras[[#This Row],[Ancho]]/2","v":227.75279571115971},{"$f":"TablaFronteras[[#This Row],[Y]]+TablaFronteras[[#This Row],[Alto]]/2","v":163.12432432174683},{"$f":"IF(AND(TablaFronteras[[#This Row],[Fila]]<>\"\",TablaFronteras[[#This Row],[X]]<miX,miX<TablaFronteras[[#This Row],[X]]+TablaFronteras[[#This Row],[Ancho]],TablaFronteras[[#This Row],[Y]]<miY,miY<TablaFronteras[[#This Row],[Y]]+TablaFronteras[[#This Row],[Alto]]),SQRT((TablaFronteras[[#This Row],[Centro X]]-miX)^2+(TablaFronteras[[#This Row],[Centro Y]]-miY)^2),\"\")","v":""},{"$f":"IF(TablaFronteras[[#This Row],[Frontera]]=\"\",\"\",IFERROR(MATCH(RIGHT(TablaFronteras[[#This Row],[Frontera]],LEN(TablaFronteras[[#This Row],[Frontera]])-IFERROR(FIND(\" - \",TablaFronteras[[#This Row],[Frontera]])+2,0)),Datos[País],0),\"\"))","v":67}]
["Barbados",231.06692504882813,168.40582275390625,0.4637008011341095,0.59960627555847168,{"$f":"TablaFronteras[[#This Row],[X]]+TablaFronteras[[#This Row],[Ancho]]/2","v":231.29877544939518},{"$f":"TablaFronteras[[#This Row],[Y]]+TablaFronteras[[#This Row],[Alto]]/2","v":168.70562589168549},{"$f":"IF(AND(TablaFronteras[[#This Row],[Fila]]<>\"\",TablaFronteras[[#This Row],[X]]<miX,miX<TablaFronteras[[#This Row],[X]]+TablaFronteras[[#This Row],[Ancho]],TablaFronteras[[#This Row],[Y]]<miY,miY<TablaFronteras[[#This Row],[Y]]+TablaFronteras[[#This Row],[Alto]]),SQRT((TablaFronteras[[#This Row],[Centro X]]-miX)^2+(TablaFronteras[[#This Row],[Centro Y]]-miY)^2),\"\")","v":""},{"$f":"IF(TablaFronteras[[#This Row],[Frontera]]=\"\",\"\",IFERROR(MATCH(RIGHT(TablaFronteras[[#This Row],[Frontera]],LEN(TablaFronteras[[#This Row],[Frontera]])-IFERROR(FIND(\" - \",TablaFronteras[[#This Row],[Frontera]])+2,0)),Datos[País],0),\"\"))","v":26}]
["San Vicente y las Granadinas",227.53929138183594,168.20622253417969,0.28740158677101135,0.61937010288238525,{"$f":"TablaFronteras[[#This Row],[X]]+TablaFronteras[[#This Row],[Ancho]]/2","v":227.68299217522144},{"$f":"TablaFronteras[[#This Row],[Y]]+TablaFronteras[[#This Row],[Alto]]/2","v":168.51590758562088},{"$f":"IF(AND(TablaFronteras[[#This Row],[Fila]]<>\"\",TablaFronteras[[#This Row],[X]]<miX,miX<TablaFronteras[[#This Row],[X]]+TablaFronteras[[#This Row],[Ancho]],TablaFronteras[[#This Row],[Y]]<miY,miY<TablaFronteras[[#This Row],[Y]]+TablaFronteras[[#This Row],[Alto]]),SQRT((TablaFronteras[[#This Row],[Centro X]]-miX)^2+(TablaFronteras[[#This Row],[Centro Y]]-miY)^2),\"\")","v":""},{"$f":"IF(TablaFronteras[[#This Row],[Frontera]]=\"\",\"\",IFERROR(MATCH(RIGHT(TablaFronteras[[#This Row],[Frontera]],LEN(TablaFronteras[[#This Row],[Frontera]])-IFERROR(FIND(\" - \",TablaFronteras[[#This Row],[Frontera]])+2,0)),Datos[País],0),\"\"))","v":227}]
["Granada",226.42039489746094,170.96417236328125,0.284645676612854,0.5599212646484375,{"$f":"TablaFronteras[[#This Row],[X]]+TablaFronteras[[#This Row],[Ancho]]/2","v":226.56271773576736},{"$f":"TablaFronteras[[#This Row],[Y]]+TablaFronteras[[#This Row],[Alto]]/2","v":171.24413299560547},{"$f":"IF(AND(TablaFronteras[[#This Row],[Fila]]<>\"\",TablaFronteras[[#This Row],[X]]<miX,miX<TablaFronteras[[#This Row],[X]]+TablaFronteras[[#This Row],[Ancho]],TablaFronteras[[#This Row],[Y]]<miY,miY<TablaFronteras[[#This Row],[Y]]+TablaFronteras[[#This Row],[Alto]]),SQRT((TablaFronteras[[#This Row],[Centro X]]-miX)^2+(TablaFronteras[[#This Row],[Centro Y]]-miY)^2),\"\")","v":""},{"$f":"IF(TablaFronteras[[#This Row],[Frontera]]=\"\",\"\",IFERROR(MATCH(RIGHT(TablaFronteras[[#This Row],[Frontera]],LEN(TablaFronteras[[#This Row],[Frontera]])-IFERROR(FIND(\" - \",TablaFronteras[[#This Row],[Frontera]])+2,0)),Datos[País],0),\"\"))","v":88}]
["Trinidad y Tobago",225.68582153320313,173.14228820800781,2.9988975524902344,3.0181889533996582,{"$f":"TablaFronteras[[#This Row],[X]]+TablaFronteras[[#This Row],[Ancho]]/2","v":227.18527030944824},{"$f":"TablaFronteras[[#This Row],[Y]]+TablaFronteras[[#This Row],[Alto]]/2","v":174.65138268470764},{"$f":"IF(AND(TablaFronteras[[#This Row],[Fila]]<>\"\",TablaFronteras[[#This Row],[X]]<miX,miX<TablaFronteras[[#This Row],[X]]+TablaFronteras[[#This Row],[Ancho]],TablaFronteras[[#This Row],[Y]]<miY,miY<TablaFronteras[[#This Row],[Y]]+TablaFronteras[[#This Row],[Alto]]),SQRT((TablaFronteras[[#This Row],[Centro X]]-miX)^2+(TablaFronteras[[#This Row],[Centro Y]]-miY)^2),\"\")","v":""},{"$f":"IF(TablaFronteras[[#This Row],[Frontera]]=\"\",\"\",IFERROR(MATCH(RIGHT(TablaFronteras[[#This Row],[Frontera]],LEN(TablaFronteras[[#This Row],[Frontera]])-IFERROR(FIND(\" - \",TablaFronteras[[#This Row],[Frontera]])+2,0)),Datos[País],0),\"\"))","v":260}]
["Aruba",209.58802795410156,170.15016174316406,0.36929133534431458,0.39448818564414978,{"$f":"TablaFronteras[[#This Row],[X]]+TablaFronteras[[#This Row],[Ancho]]/2","v":209.77267362177372},{"$f":"TablaFronteras[[#This Row],[Y]]+TablaFronteras[[#This Row],[Alto]]/2","v":170.34740583598614},{"$f":"IF(AND(TablaFronteras[[#This Row],[Fila]]<>\"\",TablaFronteras[[#This Row],[X]]<miX,miX<TablaFronteras[[#This Row],[X]]+TablaFronteras[[#This Row],[Ancho]],TablaFronteras[[#This Row],[Y]]<miY,miY<TablaFronteras[[#This Row],[Y]]+TablaFronteras[[#This Row],[Alto]]),SQRT((TablaFronteras[[#This Row],[Centro X]]-miX)^2+(TablaFronteras[[#This Row],[Centro Y]]-miY)^2),\"\")","v":""},{"$f":"IF(TablaFronteras[[#This Row],[Frontera]]=\"\",\"\",IFERROR(MATCH(RIGHT(TablaFronteras[[#This Row],[Frontera]],LEN(TablaFronteras[[#This Row],[Frontera]])-IFERROR(FIND(\" - \",TablaFronteras[[#This Row],[Frontera]])+2,0)),Datos[País],0),\"\"))","v":16}]
["Islas Caimán",188.12071228027344,153.64630126953125,0.61960631608963013,0.21897637844085693,{"$f":"TablaFronteras[[#This Row],[X]]+TablaFronteras[[#This Row],[Ancho]]/2","v":188.43051543831825},{"$f":"TablaFronteras[[#This Row],[Y]]+TablaFronteras[[#This Row],[Alto]]/2","v":153.75578945875168},{"$f":"IF(AND(TablaFronteras[[#This Row],[Fila]]<>\"\",TablaFronteras[[#This Row],[X]]<miX,miX<TablaFronteras[[#This Row],[X]]+TablaFronteras[[#This Row],[Ancho]],TablaFronteras[[#This Row],[Y]]<miY,miY<TablaFronteras[[#This Row],[Y]]+TablaFronteras[[#This Row],[Alto]]),SQRT((TablaFronteras[[#This Row],[Centro X]]-miX)^2+(TablaFronteras[[#This Row],[Centro Y]]-miY)^2),\"\")","v":""},{"$f":"IF(TablaFronteras[[#This Row],[Frontera]]=\"\",\"\",IFERROR(MATCH(RIGHT(TablaFronteras[[#This Row],[Frontera]],LEN(TablaFronteras[[#This Row],[Frontera]])-IFERROR(FIND(\" - \",TablaFronteras[[#This Row],[Frontera]])+2,0)),Datos[País],0),\"\"))","v":119}]
["Bahamas",195.9964599609375,135.50677490234375,10.257716178894043,14.368819236755371,{"$f":"TablaFronteras[[#This Row],[X]]+TablaFronteras[[#This Row],[Ancho]]/2","v":201.12531805038452},{"$f":"TablaFronteras[[#This Row],[Y]]+TablaFronteras[[#This Row],[Alto]]/2","v":142.69118452072144},{"$f":"IF(AND(TablaFronteras[[#This Row],[Fila]]<>\"\",TablaFronteras[[#This Row],[X]]<miX,miX<TablaFronteras[[#This Row],[X]]+TablaFronteras[[#This Row],[Ancho]],TablaFronteras[[#This Row],[Y]]<miY,miY<TablaFronteras[[#This Row],[Y]]+TablaFronteras[[#This Row],[Alto]]),SQRT((TablaFronteras[[#This Row],[Centro X]]-miX)^2+(TablaFronteras[[#This Row],[Centro Y]]-miY)^2),\"\")","v":""},{"$f":"IF(TablaFronteras[[#This Row],[Frontera]]=\"\",\"\",IFERROR(MATCH(RIGHT(TablaFronteras[[#This Row],[Frontera]],LEN(TablaFronteras[[#This Row],[Frontera]])-IFERROR(FIND(\" - \",TablaFronteras[[#This Row],[Frontera]])+2,0)),Datos[País],0),\"\"))","v":24}]
["Islas Turcas y Caicos",207.06512451171875,147.7041015625,1.8811811208724976,0.40362206101417542,{"$f":"TablaFronteras[[#This Row],[X]]+TablaFronteras[[#This Row],[Ancho]]/2","v":208.005715072155},{"$f":"TablaFronteras[[#This Row],[Y]]+TablaFronteras[[#This Row],[Alto]]/2","v":147.90591259300709},{"$f":"IF(AND(TablaFronteras[[#This Row],[Fila]]<>\"\",TablaFronteras[[#This Row],[X]]<miX,miX<TablaFronteras[[#This Row],[X]]+TablaFronteras[[#This Row],[Ancho]],TablaFronteras[[#This Row],[Y]]<miY,miY<TablaFronteras[[#This Row],[Y]]+TablaFronteras[[#This Row],[Alto]]),SQRT((TablaFronteras[[#This Row],[Centro X]]-miX)^2+(TablaFronteras[[#This Row],[Centro Y]]-miY)^2),\"\")","v":""},{"$f":"IF(TablaFronteras[[#This Row],[Frontera]]=\"\",\"\",IFERROR(MATCH(RIGHT(TablaFronteras[[#This Row],[Frontera]],LEN(TablaFronteras[[#This Row],[Frontera]])-IFERROR(FIND(\" - \",TablaFronteras[[#This Row],[Frontera]])+2,0)),Datos[País],0),\"\"))","v":131}]
["Haití",201.548583984375,152.0496826171875,7.3970866203308105,4.8582677841186523,{"$f":"TablaFronteras[[#This Row],[X]]+TablaFronteras[[#This Row],[Ancho]]/2","v":205.24712729454041},{"$f":"TablaFronteras[[#This Row],[Y]]+TablaFronteras[[#This Row],[Alto]]/2","v":154.47881650924683},{"$f":"IF(AND(TablaFronteras[[#This Row],[Fila]]<>\"\",TablaFronteras[[#This Row],[X]]<miX,miX<TablaFronteras[[#This Row],[X]]+TablaFronteras[[#This Row],[Ancho]],TablaFronteras[[#This Row],[Y]]<miY,miY<TablaFronteras[[#This Row],[Y]]+TablaFronteras[[#This Row],[Alto]]),SQRT((TablaFronteras[[#This Row],[Centro X]]-miX)^2+(TablaFronteras[[#This Row],[Centro Y]]-miY)^2),\"\")","v":""},{"$f":"IF(TablaFronteras[[#This Row],[Frontera]]=\"\",\"\",IFERROR(MATCH(RIGHT(TablaFronteras[[#This Row],[Frontera]],LEN(TablaFronteras[[#This Row],[Frontera]])-IFERROR(FIND(\" - \",TablaFronteras[[#This Row],[Frontera]])+2,0)),Datos[País],0),\"\"))","v":100}]
["Santo Tomé y Príncipe",367.89749145507813,196.80661010742188,2.0002362728118896,3.7511811256408691,{"$f":"TablaFronteras[[#This Row],[X]]+TablaFronteras[[#This Row],[Ancho]]/2","v":368.89760959148407},{"$f":"TablaFronteras[[#This Row],[Y]]+TablaFronteras[[#This Row],[Alto]]/2","v":198.68220067024231},{"$f":"IF(AND(TablaFronteras[[#This Row],[Fila]]<>\"\",TablaFronteras[[#This Row],[X]]<miX,miX<TablaFronteras[[#This Row],[X]]+TablaFronteras[[#This Row],[Ancho]],TablaFronteras[[#This Row],[Y]]<miY,miY<TablaFronteras[[#This Row],[Y]]+TablaFronteras[[#This Row],[Alto]]),SQRT((TablaFronteras[[#This Row],[Centro X]]-miX)^2+(TablaFronteras[[#This Row],[Centro Y]]-miY)^2),\"\")","v":""},{"$f":"IF(TablaFronteras[[#This Row],[Frontera]]=\"\",\"\",IFERROR(MATCH(RIGHT(TablaFronteras[[#This Row],[Frontera]],LEN(TablaFronteras[[#This Row],[Frontera]])-IFERROR(FIND(\" - \",TablaFronteras[[#This Row],[Frontera]])+2,0)),Datos[País],0),\"\"))","v":230}]
["Cabo Verde",302.0809326171875,158.92622375488281,6.7355117797851563,5.6478738784790039,{"$f":"TablaFronteras[[#This Row],[X]]+TablaFronteras[[#This Row],[Ancho]]/2","v":305.44868850708008},{"$f":"TablaFronteras[[#This Row],[Y]]+TablaFronteras[[#This Row],[Alto]]/2","v":161.75016069412231},{"$f":"IF(AND(TablaFronteras[[#This Row],[Fila]]<>\"\",TablaFronteras[[#This Row],[X]]<miX,miX<TablaFronteras[[#This Row],[X]]+TablaFronteras[[#This Row],[Ancho]],TablaFronteras[[#This Row],[Y]]<miY,miY<TablaFronteras[[#This Row],[Y]]+TablaFronteras[[#This Row],[Alto]]),SQRT((TablaFronteras[[#This Row],[Centro X]]-miX)^2+(TablaFronteras[[#This Row],[Centro Y]]-miY)^2),\"\")","v":""},{"$f":"IF(TablaFronteras[[#This Row],[Frontera]]=\"\",\"\",IFERROR(MATCH(RIGHT(TablaFronteras[[#This Row],[Frontera]],LEN(TablaFronteras[[#This Row],[Frontera]])-IFERROR(FIND(\" - \",TablaFronteras[[#This Row],[Frontera]])+2,0)),Datos[País],0),\"\"))","v":44}]
["Malta",383.35574340820313,113.5146484375,0.45125985145568848,0.45944881439208984,{"$f":"TablaFronteras[[#This Row],[X]]+TablaFronteras[[#This Row],[Ancho]]/2","v":383.58137333393097},{"$f":"TablaFronteras[[#This Row],[Y]]+TablaFronteras[[#This Row],[Alto]]/2","v":113.74437284469604},{"$f":"IF(AND(TablaFronteras[[#This Row],[Fila]]<>\"\",TablaFronteras[[#This Row],[X]]<miX,miX<TablaFronteras[[#This Row],[X]]+TablaFronteras[[#This Row],[Ancho]],TablaFronteras[[#This Row],[Y]]<miY,miY<TablaFronteras[[#This Row],[Y]]+TablaFronteras[[#This Row],[Alto]]),SQRT((TablaFronteras[[#This Row],[Centro X]]-miX)^2+(TablaFronteras[[#This Row],[Centro Y]]-miY)^2),\"\")","v":""},{"$f":"IF(TablaFronteras[[#This Row],[Frontera]]=\"\",\"\",IFERROR(MATCH(RIGHT(TablaFronteras[[#This Row],[Frontera]],LEN(TablaFronteras[[#This Row],[Frontera]])-IFERROR(FIND(\" - \",TablaFronteras[[#This Row],[Frontera]])+2,0)),Datos[País],0),\"\"))","v":161}]
["Chipre",418.59307861328125,114.26409149169922,3.3029921054840088,2.5845668315887451,{"$f":"TablaFronteras[[#This Row],[X]]+TablaFronteras[[#This Row],[Ancho]]/2","v":420.24457466602325},{"$f":"TablaFronteras[[#This Row],[Y]]+TablaFronteras[[#This Row],[Alto]]/2","v":115.55637490749359},{"$f":"IF(AND(TablaFronteras[[#This Row],[Fila]]<>\"\",TablaFronteras[[#This Row],[X]]<miX,miX<TablaFronteras[[#This Row],[X]]+TablaFronteras[[#This Row],[Ancho]],TablaFronteras[[#This Row],[Y]]<miY,miY<TablaFronteras[[#This Row],[Y]]+TablaFronteras[[#This Row],[Alto]]),SQRT((TablaFronteras[[#This Row],[Centro X]]-miX)^2+(TablaFronteras[[#This Row],[Centro Y]]-miY)^2),\"\")","v":""},{"$f":"IF(TablaFronteras[[#This Row],[Frontera]]=\"\",\"\",IFERROR(MATCH(RIGHT(TablaFronteras[[#This Row],[Frontera]],LEN(TablaFronteras[[#This Row],[Frontera]])-IFERROR(FIND(\" - \",TablaFronteras[[#This Row],[Frontera]])+2,0)),Datos[País],0),\"\"))","v":54}]
["Islas del Pacífico - Estados Unidos",660.64837646484375,49.581653594970703,32.254566192626953,27.713306427001953,{"$f":"TablaFronteras[[#This Row],[X]]+TablaFronteras[[#This Row],[Ancho]]/2","v":676.77565956115723},{"$f":"TablaFronteras[[#This Row],[Y]]+TablaFronteras[[#This Row],[Alto]]/2","v":63.43830680847168},{"$f":"IF(AND(TablaFronteras[[#This Row],[Fila]]<>\"\",TablaFronteras[[#This Row],[X]]<miX,miX<TablaFronteras[[#This Row],[X]]+TablaFronteras[[#This Row],[Ancho]],TablaFronteras[[#This Row],[Y]]<miY,miY<TablaFronteras[[#This Row],[Y]]+TablaFronteras[[#This Row],[Alto]]),SQRT((TablaFronteras[[#This Row],[Centro X]]-miX)^2+(TablaFronteras[[#This Row],[Centro Y]]-miY)^2),\"\")","v":""},{"$f":"IF(TablaFronteras[[#This Row],[Frontera]]=\"\",\"\",IFERROR(MATCH(RIGHT(TablaFronteras[[#This Row],[Frontera]],LEN(TablaFronteras[[#This Row],[Frontera]])-IFERROR(FIND(\" - \",TablaFronteras[[#This Row],[Frontera]])+2,0)),Datos[País],0),\"\"))","v":76}]
["Isla Diomedes - Rusia",93.872520446777344,44.74456787109375,0.52472442388534546,0.29677164554595947,{"$f":"TablaFronteras[[#This Row],[X]]+TablaFronteras[[#This Row],[Ancho]]/2","v":94.134882658720016},{"$f":"TablaFronteras[[#This Row],[Y]]+TablaFronteras[[#This Row],[Alto]]/2","v":44.89295369386673},{"$f":"IF(AND(TablaFronteras[[#This Row],[Fila]]<>\"\",TablaFronteras[[#This Row],[X]]<miX,miX<TablaFronteras[[#This Row],[X]]+TablaFronteras[[#This Row],[Ancho]],TablaFronteras[[#This Row],[Y]]<miY,miY<TablaFronteras[[#This Row],[Y]]+TablaFronteras[[#This Row],[Alto]]),SQRT((TablaFronteras[[#This Row],[Centro X]]-miX)^2+(TablaFronteras[[#This Row],[Centro Y]]-miY)^2),\"\")","v":""},{"$f":"IF(TablaFronteras[[#This Row],[Frontera]]=\"\",\"\",IFERROR(MATCH(RIGHT(TablaFronteras[[#This Row],[Frontera]],LEN(TablaFronteras[[#This Row],[Frontera]])-IFERROR(FIND(\" - \",TablaFronteras[[#This Row],[Frontera]])+2,0)),Datos[País],0),\"\"))","v":216}]
["Islas Feroe",346.91812133789063,52.424095153808594,1.2634645700454712,2.0988187789916992,{"$f":"TablaFronteras[[#This Row],[X]]+TablaFronteras[[#This Row],[Ancho]]/2","v":347.54985362291336},{"$f":"TablaFronteras[[#This Row],[Y]]+TablaFronteras[[#This Row],[Alto]]/2","v":53.473504543304443},{"$f":"IF(AND(TablaFronteras[[#This Row],[Fila]]<>\"\",TablaFronteras[[#This Row],[X]]<miX,miX<TablaFronteras[[#This Row],[X]]+TablaFronteras[[#This Row],[Ancho]],TablaFronteras[[#This Row],[Y]]<miY,miY<TablaFronteras[[#This Row],[Y]]+TablaFronteras[[#This Row],[Alto]]),SQRT((TablaFronteras[[#This Row],[Centro X]]-miX)^2+(TablaFronteras[[#This Row],[Centro Y]]-miY)^2),\"\")","v":""},{"$f":"IF(TablaFronteras[[#This Row],[Frontera]]=\"\",\"\",IFERROR(MATCH(RIGHT(TablaFronteras[[#This Row],[Frontera]],LEN(TablaFronteras[[#This Row],[Frontera]])-IFERROR(FIND(\" - \",TablaFronteras[[#This Row],[Frontera]])+2,0)),Datos[País],0),\"\"))","v":122}]
["Nueva Caledonia",681.44268798828125,247.0303955078125,15.388267517089844,8.5398426055908203,{"$f":"TablaFronteras[[#This Row],[X]]+TablaFronteras[[#This Row],[Ancho]]/2","v":689.13682174682617},{"$f":"TablaFronteras[[#This Row],[Y]]+TablaFronteras[[#This Row],[Alto]]/2","v":251.30031681060791},{"$f":"IF(AND(TablaFronteras[[#This Row],[Fila]]<>\"\",TablaFronteras[[#This Row],[X]]<miX,miX<TablaFronteras[[#This Row],[X]]+TablaFronteras[[#This Row],[Ancho]],TablaFronteras[[#This Row],[Y]]<miY,miY<TablaFronteras[[#This Row],[Y]]+TablaFronteras[[#This Row],[Alto]]),SQRT((TablaFronteras[[#This Row],[Centro X]]-miX)^2+(TablaFronteras[[#This Row],[Centro Y]]-miY)^2),\"\")","v":""},{"$f":"IF(TablaFronteras[[#This Row],[Frontera]]=\"\",\"\",IFERROR(MATCH(RIGHT(TablaFronteras[[#This Row],[Frontera]],LEN(TablaFronteras[[#This Row],[Frontera]])-IFERROR(FIND(\" - \",TablaFronteras[[#This Row],[Frontera]])+2,0)),Datos[País],0),\"\"))","v":185}]
["Vanuatu",696.98370361328125,233.70094299316406,4.2201576232910156,15.835905075073242,{"$f":"TablaFronteras[[#This Row],[X]]+TablaFronteras[[#This Row],[Ancho]]/2","v":699.09378242492676},{"$f":"TablaFronteras[[#This Row],[Y]]+TablaFronteras[[#This Row],[Alto]]/2","v":241.61889553070068},{"$f":"IF(AND(TablaFronteras[[#This Row],[Fila]]<>\"\",TablaFronteras[[#This Row],[X]]<miX,miX<TablaFronteras[[#This Row],[X]]+TablaFronteras[[#This Row],[Ancho]],TablaFronteras[[#This Row],[Y]]<miY,miY<TablaFronteras[[#This Row],[Y]]+TablaFronteras[[#This Row],[Alto]]),SQRT((TablaFronteras[[#This Row],[Centro X]]-miX)^2+(TablaFronteras[[#This Row],[Centro Y]]-miY)^2),\"\")","v":""},{"$f":"IF(TablaFronteras[[#This Row],[Frontera]]=\"\",\"\",IFERROR(MATCH(RIGHT(TablaFronteras[[#This Row],[Frontera]],LEN(TablaFronteras[[#This Row],[Frontera]])-IFERROR(FIND(\" - \",TablaFronteras[[#This Row],[Frontera]])+2,0)),Datos[País],0),\"\"))","v":269}]
["Fiyi",718.1531982421875,239.64889526367188,6.2354331016540527,7.3585038185119629,{"$f":"TablaFronteras[[#This Row],[X]]+TablaFronteras[[#This Row],[Ancho]]/2","v":721.27091479301453},{"$f":"TablaFronteras[[#This Row],[Y]]+TablaFronteras[[#This Row],[Alto]]/2","v":243.32814717292786},{"$f":"IF(AND(TablaFronteras[[#This Row],[Fila]]<>\"\",TablaFronteras[[#This Row],[X]]<miX,miX<TablaFronteras[[#This Row],[X]]+TablaFronteras[[#This Row],[Ancho]],TablaFronteras[[#This Row],[Y]]<miY,miY<TablaFronteras[[#This Row],[Y]]+TablaFronteras[[#This Row],[Alto]]),SQRT((TablaFronteras[[#This Row],[Centro X]]-miX)^2+(TablaFronteras[[#This Row],[Centro Y]]-miY)^2),\"\")","v":""},{"$f":"IF(TablaFronteras[[#This Row],[Frontera]]=\"\",\"\",IFERROR(MATCH(RIGHT(TablaFronteras[[#This Row],[Frontera]],LEN(TablaFronteras[[#This Row],[Frontera]])-IFERROR(FIND(\" - \",TablaFronteras[[#This Row],[Frontera]])+2,0)),Datos[País],0),\"\"))","v":81}]
["Tonga",730.9012451171875,245.58992004394531,4.820472240447998,7.0730710029602051,{"$f":"TablaFronteras[[#This Row],[X]]+TablaFronteras[[#This Row],[Ancho]]/2","v":733.3114812374115},{"$f":"TablaFronteras[[#This Row],[Y]]+TablaFronteras[[#This Row],[Alto]]/2","v":249.12645554542542},{"$f":"IF(AND(TablaFronteras[[#This Row],[Fila]]<>\"\",TablaFronteras[[#This Row],[X]]<miX,miX<TablaFronteras[[#This Row],[X]]+TablaFronteras[[#This Row],[Ancho]],TablaFronteras[[#This Row],[Y]]<miY,miY<TablaFronteras[[#This Row],[Y]]+TablaFronteras[[#This Row],[Alto]]),SQRT((TablaFronteras[[#This Row],[Centro X]]-miX)^2+(TablaFronteras[[#This Row],[Centro Y]]-miY)^2),\"\")","v":""},{"$f":"IF(TablaFronteras[[#This Row],[Frontera]]=\"\",\"\",IFERROR(MATCH(RIGHT(TablaFronteras[[#This Row],[Frontera]],LEN(TablaFronteras[[#This Row],[Frontera]])-IFERROR(FIND(\" - \",TablaFronteras[[#This Row],[Frontera]])+2,0)),Datos[País],0),\"\"))","v":258}]
["Timor Oriental",611.0870361328125,220.68118286132813,7.2852754592895508,3.1472439765930176,{"$f":"TablaFronteras[[#This Row],[X]]+TablaFronteras[[#This Row],[Ancho]]/2","v":614.72967386245728},{"$f":"TablaFronteras[[#This Row],[Y]]+TablaFronteras[[#This Row],[Alto]]/2","v":222.25480484962463},{"$f":"IF(AND(TablaFronteras[[#This Row],[Fila]]<>\"\",TablaFronteras[[#This Row],[X]]<miX,miX<TablaFronteras[[#This Row],[X]]+TablaFronteras[[#This Row],[Ancho]],TablaFronteras[[#This Row],[Y]]<miY,miY<TablaFronteras[[#This Row],[Y]]+TablaFronteras[[#This Row],[Alto]]),SQRT((TablaFronteras[[#This Row],[Centro X]]-miX)^2+(TablaFronteras[[#This Row],[Centro Y]]-miY)^2),\"\")","v":""},{"$f":"IF(TablaFronteras[[#This Row],[Frontera]]=\"\",\"\",IFERROR(MATCH(RIGHT(TablaFronteras[[#This Row],[Frontera]],LEN(TablaFronteras[[#This Row],[Frontera]])-IFERROR(FIND(\" - \",TablaFronteras[[#This Row],[Frontera]])+2,0)),Datos[País],0),\"\"))","v":255}]
["Líbano",424.4041748046875,116.65953063964844,2.551417350769043,3.7598426342010498,{"$f":"TablaFronteras[[#This Row],[X]]+TablaFronteras[[#This Row],[Ancho]]/2","v":425.67988348007202},{"$f":"TablaFronteras[[#This Row],[Y]]+TablaFronteras[[#This Row],[Alto]]/2","v":118.53945195674896},{"$f":"IF(AND(TablaFronteras[[#This Row],[Fila]]<>\"\",TablaFronteras[[#This Row],[X]]<miX,miX<TablaFronteras[[#This Row],[X]]+TablaFronteras[[#This Row],[Ancho]],TablaFronteras[[#This Row],[Y]]<miY,miY<TablaFronteras[[#This Row],[Y]]+TablaFronteras[[#This Row],[Alto]]),SQRT((TablaFronteras[[#This Row],[Centro X]]-miX)^2+(TablaFronteras[[#This Row],[Centro Y]]-miY)^2),\"\")","v":""},{"$f":"IF(TablaFronteras[[#This Row],[Frontera]]=\"\",\"\",IFERROR(MATCH(RIGHT(TablaFronteras[[#This Row],[Frontera]],LEN(TablaFronteras[[#This Row],[Frontera]])-IFERROR(FIND(\" - \",TablaFronteras[[#This Row],[Frontera]])+2,0)),Datos[País],0),\"\"))","v":154}]
["Palestina",421.97369384765625,121.92078399658203,3.0729134082794189,3.1873228549957275,{"$f":"TablaFronteras[[#This Row],[X]]+TablaFronteras[[#This Row],[Ancho]]/2","v":423.51015055179596},{"$f":"TablaFronteras[[#This Row],[Y]]+TablaFronteras[[#This Row],[Alto]]/2","v":123.5144454240799},{"$f":"IF(AND(TablaFronteras[[#This Row],[Fila]]<>\"\",TablaFronteras[[#This Row],[X]]<miX,miX<TablaFronteras[[#This Row],[X]]+TablaFronteras[[#This Row],[Ancho]],TablaFronteras[[#This Row],[Y]]<miY,miY<TablaFronteras[[#This Row],[Y]]+TablaFronteras[[#This Row],[Alto]]),SQRT((TablaFronteras[[#This Row],[Centro X]]-miX)^2+(TablaFronteras[[#This Row],[Centro Y]]-miY)^2),\"\")","v":""},{"$f":"IF(TablaFronteras[[#This Row],[Frontera]]=\"\",\"\",IFERROR(MATCH(RIGHT(TablaFronteras[[#This Row],[Frontera]],LEN(TablaFronteras[[#This Row],[Frontera]])-IFERROR(FIND(\" - \",TablaFronteras[[#This Row],[Frontera]])+2,0)),Datos[País],0),\"\"))","v":192}]
["Islas Malvinas",248.12716674804688,323.79135131835938,5.7430710792541504,2.6605510711669922,{"$f":"TablaFronteras[[#This Row],[X]]+TablaFronteras[[#This Row],[Ancho]]/2","v":250.99870228767395},{"$f":"TablaFronteras[[#This Row],[Y]]+TablaFronteras[[#This Row],[Alto]]/2","v":325.12162685394287},{"$f":"IF(AND(TablaFronteras[[#This Row],[Fila]]<>\"\",TablaFronteras[[#This Row],[X]]<miX,miX<TablaFronteras[[#This Row],[X]]+TablaFronteras[[#This Row],[Ancho]],TablaFronteras[[#This Row],[Y]]<miY,miY<TablaFronteras[[#This Row],[Y]]+TablaFronteras[[#This Row],[Alto]]),SQRT((TablaFronteras[[#This Row],[Centro X]]-miX)^2+(TablaFronteras[[#This Row],[Centro Y]]-miY)^2),\"\")","v":""},{"$f":"IF(TablaFronteras[[#This Row],[Frontera]]=\"\",\"\",IFERROR(MATCH(RIGHT(TablaFronteras[[#This Row],[Frontera]],LEN(TablaFronteras[[#This Row],[Frontera]])-IFERROR(FIND(\" - \",TablaFronteras[[#This Row],[Frontera]])+2,0)),Datos[País],0),\"\"))","v":124}]
["Gambia",319.89614868164063,167.0037841796875,5.5637006759643555,1.9170079231262207,{"$f":"TablaFronteras[[#This Row],[X]]+TablaFronteras[[#This Row],[Ancho]]/2","v":322.6779990196228},{"$f":"TablaFronteras[[#This Row],[Y]]+TablaFronteras[[#This Row],[Alto]]/2","v":167.96228814125061},{"$f":"IF(AND(TablaFronteras[[#This Row],[Fila]]<>\"\",TablaFronteras[[#This Row],[X]]<miX,miX<TablaFronteras[[#This Row],[X]]+TablaFronteras[[#This Row],[Ancho]],TablaFronteras[[#This Row],[Y]]<miY,miY<TablaFronteras[[#This Row],[Y]]+TablaFronteras[[#This Row],[Alto]]),SQRT((TablaFronteras[[#This Row],[Centro X]]-miX)^2+(TablaFronteras[[#This Row],[Centro Y]]-miY)^2),\"\")","v":""},{"$f":"IF(TablaFronteras[[#This Row],[Frontera]]=\"\",\"\",IFERROR(MATCH(RIGHT(TablaFronteras[[#This Row],[Frontera]],LEN(TablaFronteras[[#This Row],[Frontera]])-IFERROR(FIND(\" - \",TablaFronteras[[#This Row],[Frontera]])+2,0)),Datos[País],0),\"\"))","v":84}]
["Luxemburgo",367.521484375,79.918502807617188,1.3848031759262085,1.6703149080276489,{"$f":"TablaFronteras[[#This Row],[X]]+TablaFronteras[[#This Row],[Ancho]]/2","v":368.2138859629631},{"$f":"TablaFronteras[[#This Row],[Y]]+TablaFronteras[[#This Row],[Alto]]/2","v":80.753660261631012},{"$f":"IF(AND(TablaFronteras[[#This Row],[Fila]]<>\"\",TablaFronteras[[#This Row],[X]]<miX,miX<TablaFronteras[[#This Row],[X]]+TablaFronteras[[#This Row],[Ancho]],TablaFronteras[[#This Row],[Y]]<miY,miY<TablaFronteras[[#This Row],[Y]]+TablaFronteras[[#This Row],[Alto]]),SQRT((TablaFronteras[[#This Row],[Centro X]]-miX)^2+(TablaFronteras[[#This Row],[Centro Y]]-miY)^2),\"\")","v":""},{"$f":"IF(TablaFronteras[[#This Row],[Frontera]]=\"\",\"\",IFERROR(MATCH(RIGHT(TablaFronteras[[#This Row],[Frontera]],LEN(TablaFronteras[[#This Row],[Frontera]])-IFERROR(FIND(\" - \",TablaFronteras[[#This Row],[Frontera]])+2,0)),Datos[País],0),\"\"))","v":153}]
["Andorra",358.7071533203125,97.58685302734375,0.69118112325668335,0.4897637665271759,{"$f":"TablaFronteras[[#This Row],[X]]+TablaFronteras[[#This Row],[Ancho]]/2","v":359.05274388194084},{"$f":"TablaFronteras[[#This Row],[Y]]+TablaFronteras[[#This Row],[Alto]]/2","v":97.831734910607338},{"$f":"IF(AND(TablaFronteras[[#This Row],[Fila]]<>\"\",TablaFronteras[[#This Row],[X]]<miX,miX<TablaFronteras[[#This Row],[X]]+TablaFronteras[[#This Row],[Ancho]],TablaFronteras[[#This Row],[Y]]<miY,miY<TablaFronteras[[#This Row],[Y]]+TablaFronteras[[#This Row],[Alto]]),SQRT((TablaFronteras[[#This Row],[Centro X]]-miX)^2+(TablaFronteras[[#This Row],[Centro Y]]-miY)^2),\"\")","v":""},{"$f":"IF(TablaFronteras[[#This Row],[Frontera]]=\"\",\"\",IFERROR(MATCH(RIGHT(TablaFronteras[[#This Row],[Frontera]],LEN(TablaFronteras[[#This Row],[Frontera]])-IFERROR(FIND(\" - \",TablaFronteras[[#This Row],[Frontera]])+2,0)),Datos[País],0),\"\"))","v":6}]
["Liechtenstein",373.54693603515625,86.637008666992188,0.24834646284580231,0.51015746593475342,{"$f":"TablaFronteras[[#This Row],[X]]+TablaFronteras[[#This Row],[Ancho]]/2","v":373.67110926657915},{"$f":"TablaFronteras[[#This Row],[Y]]+TablaFronteras[[#This Row],[Alto]]/2","v":86.892087399959564},{"$f":"IF(AND(TablaFronteras[[#This Row],[Fila]]<>\"\",TablaFronteras[[#This Row],[X]]<miX,miX<TablaFronteras[[#This Row],[X]]+TablaFronteras[[#This Row],[Ancho]],TablaFronteras[[#This Row],[Y]]<miY,miY<TablaFronteras[[#This Row],[Y]]+TablaFronteras[[#This Row],[Alto]]),SQRT((TablaFronteras[[#This Row],[Centro X]]-miX)^2+(TablaFronteras[[#This Row],[Centro Y]]-miY)^2),\"\")","v":""},{"$f":"IF(TablaFronteras[[#This Row],[Frontera]]=\"\",\"\",IFERROR(MATCH(RIGHT(TablaFronteras[[#This Row],[Frontera]],LEN(TablaFronteras[[#This Row],[Frontera]])-IFERROR(FIND(\" - \",TablaFronteras[[#This Row],[Frontera]])+2,0)),Datos[País],0),\"\"))","v":151}]
["San Marino",379.10400390625,94.768974304199219,0.31921258568763733,0.31393700838088989,{"$f":"TablaFronteras[[#This Row],[X]]+TablaFronteras[[#This Row],[Ancho]]/2","v":379.26361019909382},{"$f":"TablaFronteras[[#This Row],[Y]]+TablaFronteras[[#This Row],[Alto]]/2","v":94.925942808389664},{"$f":"IF(AND(TablaFronteras[[#This Row],[Fila]]<>\"\",TablaFronteras[[#This Row],[X]]<miX,miX<TablaFronteras[[#This Row],[X]]+TablaFronteras[[#This Row],[Ancho]],TablaFronteras[[#This Row],[Y]]<miY,miY<TablaFronteras[[#This Row],[Y]]+TablaFronteras[[#This Row],[Alto]]),SQRT((TablaFronteras[[#This Row],[Centro X]]-miX)^2+(TablaFronteras[[#This Row],[Centro Y]]-miY)^2),\"\")","v":""},{"$f":"IF(TablaFronteras[[#This Row],[Frontera]]=\"\",\"\",IFERROR(MATCH(RIGHT(TablaFronteras[[#This Row],[Frontera]],LEN(TablaFronteras[[#This Row],[Frontera]])-IFERROR(FIND(\" - \",TablaFronteras[[#This Row],[Frontera]])+2,0)),Datos[País],0),\"\"))","v":223}]
["Gibraltar",345.16433715820313,113.20149230957031,0.19708661735057831,0.18488189578056335,{"$f":"TablaFronteras[[#This Row],[X]]+TablaFronteras[[#This Row],[Ancho]]/2","v":345.26288046687841},{"$f":"TablaFronteras[[#This Row],[Y]]+TablaFronteras[[#This Row],[Alto]]/2","v":113.29393325746059},{"$f":"IF(AND(TablaFronteras[[#This Row],[Fila]]<>\"\",TablaFronteras[[#This Row],[X]]<miX,miX<TablaFronteras[[#This Row],[X]]+TablaFronteras[[#This Row],[Ancho]],TablaFronteras[[#This Row],[Y]]<miY,miY<TablaFronteras[[#This Row],[Y]]+TablaFronteras[[#This Row],[Alto]]),SQRT((TablaFronteras[[#This Row],[Centro X]]-miX)^2+(TablaFronteras[[#This Row],[Centro Y]]-miY)^2),\"\")","v":""},{"$f":"IF(TablaFronteras[[#This Row],[Frontera]]=\"\",\"\",IFERROR(MATCH(RIGHT(TablaFronteras[[#This Row],[Frontera]],LEN(TablaFronteras[[#This Row],[Frontera]])-IFERROR(FIND(\" - \",TablaFronteras[[#This Row],[Frontera]])+2,0)),Datos[País],0),\"\"))","v":87}]
["Mónaco",370.33401489257813,94.892837524414063,0.13669291138648987,0.12874016165733337,{"$f":"TablaFronteras[[#This Row],[X]]+TablaFronteras[[#This Row],[Ancho]]/2","v":370.40236134827137},{"$f":"TablaFronteras[[#This Row],[Y]]+TablaFronteras[[#This Row],[Alto]]/2","v":94.957207605242729},{"$f":"IF(AND(TablaFronteras[[#This Row],[Fila]]<>\"\",TablaFronteras[[#This Row],[X]]<miX,miX<TablaFronteras[[#This Row],[X]]+TablaFronteras[[#This Row],[Ancho]],TablaFronteras[[#This Row],[Y]]<miY,miY<TablaFronteras[[#This Row],[Y]]+TablaFronteras[[#This Row],[Alto]]),SQRT((TablaFronteras[[#This Row],[Centro X]]-miX)^2+(TablaFronteras[[#This Row],[Centro Y]]-miY)^2),\"\")","v":""},{"$f":"IF(TablaFronteras[[#This Row],[Frontera]]=\"\",\"\",IFERROR(MATCH(RIGHT(TablaFronteras[[#This Row],[Frontera]],LEN(TablaFronteras[[#This Row],[Frontera]])-IFERROR(FIND(\" - \",TablaFronteras[[#This Row],[Frontera]])+2,0)),Datos[País],0),\"\"))","v":177}]
["Ciudad del Vaticano",379.38992309570313,99.71905517578125,5.8267716318368912E-2,3.8818895816802979E-2,{"$f":"TablaFronteras[[#This Row],[X]]+TablaFronteras[[#This Row],[Ancho]]/2","v":379.41905695386231},{"$f":"TablaFronteras[[#This Row],[Y]]+TablaFronteras[[#This Row],[Alto]]/2","v":99.738464623689651},{"$f":"IF(AND(TablaFronteras[[#This Row],[Fila]]<>\"\",TablaFronteras[[#This Row],[X]]<miX,miX<TablaFronteras[[#This Row],[X]]+TablaFronteras[[#This Row],[Ancho]],TablaFronteras[[#This Row],[Y]]<miY,miY<TablaFronteras[[#This Row],[Y]]+TablaFronteras[[#This Row],[Alto]]),SQRT((TablaFronteras[[#This Row],[Centro X]]-miX)^2+(TablaFronteras[[#This Row],[Centro Y]]-miY)^2),\"\")","v":""},{"$f":"IF(TablaFronteras[[#This Row],[Frontera]]=\"\",\"\",IFERROR(MATCH(RIGHT(TablaFronteras[[#This Row],[Frontera]],LEN(TablaFronteras[[#This Row],[Frontera]])-IFERROR(FIND(\" - \",TablaFronteras[[#This Row],[Frontera]])+2,0)),Datos[País],0),\"\"))","v":56}]
["Kuwait",446.9991455078125,127.83126068115234,4.6675591468811035,3.7689764499664307,{"$f":"TablaFronteras[[#This Row],[X]]+TablaFronteras[[#This Row],[Ancho]]/2","v":449.33292508125305},{"$f":"TablaFronteras[[#This Row],[Y]]+TablaFronteras[[#This Row],[Alto]]/2","v":129.71574890613556},{"$f":"IF(AND(TablaFronteras[[#This Row],[Fila]]<>\"\",TablaFronteras[[#This Row],[X]]<miX,miX<TablaFronteras[[#This Row],[X]]+TablaFronteras[[#This Row],[Ancho]],TablaFronteras[[#This Row],[Y]]<miY,miY<TablaFronteras[[#This Row],[Y]]+TablaFronteras[[#This Row],[Alto]]),SQRT((TablaFronteras[[#This Row],[Centro X]]-miX)^2+(TablaFronteras[[#This Row],[Centro Y]]-miY)^2),\"\")","v":""},{"$f":"IF(TablaFronteras[[#This Row],[Frontera]]=\"\",\"\",IFERROR(MATCH(RIGHT(TablaFronteras[[#This Row],[Frontera]],LEN(TablaFronteras[[#This Row],[Frontera]])-IFERROR(FIND(\" - \",TablaFronteras[[#This Row],[Frontera]])+2,0)),Datos[País],0),\"\"))","v":145}]
["San Cristóbal y Nieves",227.06527709960938,157.76921081542969,0.38259842991828918,1.6570866107940674,{"$f":"TablaFronteras[[#This Row],[X]]+TablaFronteras[[#This Row],[Ancho]]/2","v":227.25657631456852},{"$f":"TablaFronteras[[#This Row],[Y]]+TablaFronteras[[#This Row],[Alto]]/2","v":158.59775412082672},{"$f":"IF(AND(TablaFronteras[[#This Row],[Fila]]<>\"\",TablaFronteras[[#This Row],[X]]<miX,miX<TablaFronteras[[#This Row],[X]]+TablaFronteras[[#This Row],[Ancho]],TablaFronteras[[#This Row],[Y]]<miY,miY<TablaFronteras[[#This Row],[Y]]+TablaFronteras[[#This Row],[Alto]]),SQRT((TablaFronteras[[#This Row],[Centro X]]-miX)^2+(TablaFronteras[[#This Row],[Centro Y]]-miY)^2),\"\")","v":""},{"$f":"IF(TablaFronteras[[#This Row],[Frontera]]=\"\",\"\",IFERROR(MATCH(RIGHT(TablaFronteras[[#This Row],[Frontera]],LEN(TablaFronteras[[#This Row],[Frontera]])-IFERROR(FIND(\" - \",TablaFronteras[[#This Row],[Frontera]])+2,0)),Datos[País],0),\"\"))","v":221}]
["Curazao",211.52857971191406,170.66433715820313,0.81897640228271484,0.77984249591827393,{"$f":"TablaFronteras[[#This Row],[X]]+TablaFronteras[[#This Row],[Ancho]]/2","v":211.93806791305542},{"$f":"TablaFronteras[[#This Row],[Y]]+TablaFronteras[[#This Row],[Alto]]/2","v":171.05425840616226},{"$f":"IF(AND(TablaFronteras[[#This Row],[Fila]]<>\"\",TablaFronteras[[#This Row],[X]]<miX,miX<TablaFronteras[[#This Row],[X]]+TablaFronteras[[#This Row],[Ancho]],TablaFronteras[[#This Row],[Y]]<miY,miY<TablaFronteras[[#This Row],[Y]]+TablaFronteras[[#This Row],[Alto]]),SQRT((TablaFronteras[[#This Row],[Centro X]]-miX)^2+(TablaFronteras[[#This Row],[Centro Y]]-miY)^2),\"\")","v":""},{"$f":"IF(TablaFronteras[[#This Row],[Frontera]]=\"\",\"\",IFERROR(MATCH(RIGHT(TablaFronteras[[#This Row],[Frontera]],LEN(TablaFronteras[[#This Row],[Frontera]])-IFERROR(FIND(\" - \",TablaFronteras[[#This Row],[Frontera]])+2,0)),Datos[País],0),\"\"))","v":65}]
["Caribe Neerlandés",213.11456298828125,170.77574157714844,0.4100787341594696,0.68574804067611694,{"$f":"TablaFronteras[[#This Row],[X]]+TablaFronteras[[#This Row],[Ancho]]/2","v":213.31960235536098},{"$f":"TablaFronteras[[#This Row],[Y]]+TablaFronteras[[#This Row],[Alto]]/2","v":171.1186155974865},{"$f":"IF(AND(TablaFronteras[[#This Row],[Fila]]<>\"\",TablaFronteras[[#This Row],[X]]<miX,miX<TablaFronteras[[#This Row],[X]]+TablaFronteras[[#This Row],[Ancho]],TablaFronteras[[#This Row],[Y]]<miY,miY<TablaFronteras[[#This Row],[Y]]+TablaFronteras[[#This Row],[Alto]]),SQRT((TablaFronteras[[#This Row],[Centro X]]-miX)^2+(TablaFronteras[[#This Row],[Centro Y]]-miY)^2),\"\")","v":""},{"$f":"IF(TablaFronteras[[#This Row],[Frontera]]=\"\",\"\",IFERROR(MATCH(RIGHT(TablaFronteras[[#This Row],[Frontera]],LEN(TablaFronteras[[#This Row],[Frontera]])-IFERROR(FIND(\" - \",TablaFronteras[[#This Row],[Frontera]])+2,0)),Datos[País],0),\"\"))","v":""}]
["Samoa Americana",773.19036865234375,234.48220825195313,0.33149605989456177,3.5458266735076904,{"$f":"TablaFronteras[[#This Row],[X]]+TablaFronteras[[#This Row],[Ancho]]/2","v":773.35611668229103},{"$f":"TablaFronteras[[#This Row],[Y]]+TablaFronteras[[#This Row],[Alto]]/2","v":236.25512158870697},{"$f":"IF(AND(TablaFronteras[[#This Row],[Fila]]<>\"\",TablaFronteras[[#This Row],[X]]<miX,miX<TablaFronteras[[#This Row],[X]]+TablaFronteras[[#This Row],[Ancho]],TablaFronteras[[#This Row],[Y]]<miY,miY<TablaFronteras[[#This Row],[Y]]+TablaFronteras[[#This Row],[Alto]]),SQRT((TablaFronteras[[#This Row],[Centro X]]-miX)^2+(TablaFronteras[[#This Row],[Centro Y]]-miY)^2),\"\")","v":""},{"$f":"IF(TablaFronteras[[#This Row],[Frontera]]=\"\",\"\",IFERROR(MATCH(RIGHT(TablaFronteras[[#This Row],[Frontera]],LEN(TablaFronteras[[#This Row],[Frontera]])-IFERROR(FIND(\" - \",TablaFronteras[[#This Row],[Frontera]])+2,0)),Datos[País],0),\"\"))","v":219}]
["Santa Elena",340.5987548828125,241.873779296875,0.17606298625469208,0.41968503594398499,{"$f":"TablaFronteras[[#This Row],[X]]+TablaFronteras[[#This Row],[Ancho]]/2","v":340.68678637593985},{"$f":"TablaFronteras[[#This Row],[Y]]+TablaFronteras[[#This Row],[Alto]]/2","v":242.08362181484699},{"$f":"IF(AND(TablaFronteras[[#This Row],[Fila]]<>\"\",TablaFronteras[[#This Row],[X]]<miX,miX<TablaFronteras[[#This Row],[X]]+TablaFronteras[[#This Row],[Ancho]],TablaFronteras[[#This Row],[Y]]<miY,miY<TablaFronteras[[#This Row],[Y]]+TablaFronteras[[#This Row],[Alto]]),SQRT((TablaFronteras[[#This Row],[Centro X]]-miX)^2+(TablaFronteras[[#This Row],[Centro Y]]-miY)^2),\"\")","v":""},{"$f":"IF(TablaFronteras[[#This Row],[Frontera]]=\"\",\"\",IFERROR(MATCH(RIGHT(TablaFronteras[[#This Row],[Frontera]],LEN(TablaFronteras[[#This Row],[Frontera]])-IFERROR(FIND(\" - \",TablaFronteras[[#This Row],[Frontera]])+2,0)),Datos[País],0),\"\"))","v":228}]
["San Bartolomé",224.98921203613281,156.74638366699219,0.13606299459934235,0.11881889402866364,{"$f":"TablaFronteras[[#This Row],[X]]+TablaFronteras[[#This Row],[Ancho]]/2","v":225.05724353343248},{"$f":"TablaFronteras[[#This Row],[Y]]+TablaFronteras[[#This Row],[Alto]]/2","v":156.80579311400652},{"$f":"IF(AND(TablaFronteras[[#This Row],[Fila]]<>\"\",TablaFronteras[[#This Row],[X]]<miX,miX<TablaFronteras[[#This Row],[X]]+TablaFronteras[[#This Row],[Ancho]],TablaFronteras[[#This Row],[Y]]<miY,miY<TablaFronteras[[#This Row],[Y]]+TablaFronteras[[#This Row],[Alto]]),SQRT((TablaFronteras[[#This Row],[Centro X]]-miX)^2+(TablaFronteras[[#This Row],[Centro Y]]-miY)^2),\"\")","v":""},{"$f":"IF(TablaFronteras[[#This Row],[Frontera]]=\"\",\"\",IFERROR(MATCH(RIGHT(TablaFronteras[[#This Row],[Frontera]],LEN(TablaFronteras[[#This Row],[Frontera]])-IFERROR(FIND(\" - \",TablaFronteras[[#This Row],[Frontera]])+2,0)),Datos[País],0),\"\"))","v":220}]
["Guernsey",351.79415893554688,81.289054870605469,0.13811023533344269,0.22204723954200745,{"$f":"TablaFronteras[[#This Row],[X]]+TablaFronteras[[#This Row],[Ancho]]/2","v":351.8632140532136},{"$f":"TablaFronteras[[#This Row],[Y]]+TablaFronteras[[#This Row],[Alto]]/2","v":81.400078490376472},{"$f":"IF(AND(TablaFronteras[[#This Row],[Fila]]<>\"\",TablaFronteras[[#This Row],[X]]<miX,miX<TablaFronteras[[#This Row],[X]]+TablaFronteras[[#This Row],[Ancho]],TablaFronteras[[#This Row],[Y]]<miY,miY<TablaFronteras[[#This Row],[Y]]+TablaFronteras[[#This Row],[Alto]]),SQRT((TablaFronteras[[#This Row],[Centro X]]-miX)^2+(TablaFronteras[[#This Row],[Centro Y]]-miY)^2),\"\")","v":""},{"$f":"IF(TablaFronteras[[#This Row],[Frontera]]=\"\",\"\",IFERROR(MATCH(RIGHT(TablaFronteras[[#This Row],[Frontera]],LEN(TablaFronteras[[#This Row],[Frontera]])-IFERROR(FIND(\" - \",TablaFronteras[[#This Row],[Frontera]])+2,0)),Datos[País],0),\"\"))","v":95}]
["Bermudas",226.39511108398438,122.56204986572266,0.20370078086853027,0.12433070689439774,{"$f":"TablaFronteras[[#This Row],[X]]+TablaFronteras[[#This Row],[Ancho]]/2","v":226.49696147441864},{"$f":"TablaFronteras[[#This Row],[Y]]+TablaFronteras[[#This Row],[Alto]]/2","v":122.62421521916986},{"$f":"IF(AND(TablaFronteras[[#This Row],[Fila]]<>\"\",TablaFronteras[[#This Row],[X]]<miX,miX<TablaFronteras[[#This Row],[X]]+TablaFronteras[[#This Row],[Ancho]],TablaFronteras[[#This Row],[Y]]<miY,miY<TablaFronteras[[#This Row],[Y]]+TablaFronteras[[#This Row],[Alto]]),SQRT((TablaFronteras[[#This Row],[Centro X]]-miX)^2+(TablaFronteras[[#This Row],[Centro Y]]-miY)^2),\"\")","v":""},{"$f":"IF(TablaFronteras[[#This Row],[Frontera]]=\"\",\"\",IFERROR(MATCH(RIGHT(TablaFronteras[[#This Row],[Frontera]],LEN(TablaFronteras[[#This Row],[Frontera]])-IFERROR(FIND(\" - \",TablaFronteras[[#This Row],[Frontera]])+2,0)),Datos[País],0),\"\"))","v":30}]
["Tuvalu",723.7353515625,220.83274841308594,0.23496063053607941,0.31062993407249451,{"$f":"TablaFronteras[[#This Row],[X]]+TablaFronteras[[#This Row],[Ancho]]/2","v":723.85283187776804},{"$f":"TablaFronteras[[#This Row],[Y]]+TablaFronteras[[#This Row],[Alto]]/2","v":220.98806338012218},{"$f":"IF(AND(TablaFronteras[[#This Row],[Fila]]<>\"\",TablaFronteras[[#This Row],[X]]<miX,miX<TablaFronteras[[#This Row],[X]]+TablaFronteras[[#This Row],[Ancho]],TablaFronteras[[#This Row],[Y]]<miY,miY<TablaFronteras[[#This Row],[Y]]+TablaFronteras[[#This Row],[Alto]]),SQRT((TablaFronteras[[#This Row],[Centro X]]-miX)^2+(TablaFronteras[[#This Row],[Centro Y]]-miY)^2),\"\")","v":""},{"$f":"IF(TablaFronteras[[#This Row],[Frontera]]=\"\",\"\",IFERROR(MATCH(RIGHT(TablaFronteras[[#This Row],[Frontera]],LEN(TablaFronteras[[#This Row],[Frontera]])-IFERROR(FIND(\" - \",TablaFronteras[[#This Row],[Frontera]])+2,0)),Datos[País],0),\"\"))","v":263}]
["Nauru",697.2454833984375,195.72969055175781,0.30669292807579041,0.27440944314002991,{"$f":"TablaFronteras[[#This Row],[X]]+TablaFronteras[[#This Row],[Ancho]]/2","v":697.3988298624754},{"$f":"TablaFronteras[[#This Row],[Y]]+TablaFronteras[[#This Row],[Alto]]/2","v":195.86689527332783},{"$f":"IF(AND(TablaFronteras[[#This Row],[Fila]]<>\"\",TablaFronteras[[#This Row],[X]]<miX,miX<TablaFronteras[[#This Row],[X]]+TablaFronteras[[#This Row],[Ancho]],TablaFronteras[[#This Row],[Y]]<miY,miY<TablaFronteras[[#This Row],[Y]]+TablaFronteras[[#This Row],[Alto]]),SQRT((TablaFronteras[[#This Row],[Centro X]]-miX)^2+(TablaFronteras[[#This Row],[Centro Y]]-miY)^2),\"\")","v":""},{"$f":"IF(TablaFronteras[[#This Row],[Frontera]]=\"\",\"\",IFERROR(MATCH(RIGHT(TablaFronteras[[#This Row],[Frontera]],LEN(TablaFronteras[[#This Row],[Frontera]])-IFERROR(FIND(\" - \",TablaFronteras[[#This Row],[Frontera]])+2,0)),Datos[País],0),\"\"))","v":179}]
["Islas Marianas del Norte",652.53826904296875,167.85479736328125,0.47307085990905762,0.65031498670578003,{"$f":"TablaFronteras[[#This Row],[X]]+TablaFronteras[[#This Row],[Ancho]]/2","v":652.77480447292328},{"$f":"TablaFronteras[[#This Row],[Y]]+TablaFronteras[[#This Row],[Alto]]/2","v":168.17995485663414},{"$f":"IF(AND(TablaFronteras[[#This Row],[Fila]]<>\"\",TablaFronteras[[#This Row],[X]]<miX,miX<TablaFronteras[[#This Row],[X]]+TablaFronteras[[#This Row],[Ancho]],TablaFronteras[[#This Row],[Y]]<miY,miY<TablaFronteras[[#This Row],[Y]]+TablaFronteras[[#This Row],[Alto]]),SQRT((TablaFronteras[[#This Row],[Centro X]]-miX)^2+(TablaFronteras[[#This Row],[Centro Y]]-miY)^2),\"\")","v":""},{"$f":"IF(TablaFronteras[[#This Row],[Frontera]]=\"\",\"\",IFERROR(MATCH(RIGHT(TablaFronteras[[#This Row],[Frontera]],LEN(TablaFronteras[[#This Row],[Frontera]])-IFERROR(FIND(\" - \",TablaFronteras[[#This Row],[Frontera]])+2,0)),Datos[País],0),\"\"))","v":125}]
["Anguila",225.16653442382813,157.1761474609375,0.19740156829357147,5.196850374341011E-2,{"$f":"TablaFronteras[[#This Row],[X]]+TablaFronteras[[#This Row],[Ancho]]/2","v":225.26523520797491},{"$f":"TablaFronteras[[#This Row],[Y]]+TablaFronteras[[#This Row],[Alto]]/2","v":157.20213171280921},{"$f":"IF(AND(TablaFronteras[[#This Row],[Fila]]<>\"\",TablaFronteras[[#This Row],[X]]<miX,miX<TablaFronteras[[#This Row],[X]]+TablaFronteras[[#This Row],[Ancho]],TablaFronteras[[#This Row],[Y]]<miY,miY<TablaFronteras[[#This Row],[Y]]+TablaFronteras[[#This Row],[Alto]]),SQRT((TablaFronteras[[#This Row],[Centro X]]-miX)^2+(TablaFronteras[[#This Row],[Centro Y]]-miY)^2),\"\")","v":""},{"$f":"IF(TablaFronteras[[#This Row],[Frontera]]=\"\",\"\",IFERROR(MATCH(RIGHT(TablaFronteras[[#This Row],[Frontera]],LEN(TablaFronteras[[#This Row],[Frontera]])-IFERROR(FIND(\" - \",TablaFronteras[[#This Row],[Frontera]])+2,0)),Datos[País],0),\"\"))","v":8}]
["Tokelau",735.07781982421875,232.94622802734375,0.23496063053607941,0.31062993407249451,{"$f":"TablaFronteras[[#This Row],[X]]+TablaFronteras[[#This Row],[Ancho]]/2","v":735.19530013948679},{"$f":"TablaFronteras[[#This Row],[Y]]+TablaFronteras[[#This Row],[Alto]]/2","v":233.10154299438},{"$f":"IF(AND(TablaFronteras[[#This Row],[Fila]]<>\"\",TablaFronteras[[#This Row],[X]]<miX,miX<TablaFronteras[[#This Row],[X]]+TablaFronteras[[#This Row],[Ancho]],TablaFronteras[[#This Row],[Y]]<miY,miY<TablaFronteras[[#This Row],[Y]]+TablaFronteras[[#This Row],[Alto]]),SQRT((TablaFronteras[[#This Row],[Centro X]]-miX)^2+(TablaFronteras[[#This Row],[Centro Y]]-miY)^2),\"\")","v":""},{"$f":"IF(TablaFronteras[[#This Row],[Frontera]]=\"\",\"\",IFERROR(MATCH(RIGHT(TablaFronteras[[#This Row],[Frontera]],LEN(TablaFronteras[[#This Row],[Frontera]])-IFERROR(FIND(\" - \",TablaFronteras[[#This Row],[Frontera]])+2,0)),Datos[País],0),\"\"))","v":257}]
["Islas Marshall",709.8670654296875,184.18330383300781,0.26433071494102478,0.25984251499176025,{"$f":"TablaFronteras[[#This Row],[X]]+TablaFronteras[[#This Row],[Ancho]]/2","v":709.99923078715801},{"$f":"TablaFronteras[[#This Row],[Y]]+TablaFronteras[[#This Row],[Alto]]/2","v":184.31322509050369},{"$f":"IF(AND(TablaFronteras[[#This Row],[Fila]]<>\"\",TablaFronteras[[#This Row],[X]]<miX,miX<TablaFronteras[[#This Row],[X]]+TablaFronteras[[#This Row],[Ancho]],TablaFronteras[[#This Row],[Y]]<miY,miY<TablaFronteras[[#This Row],[Y]]+TablaFronteras[[#This Row],[Alto]]),SQRT((TablaFronteras[[#This Row],[Centro X]]-miX)^2+(TablaFronteras[[#This Row],[Centro Y]]-miY)^2),\"\")","v":""},{"$f":"IF(TablaFronteras[[#This Row],[Frontera]]=\"\",\"\",IFERROR(MATCH(RIGHT(TablaFronteras[[#This Row],[Frontera]],LEN(TablaFronteras[[#This Row],[Frontera]])-IFERROR(FIND(\" - \",TablaFronteras[[#This Row],[Frontera]])+2,0)),Datos[País],0),\"\"))","v":126}]
["Territorio Británico del Índico",501.196533203125,217.94630432128906,0.12370079010725021,0.39944881200790405,{"$f":"TablaFronteras[[#This Row],[X]]+TablaFronteras[[#This Row],[Ancho]]/2","v":501.25838359817863},{"$f":"TablaFronteras[[#This Row],[Y]]+TablaFronteras[[#This Row],[Alto]]/2","v":218.14602872729301},{"$f":"IF(AND(TablaFronteras[[#This Row],[Fila]]<>\"\",TablaFronteras[[#This Row],[X]]<miX,miX<TablaFronteras[[#This Row],[X]]+TablaFronteras[[#This Row],[Ancho]],TablaFronteras[[#This Row],[Y]]<miY,miY<TablaFronteras[[#This Row],[Y]]+TablaFronteras[[#This Row],[Alto]]),SQRT((TablaFronteras[[#This Row],[Centro X]]-miX)^2+(TablaFronteras[[#This Row],[Centro Y]]-miY)^2),\"\")","v":""},{"$f":"IF(TablaFronteras[[#This Row],[Frontera]]=\"\",\"\",IFERROR(MATCH(RIGHT(TablaFronteras[[#This Row],[Frontera]],LEN(TablaFronteras[[#This Row],[Frontera]])-IFERROR(FIND(\" - \",TablaFronteras[[#This Row],[Frontera]])+2,0)),Datos[País],0),\"\"))","v":253}]
["Maldivas",501.75015258789063,193.56393432617188,0.30503937602043152,0.38858267664909363,{"$f":"TablaFronteras[[#This Row],[X]]+TablaFronteras[[#This Row],[Ancho]]/2","v":501.90267227590084},{"$f":"TablaFronteras[[#This Row],[Y]]+TablaFronteras[[#This Row],[Alto]]/2","v":193.75822566449642},{"$f":"IF(AND(TablaFronteras[[#This Row],[Fila]]<>\"\",TablaFronteras[[#This Row],[X]]<miX,miX<TablaFronteras[[#This Row],[X]]+TablaFronteras[[#This Row],[Ancho]],TablaFronteras[[#This Row],[Y]]<miY,miY<TablaFronteras[[#This Row],[Y]]+TablaFronteras[[#This Row],[Alto]]),SQRT((TablaFronteras[[#This Row],[Centro X]]-miX)^2+(TablaFronteras[[#This Row],[Centro Y]]-miY)^2),\"\")","v":""},{"$f":"IF(TablaFronteras[[#This Row],[Frontera]]=\"\",\"\",IFERROR(MATCH(RIGHT(TablaFronteras[[#This Row],[Frontera]],LEN(TablaFronteras[[#This Row],[Frontera]])-IFERROR(FIND(\" - \",TablaFronteras[[#This Row],[Frontera]])+2,0)),Datos[País],0),\"\"))","v":160}]
["Kiribati",716.1444091796875,195.67582702636719,0.22716535627841949,3.4488189965486526E-2,{"$f":"TablaFronteras[[#This Row],[X]]+TablaFronteras[[#This Row],[Ancho]]/2","v":716.25799185782671},{"$f":"TablaFronteras[[#This Row],[Y]]+TablaFronteras[[#This Row],[Alto]]/2","v":195.69307112134993},{"$f":"IF(AND(TablaFronteras[[#This Row],[Fila]]<>\"\",TablaFronteras[[#This Row],[X]]<miX,miX<TablaFronteras[[#This Row],[X]]+TablaFronteras[[#This Row],[Ancho]],TablaFronteras[[#This Row],[Y]]<miY,miY<TablaFronteras[[#This Row],[Y]]+TablaFronteras[[#This Row],[Alto]]),SQRT((TablaFronteras[[#This Row],[Centro X]]-miX)^2+(TablaFronteras[[#This Row],[Centro Y]]-miY)^2),\"\")","v":""},{"$f":"IF(TablaFronteras[[#This Row],[Frontera]]=\"\",\"\",IFERROR(MATCH(RIGHT(TablaFronteras[[#This Row],[Frontera]],LEN(TablaFronteras[[#This Row],[Frontera]])-IFERROR(FIND(\" - \",TablaFronteras[[#This Row],[Frontera]])+2,0)),Datos[País],0),\"\"))","v":143}]
["Micronesia",682.33258056640625,183.76881408691406,0.40480315685272217,0.43362203240394592,{"$f":"TablaFronteras[[#This Row],[X]]+TablaFronteras[[#This Row],[Ancho]]/2","v":682.53498214483261},{"$f":"TablaFronteras[[#This Row],[Y]]+TablaFronteras[[#This Row],[Alto]]/2","v":183.98562510311604},{"$f":"IF(AND(TablaFronteras[[#This Row],[Fila]]<>\"\",TablaFronteras[[#This Row],[X]]<miX,miX<TablaFronteras[[#This Row],[X]]+TablaFronteras[[#This Row],[Ancho]],TablaFronteras[[#This Row],[Y]]<miY,miY<TablaFronteras[[#This Row],[Y]]+TablaFronteras[[#This Row],[Alto]]),SQRT((TablaFronteras[[#This Row],[Centro X]]-miX)^2+(TablaFronteras[[#This Row],[Centro Y]]-miY)^2),\"\")","v":""},{"$f":"IF(TablaFronteras[[#This Row],[Frontera]]=\"\",\"\",IFERROR(MATCH(RIGHT(TablaFronteras[[#This Row],[Frontera]],LEN(TablaFronteras[[#This Row],[Frontera]])-IFERROR(FIND(\" - \",TablaFronteras[[#This Row],[Frontera]])+2,0)),Datos[País],0),\"\"))","v":169}]
["Guam",654.09130859375,163.49417114257813,0.1348818838596344,0.39944881200790405,{"$f":"TablaFronteras[[#This Row],[X]]+TablaFronteras[[#This Row],[Ancho]]/2","v":654.15874953567982},{"$f":"TablaFronteras[[#This Row],[Y]]+TablaFronteras[[#This Row],[Alto]]/2","v":163.69389554858208},{"$f":"IF(AND(TablaFronteras[[#This Row],[Fila]]<>\"\",TablaFronteras[[#This Row],[X]]<miX,miX<TablaFronteras[[#This Row],[X]]+TablaFronteras[[#This Row],[Ancho]],TablaFronteras[[#This Row],[Y]]<miY,miY<TablaFronteras[[#This Row],[Y]]+TablaFronteras[[#This Row],[Alto]]),SQRT((TablaFronteras[[#This Row],[Centro X]]-miX)^2+(TablaFronteras[[#This Row],[Centro Y]]-miY)^2),\"\")","v":""},{"$f":"IF(TablaFronteras[[#This Row],[Frontera]]=\"\",\"\",IFERROR(MATCH(RIGHT(TablaFronteras[[#This Row],[Frontera]],LEN(TablaFronteras[[#This Row],[Frontera]])-IFERROR(FIND(\" - \",TablaFronteras[[#This Row],[Frontera]])+2,0)),Datos[País],0),\"\"))","v":92}]
["Seychelles",469.54574584960938,211.80007934570313,0.30503937602043152,0.41354331374168396,{"$f":"TablaFronteras[[#This Row],[X]]+TablaFronteras[[#This Row],[Ancho]]/2","v":469.69826553761959},{"$f":"TablaFronteras[[#This Row],[Y]]+TablaFronteras[[#This Row],[Alto]]/2","v":212.00685100257397},{"$f":"IF(AND(TablaFronteras[[#This Row],[Fila]]<>\"\",TablaFronteras[[#This Row],[X]]<miX,miX<TablaFronteras[[#This Row],[X]]+TablaFronteras[[#This Row],[Ancho]],TablaFronteras[[#This Row],[Y]]<miY,miY<TablaFronteras[[#This Row],[Y]]+TablaFronteras[[#This Row],[Alto]]),SQRT((TablaFronteras[[#This Row],[Centro X]]-miX)^2+(TablaFronteras[[#This Row],[Centro Y]]-miY)^2),\"\")","v":""},{"$f":"IF(TablaFronteras[[#This Row],[Frontera]]=\"\",\"\",IFERROR(MATCH(RIGHT(TablaFronteras[[#This Row],[Frontera]],LEN(TablaFronteras[[#This Row],[Frontera]])-IFERROR(FIND(\" - \",TablaFronteras[[#This Row],[Frontera]])+2,0)),Datos[País],0),\"\"))","v":233}]
["Serbia",391.49990844726563,89.081886291503906,7.845433235168457,10.45228385925293,{"$f":"TablaFronteras[[#This Row],[X]]+TablaFronteras[[#This Row],[Ancho]]/2","v":395.42262506484985},{"$f":"TablaFronteras[[#This Row],[Y]]+TablaFronteras[[#This Row],[Alto]]/2","v":94.308028221130371},{"$f":"IF(AND(TablaFronteras[[#This Row],[Fila]]<>\"\",TablaFronteras[[#This Row],[X]]<miX,miX<TablaFronteras[[#This Row],[X]]+TablaFronteras[[#This Row],[Ancho]],TablaFronteras[[#This Row],[Y]]<miY,miY<TablaFronteras[[#This Row],[Y]]+TablaFronteras[[#This Row],[Alto]]),SQRT((TablaFronteras[[#This Row],[Centro X]]-miX)^2+(TablaFronteras[[#This Row],[Centro Y]]-miY)^2),\"\")","v":""},{"$f":"IF(TablaFronteras[[#This Row],[Frontera]]=\"\",\"\",IFERROR(MATCH(RIGHT(TablaFronteras[[#This Row],[Frontera]],LEN(TablaFronteras[[#This Row],[Frontera]])-IFERROR(FIND(\" - \",TablaFronteras[[#This Row],[Frontera]])+2,0)),Datos[País],0),\"\"))","v":232}]
["Kosovo",393.93557739257813,96.034721374511719,3.2277953624725342,3.4840157032012939,{"$f":"TablaFronteras[[#This Row],[X]]+TablaFronteras[[#This Row],[Ancho]]/2","v":395.54947507381439},{"$f":"TablaFronteras[[#This Row],[Y]]+TablaFronteras[[#This Row],[Alto]]/2","v":97.776729226112366},{"$f":"IF(AND(TablaFronteras[[#This Row],[Fila]]<>\"\",TablaFronteras[[#This Row],[X]]<miX,miX<TablaFronteras[[#This Row],[X]]+TablaFronteras[[#This Row],[Ancho]],TablaFronteras[[#This Row],[Y]]<miY,miY<TablaFronteras[[#This Row],[Y]]+TablaFronteras[[#This Row],[Alto]]),SQRT((TablaFronteras[[#This Row],[Centro X]]-miX)^2+(TablaFronteras[[#This Row],[Centro Y]]-miY)^2),\"\")","v":""},{"$f":"IF(TablaFronteras[[#This Row],[Frontera]]=\"\",\"\",IFERROR(MATCH(RIGHT(TablaFronteras[[#This Row],[Frontera]],LEN(TablaFronteras[[#This Row],[Frontera]])-IFERROR(FIND(\" - \",TablaFronteras[[#This Row],[Frontera]])+2,0)),Datos[País],0),\"\"))","v":144}]
["Samoa",773.2635498046875,233.17071533203125,0.25543308258056641,1.3783464431762695,{"$f":"TablaFronteras[[#This Row],[X]]+TablaFronteras[[#This Row],[Ancho]]/2","v":773.39126634597778},{"$f":"TablaFronteras[[#This Row],[Y]]+TablaFronteras[[#This Row],[Alto]]/2","v":233.85988855361938},{"$f":"IF(AND(TablaFronteras[[#This Row],[Fila]]<>\"\",TablaFronteras[[#This Row],[X]]<miX,miX<TablaFronteras[[#This Row],[X]]+TablaFronteras[[#This Row],[Ancho]],TablaFronteras[[#This Row],[Y]]<miY,miY<TablaFronteras[[#This Row],[Y]]+TablaFronteras[[#This Row],[Alto]]),SQRT((TablaFronteras[[#This Row],[Centro X]]-miX)^2+(TablaFronteras[[#This Row],[Centro Y]]-miY)^2),\"\")","v":""},{"$f":"IF(TablaFronteras[[#This Row],[Frontera]]=\"\",\"\",IFERROR(MATCH(RIGHT(TablaFronteras[[#This Row],[Frontera]],LEN(TablaFronteras[[#This Row],[Frontera]])-IFERROR(FIND(\" - \",TablaFronteras[[#This Row],[Frontera]])+2,0)),Datos[País],0),\"\"))","v":218}]
["Palaos",633.158447265625,182.22433471679688,0.32598423957824707,0.58661419153213501,{"$f":"TablaFronteras[[#This Row],[X]]+TablaFronteras[[#This Row],[Ancho]]/2","v":633.32143938541412},{"$f":"TablaFronteras[[#This Row],[Y]]+TablaFronteras[[#This Row],[Alto]]/2","v":182.51764181256294},{"$f":"IF(AND(TablaFronteras[[#This Row],[Fila]]<>\"\",TablaFronteras[[#This Row],[X]]<miX,miX<TablaFronteras[[#This Row],[X]]+TablaFronteras[[#This Row],[Ancho]],TablaFronteras[[#This Row],[Y]]<miY,miY<TablaFronteras[[#This Row],[Y]]+TablaFronteras[[#This Row],[Alto]]),SQRT((TablaFronteras[[#This Row],[Centro X]]-miX)^2+(TablaFronteras[[#This Row],[Centro Y]]-miY)^2),\"\")","v":""},{"$f":"IF(TablaFronteras[[#This Row],[Frontera]]=\"\",\"\",IFERROR(MATCH(RIGHT(TablaFronteras[[#This Row],[Frontera]],LEN(TablaFronteras[[#This Row],[Frontera]])-IFERROR(FIND(\" - \",TablaFronteras[[#This Row],[Frontera]])+2,0)),Datos[País],0),\"\"))","v":191}]
["Islas Georgias y Sandwich",291.04415893554688,330.35330200195313,4.4392127990722656,2.0566141605377197,{"$f":"TablaFronteras[[#This Row],[X]]+TablaFronteras[[#This Row],[Ancho]]/2","v":293.26376533508301},{"$f":"TablaFronteras[[#This Row],[Y]]+TablaFronteras[[#This Row],[Alto]]/2","v":331.38160908222198},{"$f":"IF(AND(TablaFronteras[[#This Row],[Fila]]<>\"\",TablaFronteras[[#This Row],[X]]<miX,miX<TablaFronteras[[#This Row],[X]]+TablaFronteras[[#This Row],[Ancho]],TablaFronteras[[#This Row],[Y]]<miY,miY<TablaFronteras[[#This Row],[Y]]+TablaFronteras[[#This Row],[Alto]]),SQRT((TablaFronteras[[#This Row],[Centro X]]-miX)^2+(TablaFronteras[[#This Row],[Centro Y]]-miY)^2),\"\")","v":""},{"$f":"IF(TablaFronteras[[#This Row],[Frontera]]=\"\",\"\",IFERROR(MATCH(RIGHT(TablaFronteras[[#This Row],[Frontera]],LEN(TablaFronteras[[#This Row],[Frontera]])-IFERROR(FIND(\" - \",TablaFronteras[[#This Row],[Frontera]])+2,0)),Datos[País],0),\"\"))","v":123}]
["Reunión",467.44937133789063,251.00567626953125,1.1799212694168091,1.5472440719604492,{"$f":"TablaFronteras[[#This Row],[X]]+TablaFronteras[[#This Row],[Ancho]]/2","v":468.03933197259903},{"$f":"TablaFronteras[[#This Row],[Y]]+TablaFronteras[[#This Row],[Alto]]/2","v":251.77929830551147},{"$f":"IF(AND(TablaFronteras[[#This Row],[Fila]]<>\"\",TablaFronteras[[#This Row],[X]]<miX,miX<TablaFronteras[[#This Row],[X]]+TablaFronteras[[#This Row],[Ancho]],TablaFronteras[[#This Row],[Y]]<miY,miY<TablaFronteras[[#This Row],[Y]]+TablaFronteras[[#This Row],[Alto]]),SQRT((TablaFronteras[[#This Row],[Centro X]]-miX)^2+(TablaFronteras[[#This Row],[Centro Y]]-miY)^2),\"\")","v":""},{"$f":"IF(TablaFronteras[[#This Row],[Frontera]]=\"\",\"\",IFERROR(MATCH(RIGHT(TablaFronteras[[#This Row],[Frontera]],LEN(TablaFronteras[[#This Row],[Frontera]])-IFERROR(FIND(\" - \",TablaFronteras[[#This Row],[Frontera]])+2,0)),Datos[País],0),\"\"))","v":213}]
["Mauricio",471.06573486328125,248.98377990722656,0.46448817849159241,1.2185826301574707,{"$f":"TablaFronteras[[#This Row],[X]]+TablaFronteras[[#This Row],[Ancho]]/2","v":471.29797895252705},{"$f":"TablaFronteras[[#This Row],[Y]]+TablaFronteras[[#This Row],[Alto]]/2","v":249.5930712223053},{"$f":"IF(AND(TablaFronteras[[#This Row],[Fila]]<>\"\",TablaFronteras[[#This Row],[X]]<miX,miX<TablaFronteras[[#This Row],[X]]+TablaFronteras[[#This Row],[Ancho]],TablaFronteras[[#This Row],[Y]]<miY,miY<TablaFronteras[[#This Row],[Y]]+TablaFronteras[[#This Row],[Alto]]),SQRT((TablaFronteras[[#This Row],[Centro X]]-miX)^2+(TablaFronteras[[#This Row],[Centro Y]]-miY)^2),\"\")","v":""},{"$f":"IF(TablaFronteras[[#This Row],[Frontera]]=\"\",\"\",IFERROR(MATCH(RIGHT(TablaFronteras[[#This Row],[Frontera]],LEN(TablaFronteras[[#This Row],[Frontera]])-IFERROR(FIND(\" - \",TablaFronteras[[#This Row],[Frontera]])+2,0)),Datos[País],0),\"\"))","v":165}]
["Mayotte",448.0882568359375,230.98275756835938,0.6159055233001709,2.2061417102813721,{"$f":"TablaFronteras[[#This Row],[X]]+TablaFronteras[[#This Row],[Ancho]]/2","v":448.39620959758759},{"$f":"TablaFronteras[[#This Row],[Y]]+TablaFronteras[[#This Row],[Alto]]/2","v":232.08582842350006},{"$f":"IF(AND(TablaFronteras[[#This Row],[Fila]]<>\"\",TablaFronteras[[#This Row],[X]]<miX,miX<TablaFronteras[[#This Row],[X]]+TablaFronteras[[#This Row],[Ancho]],TablaFronteras[[#This Row],[Y]]<miY,miY<TablaFronteras[[#This Row],[Y]]+TablaFronteras[[#This Row],[Alto]]),SQRT((TablaFronteras[[#This Row],[Centro X]]-miX)^2+(TablaFronteras[[#This Row],[Centro Y]]-miY)^2),\"\")","v":""},{"$f":"IF(TablaFronteras[[#This Row],[Frontera]]=\"\",\"\",IFERROR(MATCH(RIGHT(TablaFronteras[[#This Row],[Frontera]],LEN(TablaFronteras[[#This Row],[Frontera]])-IFERROR(FIND(\" - \",TablaFronteras[[#This Row],[Frontera]])+2,0)),Datos[País],0),\"\"))","v":167}]
["Comoras",443.91424560546875,228.17338562011719,4.4374804496765137,3.8588976860046387,{"$f":"TablaFronteras[[#This Row],[X]]+TablaFronteras[[#This Row],[Ancho]]/2","v":446.13298583030701},{"$f":"TablaFronteras[[#This Row],[Y]]+TablaFronteras[[#This Row],[Alto]]/2","v":230.10283446311951},{"$f":"IF(AND(TablaFronteras[[#This Row],[Fila]]<>\"\",TablaFronteras[[#This Row],[X]]<miX,miX<TablaFronteras[[#This Row],[X]]+TablaFronteras[[#This Row],[Ancho]],TablaFronteras[[#This Row],[Y]]<miY,miY<TablaFronteras[[#This Row],[Y]]+TablaFronteras[[#This Row],[Alto]]),SQRT((TablaFronteras[[#This Row],[Centro X]]-miX)^2+(TablaFronteras[[#This Row],[Centro Y]]-miY)^2),\"\")","v":""},{"$f":"IF(TablaFronteras[[#This Row],[Frontera]]=\"\",\"\",IFERROR(MATCH(RIGHT(TablaFronteras[[#This Row],[Frontera]],LEN(TablaFronteras[[#This Row],[Frontera]])-IFERROR(FIND(\" - \",TablaFronteras[[#This Row],[Frontera]])+2,0)),Datos[País],0),\"\"))","v":58}]
["Islas Pitcairn",43.215667724609375,221.74394226074219,23.187873840332031,22.154251098632813,{"$f":"TablaFronteras[[#This Row],[X]]+TablaFronteras[[#This Row],[Ancho]]/2","v":54.809604644775391},{"$f":"TablaFronteras[[#This Row],[Y]]+TablaFronteras[[#This Row],[Alto]]/2","v":232.82106781005859},{"$f":"IF(AND(TablaFronteras[[#This Row],[Fila]]<>\"\",TablaFronteras[[#This Row],[X]]<miX,miX<TablaFronteras[[#This Row],[X]]+TablaFronteras[[#This Row],[Ancho]],TablaFronteras[[#This Row],[Y]]<miY,miY<TablaFronteras[[#This Row],[Y]]+TablaFronteras[[#This Row],[Alto]]),SQRT((TablaFronteras[[#This Row],[Centro X]]-miX)^2+(TablaFronteras[[#This Row],[Centro Y]]-miY)^2),\"\")","v":""},{"$f":"IF(TablaFronteras[[#This Row],[Frontera]]=\"\",\"\",IFERROR(MATCH(RIGHT(TablaFronteras[[#This Row],[Frontera]],LEN(TablaFronteras[[#This Row],[Frontera]])-IFERROR(FIND(\" - \",TablaFronteras[[#This Row],[Frontera]])+2,0)),Datos[País],0),\"\"))","v":129}]
["Islas Cook",773.393798828125,224.42054748535156,7.7165355905890465E-3,6.1023622751235962E-2,{"$f":"TablaFronteras[[#This Row],[X]]+TablaFronteras[[#This Row],[Ancho]]/2","v":773.39765709592029},{"$f":"TablaFronteras[[#This Row],[Y]]+TablaFronteras[[#This Row],[Alto]]/2","v":224.45105929672718},{"$f":"IF(AND(TablaFronteras[[#This Row],[Fila]]<>\"\",TablaFronteras[[#This Row],[X]]<miX,miX<TablaFronteras[[#This Row],[X]]+TablaFronteras[[#This Row],[Ancho]],TablaFronteras[[#This Row],[Y]]<miY,miY<TablaFronteras[[#This Row],[Y]]+TablaFronteras[[#This Row],[Alto]]),SQRT((TablaFronteras[[#This Row],[Centro X]]-miX)^2+(TablaFronteras[[#This Row],[Centro Y]]-miY)^2),\"\")","v":""},{"$f":"IF(TablaFronteras[[#This Row],[Frontera]]=\"\",\"\",IFERROR(MATCH(RIGHT(TablaFronteras[[#This Row],[Frontera]],LEN(TablaFronteras[[#This Row],[Frontera]])-IFERROR(FIND(\" - \",TablaFronteras[[#This Row],[Frontera]])+2,0)),Datos[País],0),\"\"))","v":121}]
["San Martín (Países Bajos)",224.57102966308594,156.34353637695313,0.17102362215518951,0.27244094014167786,{"$f":"TablaFronteras[[#This Row],[X]]+TablaFronteras[[#This Row],[Ancho]]/2","v":224.65654147416353},{"$f":"TablaFronteras[[#This Row],[Y]]+TablaFronteras[[#This Row],[Alto]]/2","v":156.47975684702396},{"$f":"IF(AND(TablaFronteras[[#This Row],[Fila]]<>\"\",TablaFronteras[[#This Row],[X]]<miX,miX<TablaFronteras[[#This Row],[X]]+TablaFronteras[[#This Row],[Ancho]],TablaFronteras[[#This Row],[Y]]<miY,miY<TablaFronteras[[#This Row],[Y]]+TablaFronteras[[#This Row],[Alto]]),SQRT((TablaFronteras[[#This Row],[Centro X]]-miX)^2+(TablaFronteras[[#This Row],[Centro Y]]-miY)^2),\"\")","v":""},{"$f":"225","v":225}]
["San Pedro y Miquelón",252.38693237304688,87.065826416015625,0.22456693649291992,0.62283462285995483,{"$f":"TablaFronteras[[#This Row],[X]]+TablaFronteras[[#This Row],[Ancho]]/2","v":252.49921584129333},{"$f":"TablaFronteras[[#This Row],[Y]]+TablaFronteras[[#This Row],[Alto]]/2","v":87.377243727445602},{"$f":"IF(AND(TablaFronteras[[#This Row],[Fila]]<>\"\",TablaFronteras[[#This Row],[X]]<miX,miX<TablaFronteras[[#This Row],[X]]+TablaFronteras[[#This Row],[Ancho]],TablaFronteras[[#This Row],[Y]]<miY,miY<TablaFronteras[[#This Row],[Y]]+TablaFronteras[[#This Row],[Alto]]),SQRT((TablaFronteras[[#This Row],[Centro X]]-miX)^2+(TablaFronteras[[#This Row],[Centro Y]]-miY)^2),\"\")","v":""},{"$f":"IF(TablaFronteras[[#This Row],[Frontera]]=\"\",\"\",IFERROR(MATCH(RIGHT(TablaFronteras[[#This Row],[Frontera]],LEN(TablaFronteras[[#This Row],[Frontera]])-IFERROR(FIND(\" - \",TablaFronteras[[#This Row],[Frontera]])+2,0)),Datos[País],0),\"\"))","v":226}]
["Jersey",352.51583862304688,81.999923706054688,0.26094487309455872,0.19913385808467865,{"$f":"TablaFronteras[[#This Row],[X]]+TablaFronteras[[#This Row],[Ancho]]/2","v":352.64631105959415},{"$f":"TablaFronteras[[#This Row],[Y]]+TablaFronteras[[#This Row],[Alto]]/2","v":82.099490635097027},{"$f":"IF(AND(TablaFronteras[[#This Row],[Fila]]<>\"\",TablaFronteras[[#This Row],[X]]<miX,miX<TablaFronteras[[#This Row],[X]]+TablaFronteras[[#This Row],[Ancho]],TablaFronteras[[#This Row],[Y]]<miY,miY<TablaFronteras[[#This Row],[Y]]+TablaFronteras[[#This Row],[Alto]]),SQRT((TablaFronteras[[#This Row],[Centro X]]-miX)^2+(TablaFronteras[[#This Row],[Centro Y]]-miY)^2),\"\")","v":""},{"$f":"IF(TablaFronteras[[#This Row],[Frontera]]=\"\",\"\",IFERROR(MATCH(RIGHT(TablaFronteras[[#This Row],[Frontera]],LEN(TablaFronteras[[#This Row],[Frontera]])-IFERROR(FIND(\" - \",TablaFronteras[[#This Row],[Frontera]])+2,0)),Datos[País],0),\"\"))","v":138}]
["Isla de Man",349.38473510742188,70.217720031738281,0.65826773643493652,0.6813386082649231,{"$f":"TablaFronteras[[#This Row],[X]]+TablaFronteras[[#This Row],[Ancho]]/2","v":349.71386897563934},{"$f":"TablaFronteras[[#This Row],[Y]]+TablaFronteras[[#This Row],[Alto]]/2","v":70.558389335870743},{"$f":"IF(AND(TablaFronteras[[#This Row],[Fila]]<>\"\",TablaFronteras[[#This Row],[X]]<miX,miX<TablaFronteras[[#This Row],[X]]+TablaFronteras[[#This Row],[Ancho]],TablaFronteras[[#This Row],[Y]]<miY,miY<TablaFronteras[[#This Row],[Y]]+TablaFronteras[[#This Row],[Alto]]),SQRT((TablaFronteras[[#This Row],[Centro X]]-miX)^2+(TablaFronteras[[#This Row],[Centro Y]]-miY)^2),\"\")","v":""},{"$f":"IF(TablaFronteras[[#This Row],[Frontera]]=\"\",\"\",IFERROR(MATCH(RIGHT(TablaFronteras[[#This Row],[Frontera]],LEN(TablaFronteras[[#This Row],[Frontera]])-IFERROR(FIND(\" - \",TablaFronteras[[#This Row],[Frontera]])+2,0)),Datos[País],0),\"\"))","v":114}]
["San Martín",225.25149536132813,158.47866821289063,0.32417324185371399,0.68866139650344849,{"$f":"TablaFronteras[[#This Row],[X]]+TablaFronteras[[#This Row],[Ancho]]/2","v":225.41358198225498},{"$f":"TablaFronteras[[#This Row],[Y]]+TablaFronteras[[#This Row],[Alto]]/2","v":158.82299891114235},{"$f":"IF(AND(TablaFronteras[[#This Row],[Fila]]<>\"\",TablaFronteras[[#This Row],[X]]<miX,miX<TablaFronteras[[#This Row],[X]]+TablaFronteras[[#This Row],[Ancho]],TablaFronteras[[#This Row],[Y]]<miY,miY<TablaFronteras[[#This Row],[Y]]+TablaFronteras[[#This Row],[Alto]]),SQRT((TablaFronteras[[#This Row],[Centro X]]-miX)^2+(TablaFronteras[[#This Row],[Centro Y]]-miY)^2),\"\")","v":""},{"$f":"IF(TablaFronteras[[#This Row],[Frontera]]=\"\",\"\",IFERROR(MATCH(RIGHT(TablaFronteras[[#This Row],[Frontera]],LEN(TablaFronteras[[#This Row],[Frontera]])-IFERROR(FIND(\" - \",TablaFronteras[[#This Row],[Frontera]])+2,0)),Datos[País],0),\"\"))","v":224}]
["Isla desconocida3",93.345588684082031,259.81716918945313,0.21858267486095428,0.21889764070510864,{"$f":"TablaFronteras[[#This Row],[X]]+TablaFronteras[[#This Row],[Ancho]]/2","v":93.454880021512508},{"$f":"TablaFronteras[[#This Row],[Y]]+TablaFronteras[[#This Row],[Alto]]/2","v":259.92661800980568},{"$f":"IF(AND(TablaFronteras[[#This Row],[Fila]]<>\"\",TablaFronteras[[#This Row],[X]]<miX,miX<TablaFronteras[[#This Row],[X]]+TablaFronteras[[#This Row],[Ancho]],TablaFronteras[[#This Row],[Y]]<miY,miY<TablaFronteras[[#This Row],[Y]]+TablaFronteras[[#This Row],[Alto]]),SQRT((TablaFronteras[[#This Row],[Centro X]]-miX)^2+(TablaFronteras[[#This Row],[Centro Y]]-miY)^2),\"\")","v":""},{"$f":"IF(TablaFronteras[[#This Row],[Frontera]]=\"\",\"\",IFERROR(MATCH(RIGHT(TablaFronteras[[#This Row],[Frontera]],LEN(TablaFronteras[[#This Row],[Frontera]])-IFERROR(FIND(\" - \",TablaFronteras[[#This Row],[Frontera]])+2,0)),Datos[País],0),\"\"))","v":""}]
["Isla desconocida2",7.15716552734375,247.43267822265625,0.23125983774662018,0.22740156948566437,{"$f":"TablaFronteras[[#This Row],[X]]+TablaFronteras[[#This Row],[Ancho]]/2","v":7.2727954462170601},{"$f":"TablaFronteras[[#This Row],[Y]]+TablaFronteras[[#This Row],[Alto]]/2","v":247.54637900739908},{"$f":"IF(AND(TablaFronteras[[#This Row],[Fila]]<>\"\",TablaFronteras[[#This Row],[X]]<miX,miX<TablaFronteras[[#This Row],[X]]+TablaFronteras[[#This Row],[Ancho]],TablaFronteras[[#This Row],[Y]]<miY,miY<TablaFronteras[[#This Row],[Y]]+TablaFronteras[[#This Row],[Alto]]),SQRT((TablaFronteras[[#This Row],[Centro X]]-miX)^2+(TablaFronteras[[#This Row],[Centro Y]]-miY)^2),\"\")","v":""},{"$f":"IF(TablaFronteras[[#This Row],[Frontera]]=\"\",\"\",IFERROR(MATCH(RIGHT(TablaFronteras[[#This Row],[Frontera]],LEN(TablaFronteras[[#This Row],[Frontera]])-IFERROR(FIND(\" - \",TablaFronteras[[#This Row],[Frontera]])+2,0)),Datos[País],0),\"\"))","v":""}]
["Isla desconocida1",27.371496200561523,251.92677307128906,0.2184251993894577,0.2389763742685318,{"$f":"TablaFronteras[[#This Row],[X]]+TablaFronteras[[#This Row],[Ancho]]/2","v":27.480708800256252},{"$f":"TablaFronteras[[#This Row],[Y]]+TablaFronteras[[#This Row],[Alto]]/2","v":252.04626125842333},{"$f":"IF(AND(TablaFronteras[[#This Row],[Fila]]<>\"\",TablaFronteras[[#This Row],[X]]<miX,miX<TablaFronteras[[#This Row],[X]]+TablaFronteras[[#This Row],[Ancho]],TablaFronteras[[#This Row],[Y]]<miY,miY<TablaFronteras[[#This Row],[Y]]+TablaFronteras[[#This Row],[Alto]]),SQRT((TablaFronteras[[#This Row],[Centro X]]-miX)^2+(TablaFronteras[[#This Row],[Centro Y]]-miY)^2),\"\")","v":""},{"$f":"IF(TablaFronteras[[#This Row],[Frontera]]=\"\",\"\",IFERROR(MATCH(RIGHT(TablaFronteras[[#This Row],[Frontera]],LEN(TablaFronteras[[#This Row],[Frontera]])-IFERROR(FIND(\" - \",TablaFronteras[[#This Row],[Frontera]])+2,0)),Datos[País],0),\"\"))","v":""}]
["Isla desconocida",26.364015579223633,195.64794921875,0.72543305158615112,1.073149561882019,{"$f":"TablaFronteras[[#This Row],[X]]+TablaFronteras[[#This Row],[Ancho]]/2","v":26.726732105016708},{"$f":"TablaFronteras[[#This Row],[Y]]+TablaFronteras[[#This Row],[Alto]]/2","v":196.18452399969101},{"$f":"IF(AND(TablaFronteras[[#This Row],[Fila]]<>\"\",TablaFronteras[[#This Row],[X]]<miX,miX<TablaFronteras[[#This Row],[X]]+TablaFronteras[[#This Row],[Ancho]],TablaFronteras[[#This Row],[Y]]<miY,miY<TablaFronteras[[#This Row],[Y]]+TablaFronteras[[#This Row],[Alto]]),SQRT((TablaFronteras[[#This Row],[Centro X]]-miX)^2+(TablaFronteras[[#This Row],[Centro Y]]-miY)^2),\"\")","v":""},{"$f":"IF(TablaFronteras[[#This Row],[Frontera]]=\"\",\"\",IFERROR(MATCH(RIGHT(TablaFronteras[[#This Row],[Frontera]],LEN(TablaFronteras[[#This Row],[Frontera]])-IFERROR(FIND(\" - \",TablaFronteras[[#This Row],[Frontera]])+2,0)),Datos[País],0),\"\"))","v":""}]
["Total",null,null,null,null,null,null,{"$f":"SUBTOTAL(105,TablaFronteras[Distancia])","v":0}]

{"sheet":"Banderas","index":3,"n_rows":251,"n_cols":6,"rows_kept":251,"cut":false,"hidden":false,"merged":[]}
["Continente","País","Código","Bandera"]
["Asia","Afganistán","af",null,null,{"$f":"MATCH(TablaBanderas[[#This Row],[País]],Fronteras!$A:$A,0)","v":111}]
["Europa","Albania","al",null,null,{"$f":"MATCH(TablaBanderas[[#This Row],[País]],Fronteras!$A:$A,0)","v":8}]
["Europa","Alemania","de",null,null,{"$f":"MATCH(TablaBanderas[[#This Row],[País]],Fronteras!$A:$A,0)","v":32}]
["Europa","Andorra","ad",null,null,{"$f":"MATCH(TablaBanderas[[#This Row],[País]],Fronteras!$A:$A,0)","v":198}]
["África","Angola","ao",null,null,{"$f":"MATCH(TablaBanderas[[#This Row],[País]],Fronteras!$A:$A,0)","v":92}]
["América del Norte","Anguila","ai",null,null,{"$f":"MATCH(TablaBanderas[[#This Row],[País]],Fronteras!$A:$A,0)","v":216}]
["Antártida","Antártida","aq",null,null,{"$f":"MATCH(TablaBanderas[[#This Row],[País]],Fronteras!$A:$A,0)","v":{"$error":"#N/A"}}]
["América del Norte","Antigua y Barbuda","ag",null,null,{"$f":"MATCH(TablaBanderas[[#This Row],[País]],Fronteras!$A:$A,0)","v":164}]
["Asia","Arabia Saudita","sa",null,null,{"$f":"MATCH(TablaBanderas[[#This Row],[País]],Fronteras!$A:$A,0)","v":133}]
["África","Argelia","dz",null,null,{"$f":"MATCH(TablaBanderas[[#This Row],[País]],Fronteras!$A:$A,0)","v":57}]
["América del Sur","Argentina","ar",null,null,{"$f":"MATCH(TablaBanderas[[#This Row],[País]],Fronteras!$A:$A,0)","v":163}]
["Asia","Armenia","am",null,null,{"$f":"MATCH(TablaBanderas[[#This Row],[País]],Fronteras!$A:$A,0)","v":114}]
["América del Norte","Aruba","aw",null,null,{"$f":"MATCH(TablaBanderas[[#This Row],[País]],Fronteras!$A:$A,0)","v":176}]
["Oceanía","Australia","au",null,null,{"$f":"MATCH(TablaBanderas[[#This Row],[País]],Fronteras!$A:$A,0)","v":12}]
["Europa","Austria","at",null,null,{"$f":"MATCH(TablaBanderas[[#This Row],[País]],Fronteras!$A:$A,0)","v":34}]
["Asia","Azerbaiyán","az",null,null,{"$f":"MATCH(TablaBanderas[[#This Row],[País]],Fronteras!$A:$A,0)","v":113}]
["América del Norte","Bahamas","bs",null,null,{"$f":"MATCH(TablaBanderas[[#This Row],[País]],Fronteras!$A:$A,0)","v":178}]
["Asia","Bangladés","bd",null,null,{"$f":"MATCH(TablaBanderas[[#This Row],[País]],Fronteras!$A:$A,0)","v":118}]
["América del Norte","Barbados","bb",null,null,{"$f":"MATCH(TablaBanderas[[#This Row],[País]],Fronteras!$A:$A,0)","v":172}]
["Asia","Baréin","bh",null,null,{"$f":"MATCH(TablaBanderas[[#This Row],[País]],Fronteras!$A:$A,0)","v":134}]
["Europa","Bélgica","be",null,null,{"$f":"MATCH(TablaBanderas[[#This Row],[País]],Fronteras!$A:$A,0)","v":29}]
["América del Norte","Belice","bz",null,null,{"$f":"MATCH(TablaBanderas[[#This Row],[País]],Fronteras!$A:$A,0)","v":144}]
["África","Benín","bj",null,null,{"$f":"MATCH(TablaBanderas[[#This Row],[País]],Fronteras!$A:$A,0)","v":71}]
["Europa","Bielorrusia","by",null,null,{"$f":"MATCH(TablaBanderas[[#This Row],[País]],Fronteras!$A:$A,0)","v":48}]
["Asia","Birmania","mm",null,null,{"$f":"MATCH(TablaBanderas[[#This Row],[País]],Fronteras!$A:$A,0)","v":119}]
["América del Sur","Bolivia","bo",null,null,{"$f":"MATCH(TablaBanderas[[#This Row],[País]],Fronteras!$A:$A,0)","v":159}]
["Europa","Bosnia y Herzegovina","ba",null,null,{"$f":"MATCH(TablaBanderas[[#This Row],[País]],Fronteras!$A:$A,0)","v":42}]
["África","Botsuana","bw",null,null,{"$f":"MATCH(TablaBanderas[[#This Row],[País]],Fronteras!$A:$A,0)","v":91}]
["América del Sur","Brasil","br",null,null,{"$f":"MATCH(TablaBanderas[[#This Row],[País]],Fronteras!$A:$A,0)","v":156}]
["Asia","Brunéi","bn",null,null,{"$f":"MATCH(TablaBanderas[[#This Row],[País]],Fronteras!$A:$A,0)","v":124}]
["Europa","Bulgaria","bg",null,null,{"$f":"MATCH(TablaBanderas[[#This Row],[País]],Fronteras!$A:$A,0)","v":9}]
["África","Burkina Faso","bf",null,null,{"$f":"MATCH(TablaBanderas[[#This Row],[País]],Fronteras!$A:$A,0)","v":68}]
["África","Burundi","bi",null,null,{"$f":"MATCH(TablaBanderas[[#This Row],[País]],Fronteras!$A:$A,0)","v":84}]
["Asia","Bután","bt",null,null,{"$f":"MATCH(TablaBanderas[[#This Row],[País]],Fronteras!$A:$A,0)","v":117}]
["África","Cabo Verde","cv",null,null,{"$f":"MATCH(TablaBanderas[[#This Row],[País]],Fronteras!$A:$A,0)","v":182}]
["Asia","Camboya","kh",null,null,{"$f":"MATCH(TablaBanderas[[#This Row],[País]],Fronteras!$A:$A,0)","v":140}]
["África","Camerún","cm",null,null,{"$f":"MATCH(TablaBanderas[[#This Row],[País]],Fronteras!$A:$A,0)","v":93}]
["América del Norte","Canadá","ca",null,null,{"$f":"MATCH(TablaBanderas[[#This Row],[País]],Fronteras!$A:$A,0)","v":15}]
["América del Sur","Caribe Neerlandés","bq",null,null,{"$f":"MATCH(TablaBanderas[[#This Row],[País]],Fronteras!$A:$A,0)","v":207}]
["Asia","Catar","qa",null,null,{"$f":"MATCH(TablaBanderas[[#This Row],[País]],Fronteras!$A:$A,0)","v":135}]
["África","Chad","td",null,null,{"$f":"MATCH(TablaBanderas[[#This Row],[País]],Fronteras!$A:$A,0)","v":74}]
["América del Sur","Chile","cl",null,null,{"$f":"MATCH(TablaBanderas[[#This Row],[País]],Fronteras!$A:$A,0)","v":162}]
["Asia","China","cn",null,null,{"$f":"MATCH(TablaBanderas[[#This Row],[País]],Fronteras!$A:$A,0)","v":11}]
["Asia","Chipre","cy",null,null,{"$f":"MATCH(TablaBanderas[[#This Row],[País]],Fronteras!$A:$A,0)","v":184}]
["América del Sur","Colombia","co",null,null,{"$f":"MATCH(TablaBanderas[[#This Row],[País]],Fronteras!$A:$A,0)","v":151}]
["África","Comoras","km",null,null,{"$f":"MATCH(TablaBanderas[[#This Row],[País]],Fronteras!$A:$A,0)","v":233}]
["Asia","Corea del Norte","kp",null,null,{"$f":"MATCH(TablaBanderas[[#This Row],[País]],Fronteras!$A:$A,0)","v":104}]
["Asia","Corea del Sur","kr",null,null,{"$f":"MATCH(TablaBanderas[[#This Row],[País]],Fronteras!$A:$A,0)","v":105}]
["África","Costa de Marfil","ci",null,null,{"$f":"MATCH(TablaBanderas[[#This Row],[País]],Fronteras!$A:$A,0)","v":67}]
["América del Norte","Costa Rica","cr",null,null,{"$f":"MATCH(TablaBanderas[[#This Row],[País]],Fronteras!$A:$A,0)","v":149}]
["Europa","Croacia","hr",null,null,{"$f":"MATCH(TablaBanderas[[#This Row],[País]],Fronteras!$A:$A,0)","v":41}]
["América del Norte","Cuba","cu",null,null,{"$f":"MATCH(TablaBanderas[[#This Row],[País]],Fronteras!$A:$A,0)","v":142}]
["América del Norte","Curazao","cw",null,null,{"$f":"MATCH(TablaBanderas[[#This Row],[País]],Fronteras!$A:$A,0)","v":206}]
["Europa","Dinamarca","dk",null,null,{"$f":"MATCH(TablaBanderas[[#This Row],[País]],Fronteras!$A:$A,0)","v":36}]
["América del Norte","Dominica","dm",null,null,{"$f":"MATCH(TablaBanderas[[#This Row],[País]],Fronteras!$A:$A,0)","v":171}]
["América del Sur","Ecuador","ec",null,null,{"$f":"MATCH(TablaBanderas[[#This Row],[País]],Fronteras!$A:$A,0)","v":157}]
["África","Egipto","eg",null,null,{"$f":"MATCH(TablaBanderas[[#This Row],[País]],Fronteras!$A:$A,0)","v":60}]
["América del Norte","El Salvador","sv",null,null,{"$f":"MATCH(TablaBanderas[[#This Row],[País]],Fronteras!$A:$A,0)","v":146}]
["Asia","Emiratos Árabes Unidos","ae",null,null,{"$f":"MATCH(TablaBanderas[[#This Row],[País]],Fronteras!$A:$A,0)","v":132}]
["África","Eritrea","er",null,null,{"$f":"MATCH(TablaBanderas[[#This Row],[País]],Fronteras!$A:$A,0)","v":77}]
["Europa","Eslovaquia","sk",null,null,{"$f":"MATCH(TablaBanderas[[#This Row],[País]],Fronteras!$A:$A,0)","v":38}]
["Europa","Eslovenia","si",null,null,{"$f":"MATCH(TablaBanderas[[#This Row],[País]],Fronteras!$A:$A,0)","v":40}]
["Europa","España","es",null,null,{"$f":"MATCH(TablaBanderas[[#This Row],[País]],Fronteras!$A:$A,0)","v":27}]
["América del Norte","Estados Unidos","us",null,null,{"$f":"MATCH(TablaBanderas[[#This Row],[País]],Fronteras!$A:$A,0)","v":16}]
["Europa","Estonia","ee",null,null,{"$f":"MATCH(TablaBanderas[[#This Row],[País]],Fronteras!$A:$A,0)","v":52}]
["África","Etiopía","et",null,null,{"$f":"MATCH(TablaBanderas[[#This Row],[País]],Fronteras!$A:$A,0)","v":79}]
["Asia","Filipinas","ph",null,null,{"$f":"MATCH(TablaBanderas[[#This Row],[País]],Fronteras!$A:$A,0)","v":123}]
["Europa","Finlandia","fi",null,null,{"$f":"MATCH(TablaBanderas[[#This Row],[País]],Fronteras!$A:$A,0)","v":53}]
["Oceanía","Fiyi","fj",null,null,{"$f":"MATCH(TablaBanderas[[#This Row],[País]],Fronteras!$A:$A,0)","v":190}]
["Europa","Francia","fr",null,null,{"$f":"MATCH(TablaBanderas[[#This Row],[País]],Fronteras!$A:$A,0)","v":25}]
["África","Gabón","ga",null,null,{"$f":"MATCH(TablaBanderas[[#This Row],[País]],Fronteras!$A:$A,0)","v":99}]
["África","Gambia","gm",null,null,{"$f":"MATCH(TablaBanderas[[#This Row],[País]],Fronteras!$A:$A,0)","v":196}]
["Asia","Georgia","ge",null,null,{"$f":"MATCH(TablaBanderas[[#This Row],[País]],Fronteras!$A:$A,0)","v":112}]
["África","Ghana","gh",null,null,{"$f":"MATCH(TablaBanderas[[#This Row],[País]],Fronteras!$A:$A,0)","v":69}]
["Europa","Gibraltar","gi",null,null,{"$f":"MATCH(TablaBanderas[[#This Row],[País]],Fronteras!$A:$A,0)","v":201}]
["América del Norte","Granada","gd",null,null,{"$f":"MATCH(TablaBanderas[[#This Row],[País]],Fronteras!$A:$A,0)","v":174}]
["Europa","Grecia","gr",null,null,{"$f":"MATCH(TablaBanderas[[#This Row],[País]],Fronteras!$A:$A,0)","v":45}]
["América del Norte","Groenlandia","gl",null,null,{"$f":"MATCH(TablaBanderas[[#This Row],[País]],Fronteras!$A:$A,0)","v":14}]
["América del Norte","Guadalupe","gp",null,null,{"$f":"MATCH(TablaBanderas[[#This Row],[País]],Fronteras!$A:$A,0)","v":168}]
["Oceanía","Guam","gu",null,null,{"$f":"MATCH(TablaBanderas[[#This Row],[País]],Fronteras!$A:$A,0)","v":223}]
["América del Norte","Guatemala","gt",null,null,{"$f":"MATCH(TablaBanderas[[#This Row],[País]],Fronteras!$A:$A,0)","v":145}]
["América del Sur","Guayana Francesa","gf",null,null,{"$f":"MATCH(TablaBanderas[[#This Row],[País]],Fronteras!$A:$A,0)","v":155}]
["Europa","Guernsey","gg",null,null,{"$f":"MATCH(TablaBanderas[[#This Row],[País]],Fronteras!$A:$A,0)","v":211}]
["África","Guinea","gn",null,null,{"$f":"MATCH(TablaBanderas[[#This Row],[País]],Fronteras!$A:$A,0)","v":64}]
["África","Guinea Ecuatorial","gq",null,null,{"$f":"MATCH(TablaBanderas[[#This Row],[País]],Fronteras!$A:$A,0)","v":100}]
["África","Guinea-Bisáu","gw",null,null,{"$f":"MATCH(TablaBanderas[[#This Row],[País]],Fronteras!$A:$A,0)","v":63}]
["América del Sur","Guyana","gy",null,null,{"$f":"MATCH(TablaBanderas[[#This Row],[País]],Fronteras!$A:$A,0)","v":153}]
["América del Norte","Haití","ht",null,null,{"$f":"MATCH(TablaBanderas[[#This Row],[País]],Fronteras!$A:$A,0)","v":180}]
["América del Norte","Honduras","hn",null,null,{"$f":"MATCH(TablaBanderas[[#This Row],[País]],Fronteras!$A:$A,0)","v":147}]
["Asia","Hong Kong","hk",null,null,{"$f":"MATCH(TablaBanderas[[#This Row],[País]],Fronteras!$A:$A,0)","v":{"$error":"#N/A"}}]
["Europa","Hungría","hu",null,null,{"$f":"MATCH(TablaBanderas[[#This Row],[País]],Fronteras!$A:$A,0)","v":39}]
["Asia","India","in",null,null,{"$f":"MATCH(TablaBanderas[[#This Row],[País]],Fronteras!$A:$A,0)","v":17}]
["Asia","Indonesia","id",null,null,{"$f":"MATCH(TablaBanderas[[#This Row],[País]],Fronteras!$A:$A,0)","v":13}]
["Asia","Irak","iq",null,null,{"$f":"MATCH(TablaBanderas[[#This Row],[País]],Fronteras!$A:$A,0)","v":136}]
["Asia","Irán","ir",null,null,{"$f":"MATCH(TablaBanderas[[#This Row],[País]],Fronteras!$A:$A,0)","v":106}]
["Europa","Irlanda","ie",null,null,{"$f":"MATCH(TablaBanderas[[#This Row],[País]],Fronteras!$A:$A,0)","v":30}]
["Antártida","Isla Bouvet","bv",null,null,{"$f":"MATCH(TablaBanderas[[#This Row],[País]],Fronteras!$A:$A,0)","v":{"$error":"#N/A"}}]
["Europa","Isla de Man","im",null,null,{"$f":"MATCH(TablaBanderas[[#This Row],[País]],Fronteras!$A:$A,0)","v":239}]
["Oceanía","Isla de Navidad","cx",null,null,{"$f":"MATCH(TablaBanderas[[#This Row],[País]],Fronteras!$A:$A,0)","v":{"$error":"#N/A"}}]
["Oceanía","Isla Heard e Islas McDonald","hm",null,null,{"$f":"MATCH(TablaBanderas[[#This Row],[País]],Fronteras!$A:$A,0)","v":{"$error":"#N/A"}}]
["Oceanía","Isla Norfolk","nf",null,null,{"$f":"MATCH(TablaBanderas[[#This Row],[País]],Fronteras!$A:$A,0)","v":{"$error":"#N/A"}}]
["Europa","Islandia","is",null,null,{"$f":"MATCH(TablaBanderas[[#This Row],[País]],Fronteras!$A:$A,0)","v":23}]
["Europa","Islas Åland","ax",null,null,{"$f":"MATCH(TablaBanderas[[#This Row],[País]],Fronteras!$A:$A,0)","v":{"$error":"#N/A"}}]
["América del Norte","Bermudas","bm",null,null,{"$f":"MATCH(TablaBanderas[[#This Row],[País]],Fronteras!$A:$A,0)","v":212}]
["América del Norte","Islas Caimán","ky",null,null,{"$f":"MATCH(TablaBanderas[[#This Row],[País]],Fronteras!$A:$A,0)","v":177}]
["Oceanía","Islas Cocos","cc",null,null,{"$f":"MATCH(TablaBanderas[[#This Row],[País]],Fronteras!$A:$A,0)","v":{"$error":"#N/A"}}]
["Oceanía","Islas Cook","ck",null,null,{"$f":"MATCH(TablaBanderas[[#This Row],[País]],Fronteras!$A:$A,0)","v":235}]
["Europa","Islas del Canal","je",null,null,{"$f":"MATCH(TablaBanderas[[#This Row],[País]],Fronteras!$A:$A,0)","v":{"$error":"#N/A"}}]
["Europa","Islas Feroe","fo",null,null,{"$f":"MATCH(TablaBanderas[[#This Row],[País]],Fronteras!$A:$A,0)","v":187}]
["América del Sur","Islas Georgias y Sandwich","gs",null,null,{"$f":"MATCH(TablaBanderas[[#This Row],[País]],Fronteras!$A:$A,0)","v":229}]
["América del Sur","Islas Malvinas","fk",null,null,{"$f":"MATCH(TablaBanderas[[#This Row],[País]],Fronteras!$A:$A,0)","v":195}]
["Oceanía","Islas Marianas del Norte","mp",null,null,{"$f":"MATCH(TablaBanderas[[#This Row],[País]],Fronteras!$A:$A,0)","v":215}]
["Oceanía","Islas Marshall","mh",null,null,{"$f":"MATCH(TablaBanderas[[#This Row],[País]],Fronteras!$A:$A,0)","v":218}]
["Oceanía","Islas Pitcairn","pn",null,null,{"$f":"MATCH(TablaBanderas[[#This Row],[País]],Fronteras!$A:$A,0)","v":234}]
["Oceanía","Islas Salomón","sb",null,null,{"$f":"MATCH(TablaBanderas[[#This Row],[País]],Fronteras!$A:$A,0)","v":127}]
["América del Norte","Islas Turcas y Caicos","tc",null,null,{"$f":"MATCH(TablaBanderas[[#This Row],[País]],Fronteras!$A:$A,0)","v":179}]
["Oceanía","Islas Ultramarinas Menores de los Estados Unidos","um",null,null,{"$f":"MATCH(TablaBanderas[[#This Row],[País]],Fronteras!$A:$A,0)","v":{"$error":"#N/A"}}]
["América del Norte","Islas Vírgenes Británicas","vg",null,null,{"$f":"MATCH(TablaBanderas[[#This Row],[País]],Fronteras!$A:$A,0)","v":165}]
["América del Norte","Islas Vírgenes de Estados Unidos","vi",null,null,{"$f":"MATCH(TablaBanderas[[#This Row],[País]],Fronteras!$A:$A,0)","v":166}]
["Oceanía","Islas Wallis y Futuna","wf",null,null,{"$f":"MATCH(TablaBanderas[[#This Row],[País]],Fronteras!$A:$A,0)","v":{"$error":"#N/A"}}]
["Asia","Israel","il",null,null,{"$f":"MATCH(TablaBanderas[[#This Row],[País]],Fronteras!$A:$A,0)","v":139}]
["Europa","Italia","it",null,null,{"$f":"MATCH(TablaBanderas[[#This Row],[País]],Fronteras!$A:$A,0)","v":26}]
["América del Norte","Jamaica","jm",null,null,{"$f":"MATCH(TablaBanderas[[#This Row],[País]],Fronteras!$A:$A,0)","v":3}]
["Asia","Japón","jp",null,null,{"$f":"MATCH(TablaBanderas[[#This Row],[País]],Fronteras!$A:$A,0)","v":103}]
["Asia","Jordania","jo",null,null,{"$f":"MATCH(TablaBanderas[[#This Row],[País]],Fronteras!$A:$A,0)","v":137}]
["Asia","Kazajistán","kz",null,null,{"$f":"MATCH(TablaBanderas[[#This Row],[País]],Fronteras!$A:$A,0)","v":101}]
["África","Kenia","ke",null,null,{"$f":"MATCH(TablaBanderas[[#This Row],[País]],Fronteras!$A:$A,0)","v":81}]
["Asia","Kirguistán","kg",null,null,{"$f":"MATCH(TablaBanderas[[#This Row],[País]],Fronteras!$A:$A,0)","v":109}]
["Oceanía","Kiribati","ki",null,null,{"$f":"MATCH(TablaBanderas[[#This Row],[País]],Fronteras!$A:$A,0)","v":221}]
["Europa","Kosovo","xk",null,null,{"$f":"MATCH(TablaBanderas[[#This Row],[País]],Fronteras!$A:$A,0)","v":226}]
["Asia","Kuwait","kw",null,null,{"$f":"MATCH(TablaBanderas[[#This Row],[País]],Fronteras!$A:$A,0)","v":204}]
["Asia","Laos","la",null,null,{"$f":"MATCH(TablaBanderas[[#This Row],[País]],Fronteras!$A:$A,0)","v":122}]
["África","Lesoto","ls",null,null,{"$f":"MATCH(TablaBanderas[[#This Row],[País]],Fronteras!$A:$A,0)","v":97}]
["Europa","Letonia","lv",null,null,{"$f":"MATCH(TablaBanderas[[#This Row],[País]],Fronteras!$A:$A,0)","v":51}]
["Asia","Líbano","lb",null,null,{"$f":"MATCH(TablaBanderas[[#This Row],[País]],Fronteras!$A:$A,0)","v":193}]
["África","Liberia","lr",null,null,{"$f":"MATCH(TablaBanderas[[#This Row],[País]],Fronteras!$A:$A,0)","v":66}]
["África","Libia","ly",null,null,{"$f":"MATCH(TablaBanderas[[#This Row],[País]],Fronteras!$A:$A,0)","v":59}]
["Europa","Liechtenstein","li",null,null,{"$f":"MATCH(TablaBanderas[[#This Row],[País]],Fronteras!$A:$A,0)","v":199}]
["Europa","Lituania","lt",null,null,{"$f":"MATCH(TablaBanderas[[#This Row],[País]],Fronteras!$A:$A,0)","v":50}]
["Europa","Luxemburgo","lu",null,null,{"$f":"MATCH(TablaBanderas[[#This Row],[País]],Fronteras!$A:$A,0)","v":197}]
["Asia","Macao","mo",null,null,{"$f":"MATCH(TablaBanderas[[#This Row],[País]],Fronteras!$A:$A,0)","v":{"$error":"#N/A"}}]
["Europa","Macedonia del Norte","mk",null,null,{"$f":"MATCH(TablaBanderas[[#This Row],[País]],Fronteras!$A:$A,0)","v":44}]
["África","Madagascar","mg",null,null,{"$f":"MATCH(TablaBanderas[[#This Row],[País]],Fronteras!$A:$A,0)","v":89}]
["Asia","Malasia","my",null,null,{"$f":"MATCH(TablaBanderas[[#This Row],[País]],Fronteras!$A:$A,0)","v":19}]
["África","Malaui","mw",null,null,{"$f":"MATCH(TablaBanderas[[#This Row],[País]],Fronteras!$A:$A,0)","v":88}]
["Asia","Maldivas","mv",null,null,{"$f":"MATCH(TablaBanderas[[#This Row],[País]],Fronteras!$A:$A,0)","v":220}]
["África","Malí","ml",null,null,{"$f":"MATCH(TablaBanderas[[#This Row],[País]],Fronteras!$A:$A,0)","v":61}]
["Europa","Malta","mt",null,null,{"$f":"MATCH(TablaBanderas[[#This Row],[País]],Fronteras!$A:$A,0)","v":183}]
["África","Marruecos","ma",null,null,{"$f":"MATCH(TablaBanderas[[#This Row],[País]],Fronteras!$A:$A,0)","v":55}]
["América del Norte","Martinica","mq",null,null,{"$f":"MATCH(TablaBanderas[[#This Row],[País]],Fronteras!$A:$A,0)","v":170}]
["África","Mauricio","mu",null,null,{"$f":"MATCH(TablaBanderas[[#This Row],[País]],Fronteras!$A:$A,0)","v":231}]
["África","Mauritania","mr",null,null,{"$f":"MATCH(TablaBanderas[[#This Row],[País]],Fronteras!$A:$A,0)","v":62}]
["África","Mayotte","yt",null,null,{"$f":"MATCH(TablaBanderas[[#This Row],[País]],Fronteras!$A:$A,0)","v":232}]
["América del Norte","México","mx",null,null,{"$f":"MATCH(TablaBanderas[[#This Row],[País]],Fronteras!$A:$A,0)","v":141}]
["Oceanía","Micronesia","fm",null,null,{"$f":"MATCH(TablaBanderas[[#This Row],[País]],Fronteras!$A:$A,0)","v":222}]
["Europa","Moldavia","md",null,null,{"$f":"MATCH(TablaBanderas[[#This Row],[País]],Fronteras!$A:$A,0)","v":49}]
["Europa","Mónaco","mc",null,null,{"$f":"MATCH(TablaBanderas[[#This Row],[País]],Fronteras!$A:$A,0)","v":202}]
["Asia","Mongolia","mn",null,null,{"$f":"MATCH(TablaBanderas[[#This Row],[País]],Fronteras!$A:$A,0)","v":102}]
["Europa","Montenegro","me",null,null,{"$f":"MATCH(TablaBanderas[[#This Row],[País]],Fronteras!$A:$A,0)","v":43}]
["América del Norte","Montserrat","ms",null,null,{"$f":"MATCH(TablaBanderas[[#This Row],[País]],Fronteras!$A:$A,0)","v":167}]
["África","Mozambique","mz",null,null,{"$f":"MATCH(TablaBanderas[[#This Row],[País]],Fronteras!$A:$A,0)","v":87}]
["África","Namibia","na",null,null,{"$f":"MATCH(TablaBanderas[[#This Row],[País]],Fronteras!$A:$A,0)","v":95}]
["Oceanía","Nauru","nr",null,null,{"$f":"MATCH(TablaBanderas[[#This Row],[País]],Fronteras!$A:$A,0)","v":214}]
["Asia","Nepal","np",null,null,{"$f":"MATCH(TablaBanderas[[#This Row],[País]],Fronteras!$A:$A,0)","v":116}]
["América del Norte","Nicaragua","ni",null,null,{"$f":"MATCH(TablaBanderas[[#This Row],[País]],Fronteras!$A:$A,0)","v":148}]
["África","Níger","ne",null,null,{"$f":"MATCH(TablaBanderas[[#This Row],[País]],Fronteras!$A:$A,0)","v":73}]
["África","Nigeria","ng",null,null,{"$f":"MATCH(TablaBanderas[[#This Row],[País]],Fronteras!$A:$A,0)","v":72}]
["Oceanía","Niue","nu",null,null,{"$f":"MATCH(TablaBanderas[[#This Row],[País]],Fronteras!$A:$A,0)","v":{"$error":"#N/A"}}]
["Europa","Noruega","no",null,null,{"$f":"MATCH(TablaBanderas[[#This Row],[País]],Fronteras!$A:$A,0)","v":10}]
["Oceanía","Nueva Caledonia","nc",null,null,{"$f":"MATCH(TablaBanderas[[#This Row],[País]],Fronteras!$A:$A,0)","v":188}]
["Oceanía","Nueva Zelanda","nz",null,null,{"$f":"MATCH(TablaBanderas[[#This Row],[País]],Fronteras!$A:$A,0)","v":128}]
["Asia","Omán","om",null,null,{"$f":"MATCH(TablaBanderas[[#This Row],[País]],Fronteras!$A:$A,0)","v":131}]
["Europa","Países Bajos","nl",null,null,{"$f":"MATCH(TablaBanderas[[#This Row],[País]],Fronteras!$A:$A,0)","v":24}]
["Asia","Pakistán","pk",null,null,{"$f":"MATCH(TablaBanderas[[#This Row],[País]],Fronteras!$A:$A,0)","v":115}]
["Oceanía","Palaos","pw",null,null,{"$f":"MATCH(TablaBanderas[[#This Row],[País]],Fronteras!$A:$A,0)","v":228}]
["Asia","Palestina","ps",null,null,{"$f":"MATCH(TablaBanderas[[#This Row],[País]],Fronteras!$A:$A,0)","v":194}]
["América del Norte","Panamá","pa",null,null,{"$f":"MATCH(TablaBanderas[[#This Row],[País]],Fronteras!$A:$A,0)","v":150}]
["Oceanía","Papúa Nueva Guinea","pg",null,null,{"$f":"MATCH(TablaBanderas[[#This Row],[País]],Fronteras!$A:$A,0)","v":126}]
["América del Sur","Paraguay","py",null,null,{"$f":"MATCH(TablaBanderas[[#This Row],[País]],Fronteras!$A:$A,0)","v":160}]
["América del Sur","Perú","pe",null,null,{"$f":"MATCH(TablaBanderas[[#This Row],[País]],Fronteras!$A:$A,0)","v":158}]
["Oceanía","Polinesia Francesa","pf",null,null,{"$f":"MATCH(TablaBanderas[[#This Row],[País]],Fronteras!$A:$A,0)","v":{"$error":"#N/A"}}]
["Europa","Polonia","pl",null,null,{"$f":"MATCH(TablaBanderas[[#This Row],[País]],Fronteras!$A:$A,0)","v":37}]
["Europa","Portugal","pt",null,null,{"$f":"MATCH(TablaBanderas[[#This Row],[País]],Fronteras!$A:$A,0)","v":28}]
["América del Norte","Puerto Rico","pr",null,null,{"$f":"MATCH(TablaBanderas[[#This Row],[País]],Fronteras!$A:$A,0)","v":2}]
["Europa","Reino Unido","gb",null,null,{"$f":"MATCH(TablaBanderas[[#This Row],[País]],Fronteras!$A:$A,0)","v":31}]
["África","República Centroafricana","cf",null,null,{"$f":"MATCH(TablaBanderas[[#This Row],[País]],Fronteras!$A:$A,0)","v":94}]
["Europa","República Checa","cz",null,null,{"$f":"MATCH(TablaBanderas[[#This Row],[País]],Fronteras!$A:$A,0)","v":35}]
["África","República del Congo","cg",null,null,{"$f":"MATCH(TablaBanderas[[#This Row],[País]],Fronteras!$A:$A,0)","v":6}]
["África","República Democrática del Congo","cd",null,null,{"$f":"MATCH(TablaBanderas[[#This Row],[País]],Fronteras!$A:$A,0)","v":5}]
["América del Norte","República Dominicana","do",null,null,{"$f":"MATCH(TablaBanderas[[#This Row],[País]],Fronteras!$A:$A,0)","v":143}]
["África","Reunión","re",null,null,{"$f":"MATCH(TablaBanderas[[#This Row],[País]],Fronteras!$A:$A,0)","v":230}]
["África","Ruanda","rw",null,null,{"$f":"MATCH(TablaBanderas[[#This Row],[País]],Fronteras!$A:$A,0)","v":83}]
["Europa","Rumanía","ro",null,null,{"$f":"MATCH(TablaBanderas[[#This Row],[País]],Fronteras!$A:$A,0)","v":47}]
["Europa","Rusia","ru",null,null,{"$f":"MATCH(TablaBanderas[[#This Row],[País]],Fronteras!$A:$A,0)","v":21}]
["África","Sáhara Occidental","eh",null,null,{"$f":"MATCH(TablaBanderas[[#This Row],[País]],Fronteras!$A:$A,0)","v":56}]
["Oceanía","Samoa","ws",null,null,{"$f":"MATCH(TablaBanderas[[#This Row],[País]],Fronteras!$A:$A,0)","v":227}]
["Oceanía","Samoa Americana","as",null,null,{"$f":"MATCH(TablaBanderas[[#This Row],[País]],Fronteras!$A:$A,0)","v":208}]
["América del Norte","San Bartolomé","bl",null,null,{"$f":"MATCH(TablaBanderas[[#This Row],[País]],Fronteras!$A:$A,0)","v":210}]
["América del Norte","San Cristóbal y Nieves","kn",null,null,{"$f":"MATCH(TablaBanderas[[#This Row],[País]],Fronteras!$A:$A,0)","v":205}]
["Europa","San Marino","sm",null,null,{"$f":"MATCH(TablaBanderas[[#This Row],[País]],Fronteras!$A:$A,0)","v":200}]
["América del Norte","San Martín","mf",null,null,{"$f":"MATCH(TablaBanderas[[#This Row],[País]],Fronteras!$A:$A,0)","v":240}]
["América del Norte","San Martín (Países Bajos)","sx",null,null,{"$f":"MATCH(TablaBanderas[[#This Row],[País]],Fronteras!$A:$A,0)","v":236}]
["América del Norte","San Pedro y Miquelón","pm",null,null,{"$f":"MATCH(TablaBanderas[[#This Row],[País]],Fronteras!$A:$A,0)","v":237}]
["América del Norte","San Vicente y las Granadinas","vc",null,null,{"$f":"MATCH(TablaBanderas[[#This Row],[País]],Fronteras!$A:$A,0)","v":173}]
["África","Santa Elena","sh",null,null,{"$f":"MATCH(TablaBanderas[[#This Row],[País]],Fronteras!$A:$A,0)","v":209}]
["América del Norte","Santa Lucía","lc",null,null,{"$f":"MATCH(TablaBanderas[[#This Row],[País]],Fronteras!$A:$A,0)","v":169}]
["África","Santo Tomé y Príncipe","st",null,null,{"$f":"MATCH(TablaBanderas[[#This Row],[País]],Fronteras!$A:$A,0)","v":181}]
["África","Senegal","sn",null,null,{"$f":"MATCH(TablaBanderas[[#This Row],[País]],Fronteras!$A:$A,0)","v":7}]
["Europa","Serbia","rs",null,null,{"$f":"MATCH(TablaBanderas[[#This Row],[País]],Fronteras!$A:$A,0)","v":225}]
["África","Seychelles","sc",null,null,{"$f":"MATCH(TablaBanderas[[#This Row],[País]],Fronteras!$A:$A,0)","v":224}]
["África","Sierra Leona","sl",null,null,{"$f":"MATCH(TablaBanderas[[#This Row],[País]],Fronteras!$A:$A,0)","v":65}]
["Asia","Singapur","sg",null,null,{"$f":"MATCH(TablaBanderas[[#This Row],[País]],Fronteras!$A:$A,0)","v":125}]
["Asia","Siria","sy",null,null,{"$f":"MATCH(TablaBanderas[[#This Row],[País]],Fronteras!$A:$A,0)","v":138}]
["África","Somalia","so",null,null,{"$f":"MATCH(TablaBanderas[[#This Row],[País]],Fronteras!$A:$A,0)","v":78}]
["Asia","Sri Lanka","lk",null,null,{"$f":"MATCH(TablaBanderas[[#This Row],[País]],Fronteras!$A:$A,0)","v":129}]
["África","Suazilandia","sz",null,null,{"$f":"MATCH(TablaBanderas[[#This Row],[País]],Fronteras!$A:$A,0)","v":98}]
["África","Sudáfrica","za",null,null,{"$f":"MATCH(TablaBanderas[[#This Row],[País]],Fronteras!$A:$A,0)","v":96}]
["África","Sudán","sd",null,null,{"$f":"MATCH(TablaBanderas[[#This Row],[País]],Fronteras!$A:$A,0)","v":75}]
["África","Sudán del Sur","ss",null,null,{"$f":"MATCH(TablaBanderas[[#This Row],[País]],Fronteras!$A:$A,0)","v":76}]
["Europa","Suecia","se",null,null,{"$f":"MATCH(TablaBanderas[[#This Row],[País]],Fronteras!$A:$A,0)","v":54}]
["Europa","Suiza","ch",null,null,{"$f":"MATCH(TablaBanderas[[#This Row],[País]],Fronteras!$A:$A,0)","v":33}]
["América del Sur","Surinam","sr",null,null,{"$f":"MATCH(TablaBanderas[[#This Row],[País]],Fronteras!$A:$A,0)","v":154}]
["Europa","Svalbard y Jan Mayen","sj",null,null,{"$f":"MATCH(TablaBanderas[[#This Row],[País]],Fronteras!$A:$A,0)","v":{"$error":"#N/A"}}]
["Asia","Tailandia","th",null,null,{"$f":"MATCH(TablaBanderas[[#This Row],[País]],Fronteras!$A:$A,0)","v":121}]
["Asia","Taiwán","tw",null,null,{"$f":"MATCH(TablaBanderas[[#This Row],[País]],Fronteras!$A:$A,0)","v":20}]
["África","Tanzania","tz",null,null,{"$f":"MATCH(TablaBanderas[[#This Row],[País]],Fronteras!$A:$A,0)","v":85}]
["Asia","Tayikistán","tj",null,null,{"$f":"MATCH(TablaBanderas[[#This Row],[País]],Fronteras!$A:$A,0)","v":110}]
["Asia","Territorio Británico del Índico","io",null,null,{"$f":"MATCH(TablaBanderas[[#This Row],[País]],Fronteras!$A:$A,0)","v":219}]
["Antártida","Tierras Australes Francesas","tf",null,null,{"$f":"MATCH(TablaBanderas[[#This Row],[País]],Fronteras!$A:$A,0)","v":4}]
["Asia","Timor Oriental","tl",null,null,{"$f":"MATCH(TablaBanderas[[#This Row],[País]],Fronteras!$A:$A,0)","v":192}]
["África","Togo","tg",null,null,{"$f":"MATCH(TablaBanderas[[#This Row],[País]],Fronteras!$A:$A,0)","v":70}]
["Oceanía","Tokelau","tk",null,null,{"$f":"MATCH(TablaBanderas[[#This Row],[País]],Fronteras!$A:$A,0)","v":217}]
["Oceanía","Tonga","to",null,null,{"$f":"MATCH(TablaBanderas[[#This Row],[País]],Fronteras!$A:$A,0)","v":191}]
["América del Norte","Trinidad y Tobago","tt",null,null,{"$f":"MATCH(TablaBanderas[[#This Row],[País]],Fronteras!$A:$A,0)","v":175}]
["África","Túnez","tn",null,null,{"$f":"MATCH(TablaBanderas[[#This Row],[País]],Fronteras!$A:$A,0)","v":58}]
["Asia","Turkmenistán","tm",null,null,{"$f":"MATCH(TablaBanderas[[#This Row],[País]],Fronteras!$A:$A,0)","v":107}]
["Asia","Turquía","tr",null,null,{"$f":"MATCH(TablaBanderas[[#This Row],[País]],Fronteras!$A:$A,0)","v":46}]
["Oceanía","Tuvalu","tv",null,null,{"$f":"MATCH(TablaBanderas[[#This Row],[País]],Fronteras!$A:$A,0)","v":213}]
["Europa","Ucrania","ua",null,null,{"$f":"MATCH(TablaBanderas[[#This Row],[País]],Fronteras!$A:$A,0)","v":18}]
["África","Uganda","ug",null,null,{"$f":"MATCH(TablaBanderas[[#This Row],[País]],Fronteras!$A:$A,0)","v":82}]
["América del Sur","Uruguay","uy",null,null,{"$f":"MATCH(TablaBanderas[[#This Row],[País]],Fronteras!$A:$A,0)","v":161}]
["Asia","Uzbekistán","uz",null,null,{"$f":"MATCH(TablaBanderas[[#This Row],[País]],Fronteras!$A:$A,0)","v":108}]
["Oceanía","Vanuatu","vu",null,null,{"$f":"MATCH(TablaBanderas[[#This Row],[País]],Fronteras!$A:$A,0)","v":189}]
["Europa","Ciudad del Vaticano","va",null,null,{"$f":"MATCH(TablaBanderas[[#This Row],[País]],Fronteras!$A:$A,0)","v":203}]
["América del Sur","Venezuela","ve",null,null,{"$f":"MATCH(TablaBanderas[[#This Row],[País]],Fronteras!$A:$A,0)","v":152}]
["Asia","Vietnam","vn",null,null,{"$f":"MATCH(TablaBanderas[[#This Row],[País]],Fronteras!$A:$A,0)","v":120}]
["Asia","Yemen","ye",null,null,{"$f":"MATCH(TablaBanderas[[#This Row],[País]],Fronteras!$A:$A,0)","v":130}]
["África","Yibuti","dj",null,null,{"$f":"MATCH(TablaBanderas[[#This Row],[País]],Fronteras!$A:$A,0)","v":80}]
["África","Zambia","zm",null,null,{"$f":"MATCH(TablaBanderas[[#This Row],[País]],Fronteras!$A:$A,0)","v":86}]
["África","Zimbabue","zw",null,null,{"$f":"MATCH(TablaBanderas[[#This Row],[País]],Fronteras!$A:$A,0)","v":90}]

{"sheet":"Países","index":4,"n_rows":233,"n_cols":6,"rows_kept":233,"cut":false,"hidden":false,"merged":[]}
["Continente","País","Nombre corto","Nombre oficial","Country","Población"]
["Asia","Afganistán",null,{"$f":"IFERROR(VLOOKUP(TablaPaíses[[#This Row],[País]],Nombres[],2,FALSE),IFERROR(VLOOKUP(\"*\"&TablaPaíses[[#This Row],[Country]]&\"*\",Nombres[],2,FALSE),IFERROR(VLOOKUP(TablaPaíses[[#This Row],[Nombre corto]],Nombres[],2,FALSE),IF(TablaPaíses[[#This Row],[Nombre corto]]<>\"\",TablaPaíses[[#This Row],[Nombre corto]],TablaPaíses[[#This Row],[País]]&\"*\"))))","v":"República Islámica de Afganistán"},"Afghanistan",{"$f":"IFERROR(VLOOKUP(TablaPaíses[[#This Row],[Country]],Population[],2,FALSE),\"\")","v":43214221}]
["Europa","Albania",null,{"$f":"IFERROR(VLOOKUP(TablaPaíses[[#This Row],[País]],Nombres[],2,FALSE),IFERROR(VLOOKUP(\"*\"&TablaPaíses[[#This Row],[Country]]&\"*\",Nombres[],2,FALSE),IFERROR(VLOOKUP(TablaPaíses[[#This Row],[Nombre corto]],Nombres[],2,FALSE),IF(TablaPaíses[[#This Row],[Nombre corto]]<>\"\",TablaPaíses[[#This Row],[Nombre corto]],TablaPaíses[[#This Row],[País]]&\"*\"))))","v":"República de Albania"},"Albania",{"$f":"IFERROR(VLOOKUP(TablaPaíses[[#This Row],[Country]],Population[],2,FALSE),\"\")","v":2875314}]
["Europa","Alemania",null,{"$f":"IFERROR(VLOOKUP(TablaPaíses[[#This Row],[País]],Nombres[],2,FALSE),IFERROR(VLOOKUP(\"*\"&TablaPaíses[[#This Row],[Country]]&\"*\",Nombres[],2,FALSE),IFERROR(VLOOKUP(TablaPaíses[[#This Row],[Nombre corto]],Nombres[],2,FALSE),IF(TablaPaíses[[#This Row],[Nombre corto]]<>\"\",TablaPaíses[[#This Row],[Nombre corto]],TablaPaíses[[#This Row],[País]]&\"*\"))))","v":"República Federal de Alemania"},"Germany",{"$f":"IFERROR(VLOOKUP(TablaPaíses[[#This Row],[Country]],Population[],2,FALSE),\"\")","v":83856583}]
["África","Argelia",null,{"$f":"IFERROR(VLOOKUP(TablaPaíses[[#This Row],[País]],Nombres[],2,FALSE),IFERROR(VLOOKUP(\"*\"&TablaPaíses[[#This Row],[Country]]&\"*\",Nombres[],2,FALSE),IFERROR(VLOOKUP(TablaPaíses[[#This Row],[Nombre corto]],Nombres[],2,FALSE),IF(TablaPaíses[[#This Row],[Nombre corto]]<>\"\",TablaPaíses[[#This Row],[Nombre corto]],TablaPaíses[[#This Row],[País]]&\"*\"))))","v":"República Argelina Democrática y Popular"},"Algeria",{"$f":"IFERROR(VLOOKUP(TablaPaíses[[#This Row],[Country]],Population[],2,FALSE),\"\")","v":46790907}]
["Europa","Andorra",null,{"$f":"IFERROR(VLOOKUP(TablaPaíses[[#This Row],[País]],Nombres[],2,FALSE),IFERROR(VLOOKUP(\"*\"&TablaPaíses[[#This Row],[Country]]&\"*\",Nombres[],2,FALSE),IFERROR(VLOOKUP(TablaPaíses[[#This Row],[Nombre corto]],Nombres[],2,FALSE),IF(TablaPaíses[[#This Row],[Nombre corto]]<>\"\",TablaPaíses[[#This Row],[Nombre corto]],TablaPaíses[[#This Row],[País]]&\"*\"))))","v":"Principado de Andorra"},"Andorra",{"$f":"IFERROR(VLOOKUP(TablaPaíses[[#This Row],[Country]],Population[],2,FALSE),\"\")","v":78206}]
["África","Angola",null,{"$f":"IFERROR(VLOOKUP(TablaPaíses[[#This Row],[País]],Nombres[],2,FALSE),IFERROR(VLOOKUP(\"*\"&TablaPaíses[[#This Row],[Country]]&\"*\",Nombres[],2,FALSE),IFERROR(VLOOKUP(TablaPaíses[[#This Row],[Nombre corto]],Nombres[],2,FALSE),IF(TablaPaíses[[#This Row],[Nombre corto]]<>\"\",TablaPaíses[[#This Row],[Nombre corto]],TablaPaíses[[#This Row],[País]]&\"*\"))))","v":"República de Angola"},"Angola",{"$f":"IFERROR(VLOOKUP(TablaPaíses[[#This Row],[Country]],Population[],2,FALSE),\"\")","v":36693743}]
["Asia","Arabia Saudita","Arabia Saudí",{"$f":"IFERROR(VLOOKUP(TablaPaíses[[#This Row],[País]],Nombres[],2,FALSE),IFERROR(VLOOKUP(\"*\"&TablaPaíses[[#This Row],[Country]]&\"*\",Nombres[],2,FALSE),IFERROR(VLOOKUP(TablaPaíses[[#This Row],[Nombre corto]],Nombres[],2,FALSE),IF(TablaPaíses[[#This Row],[Nombre corto]]<>\"\",TablaPaíses[[#This Row],[Nombre corto]],TablaPaíses[[#This Row],[País]]&\"*\"))))","v":"Reino de Arabia Saudí"},"Saudi Arabia",{"$f":"IFERROR(VLOOKUP(TablaPaíses[[#This Row],[Country]],Population[],2,FALSE),\"\")","v":37761185}]
["América del Sur","Argentina",null,{"$f":"IFERROR(VLOOKUP(TablaPaíses[[#This Row],[País]],Nombres[],2,FALSE),IFERROR(VLOOKUP(\"*\"&TablaPaíses[[#This Row],[Country]]&\"*\",Nombres[],2,FALSE),IFERROR(VLOOKUP(TablaPaíses[[#This Row],[Nombre corto]],Nombres[],2,FALSE),IF(TablaPaíses[[#This Row],[Nombre corto]]<>\"\",TablaPaíses[[#This Row],[Nombre corto]],TablaPaíses[[#This Row],[País]]&\"*\"))))","v":"República Argentina"},"Argentina",{"$f":"IFERROR(VLOOKUP(TablaPaíses[[#This Row],[Country]],Population[],2,FALSE),\"\")","v":46833332}]
["Asia","Armenia",null,{"$f":"IFERROR(VLOOKUP(TablaPaíses[[#This Row],[País]],Nombres[],2,FALSE),IFERROR(VLOOKUP(\"*\"&TablaPaíses[[#This Row],[Country]]&\"*\",Nombres[],2,FALSE),IFERROR(VLOOKUP(TablaPaíses[[#This Row],[Nombre corto]],Nombres[],2,FALSE),IF(TablaPaíses[[#This Row],[Nombre corto]]<>\"\",TablaPaíses[[#This Row],[Nombre corto]],TablaPaíses[[#This Row],[País]]&\"*\"))))","v":"República de Armenia"},"Armenia",{"$f":"IFERROR(VLOOKUP(TablaPaíses[[#This Row],[Country]],Population[],2,FALSE),\"\")","v":3002557}]
["Oceanía","Australia",null,{"$f":"IFERROR(VLOOKUP(TablaPaíses[[#This Row],[País]],Nombres[],2,FALSE),IFERROR(VLOOKUP(\"*\"&TablaPaíses[[#This Row],[Country]]&\"*\",Nombres[],2,FALSE),IFERROR(VLOOKUP(TablaPaíses[[#This Row],[Nombre corto]],Nombres[],2,FALSE),IF(TablaPaíses[[#This Row],[Nombre corto]]<>\"\",TablaPaíses[[#This Row],[Nombre corto]],TablaPaíses[[#This Row],[País]]&\"*\"))))","v":"Commonwealth de Australia"},"Australia",{"$f":"IFERROR(VLOOKUP(TablaPaíses[[#This Row],[Country]],Population[],2,FALSE),\"\")","v":26933672}]
["Europa","Austria",null,{"$f":"IFERROR(VLOOKUP(TablaPaíses[[#This Row],[País]],Nombres[],2,FALSE),IFERROR(VLOOKUP(\"*\"&TablaPaíses[[#This Row],[Country]]&\"*\",Nombres[],2,FALSE),IFERROR(VLOOKUP(TablaPaíses[[#This Row],[Nombre corto]],Nombres[],2,FALSE),IF(TablaPaíses[[#This Row],[Nombre corto]]<>\"\",TablaPaíses[[#This Row],[Nombre corto]],TablaPaíses[[#This Row],[País]]&\"*\"))))","v":"República de Austria"},"Austria",{"$f":"IFERROR(VLOOKUP(TablaPaíses[[#This Row],[Country]],Population[],2,FALSE),\"\")","v":9107427}]
["Asia","Azerbaiyán",null,{"$f":"IFERROR(VLOOKUP(TablaPaíses[[#This Row],[País]],Nombres[],2,FALSE),IFERROR(VLOOKUP(\"*\"&TablaPaíses[[#This Row],[Country]]&\"*\",Nombres[],2,FALSE),IFERROR(VLOOKUP(TablaPaíses[[#This Row],[Nombre corto]],Nombres[],2,FALSE),IF(TablaPaíses[[#This Row],[Nombre corto]]<>\"\",TablaPaíses[[#This Row],[Nombre corto]],TablaPaíses[[#This Row],[País]]&\"*\"))))","v":"República de Azerbaiyán"},"Azerbaijan",{"$f":"IFERROR(VLOOKUP(TablaPaíses[[#This Row],[Country]],Population[],2,FALSE),\"\")","v":10650274}]
["América del Norte","Bahamas",null,{"$f":"IFERROR(VLOOKUP(TablaPaíses[[#This Row],[País]],Nombres[],2,FALSE),IFERROR(VLOOKUP(\"*\"&TablaPaíses[[#This Row],[Country]]&\"*\",Nombres[],2,FALSE),IFERROR(VLOOKUP(TablaPaíses[[#This Row],[Nombre corto]],Nombres[],2,FALSE),IF(TablaPaíses[[#This Row],[Nombre corto]]<>\"\",TablaPaíses[[#This Row],[Nombre corto]],TablaPaíses[[#This Row],[País]]&\"*\"))))","v":"Commonwealth de las Bahamas"},"Bahamas",{"$f":"IFERROR(VLOOKUP(TablaPaíses[[#This Row],[Country]],Population[],2,FALSE),\"\")","v":413974}]
["Asia","Bangladés",null,{"$f":"IFERROR(VLOOKUP(TablaPaíses[[#This Row],[País]],Nombres[],2,FALSE),IFERROR(VLOOKUP(\"*\"&TablaPaíses[[#This Row],[Country]]&\"*\",Nombres[],2,FALSE),IFERROR(VLOOKUP(TablaPaíses[[#This Row],[Nombre corto]],Nombres[],2,FALSE),IF(TablaPaíses[[#This Row],[Nombre corto]]<>\"\",TablaPaíses[[#This Row],[Nombre corto]],TablaPaíses[[#This Row],[País]]&\"*\"))))","v":"República Popular de Bangladesh"},"Bangladesh",{"$f":"IFERROR(VLOOKUP(TablaPaíses[[#This Row],[Country]],Population[],2,FALSE),\"\")","v":171663088}]
["Asia","Baréin","Bahrein",{"$f":"IFERROR(VLOOKUP(TablaPaíses[[#This Row],[País]],Nombres[],2,FALSE),IFERROR(VLOOKUP(\"*\"&TablaPaíses[[#This Row],[Country]]&\"*\",Nombres[],2,FALSE),IFERROR(VLOOKUP(TablaPaíses[[#This Row],[Nombre corto]],Nombres[],2,FALSE),IF(TablaPaíses[[#This Row],[Nombre corto]]<>\"\",TablaPaíses[[#This Row],[Nombre corto]],TablaPaíses[[#This Row],[País]]&\"*\"))))","v":"Reino de Bahrein"},"Bahrain",{"$f":"IFERROR(VLOOKUP(TablaPaíses[[#This Row],[Country]],Population[],2,FALSE),\"\")","v":1788910}]
["Europa","Bélgica",null,{"$f":"IFERROR(VLOOKUP(TablaPaíses[[#This Row],[País]],Nombres[],2,FALSE),IFERROR(VLOOKUP(\"*\"&TablaPaíses[[#This Row],[Country]]&\"*\",Nombres[],2,FALSE),IFERROR(VLOOKUP(TablaPaíses[[#This Row],[Nombre corto]],Nombres[],2,FALSE),IF(TablaPaíses[[#This Row],[Nombre corto]]<>\"\",TablaPaíses[[#This Row],[Nombre corto]],TablaPaíses[[#This Row],[País]]&\"*\"))))","v":"Reino de Bélgica"},"Belgium",{"$f":"IFERROR(VLOOKUP(TablaPaíses[[#This Row],[Country]],Population[],2,FALSE),\"\")","v":11866927}]
["América del Norte","Belice",null,{"$f":"IFERROR(VLOOKUP(TablaPaíses[[#This Row],[País]],Nombres[],2,FALSE),IFERROR(VLOOKUP(\"*\"&TablaPaíses[[#This Row],[Country]]&\"*\",Nombres[],2,FALSE),IFERROR(VLOOKUP(TablaPaíses[[#This Row],[Nombre corto]],Nombres[],2,FALSE),IF(TablaPaíses[[#This Row],[Nombre corto]]<>\"\",TablaPaíses[[#This Row],[Nombre corto]],TablaPaíses[[#This Row],[País]]&\"*\"))))","v":"Belice"},"Belize",{"$f":"IFERROR(VLOOKUP(TablaPaíses[[#This Row],[Country]],Population[],2,FALSE),\"\")","v":429079}]
["África","Benín",null,{"$f":"IFERROR(VLOOKUP(TablaPaíses[[#This Row],[País]],Nombres[],2,FALSE),IFERROR(VLOOKUP(\"*\"&TablaPaíses[[#This Row],[Country]]&\"*\",Nombres[],2,FALSE),IFERROR(VLOOKUP(TablaPaíses[[#This Row],[Nombre corto]],Nombres[],2,FALSE),IF(TablaPaíses[[#This Row],[Nombre corto]]<>\"\",TablaPaíses[[#This Row],[Nombre corto]],TablaPaíses[[#This Row],[País]]&\"*\"))))","v":"República de Benín"},"Benin",{"$f":"IFERROR(VLOOKUP(TablaPaíses[[#This Row],[Country]],Population[],2,FALSE),\"\")","v":13264411}]
["Europa","Bielorrusia",null,{"$f":"IFERROR(VLOOKUP(TablaPaíses[[#This Row],[País]],Nombres[],2,FALSE),IFERROR(VLOOKUP(\"*\"&TablaPaíses[[#This Row],[Country]]&\"*\",Nombres[],2,FALSE),IFERROR(VLOOKUP(TablaPaíses[[#This Row],[Nombre corto]],Nombres[],2,FALSE),IF(TablaPaíses[[#This Row],[Nombre corto]]<>\"\",TablaPaíses[[#This Row],[Nombre corto]],TablaPaíses[[#This Row],[País]]&\"*\"))))","v":"República de Belarús"},"Belarus",{"$f":"IFERROR(VLOOKUP(TablaPaíses[[#This Row],[Country]],Population[],2,FALSE),\"\")","v":9453800}]
["Asia","Birmania",null,{"$f":"IFERROR(VLOOKUP(TablaPaíses[[#This Row],[País]],Nombres[],2,FALSE),IFERROR(VLOOKUP(\"*\"&TablaPaíses[[#This Row],[Country]]&\"*\",Nombres[],2,FALSE),IFERROR(VLOOKUP(TablaPaíses[[#This Row],[Nombre corto]],Nombres[],2,FALSE),IF(TablaPaíses[[#This Row],[Nombre corto]]<>\"\",TablaPaíses[[#This Row],[Nombre corto]],TablaPaíses[[#This Row],[País]]&\"*\"))))","v":"Unión de Myanmar"},"Myanmar",{"$f":"IFERROR(VLOOKUP(TablaPaíses[[#This Row],[Country]],Population[],2,FALSE),\"\")","v":55978446}]
["América del Sur","Bolivia",null,{"$f":"IFERROR(VLOOKUP(TablaPaíses[[#This Row],[País]],Nombres[],2,FALSE),IFERROR(VLOOKUP(\"*\"&TablaPaíses[[#This Row],[Country]]&\"*\",Nombres[],2,FALSE),IFERROR(VLOOKUP(TablaPaíses[[#This Row],[Nombre corto]],Nombres[],2,FALSE),IF(TablaPaíses[[#This Row],[Nombre corto]]<>\"\",TablaPaíses[[#This Row],[Nombre corto]],TablaPaíses[[#This Row],[País]]&\"*\"))))","v":"Estado Plurinacional de Bolivia"},"Bolivia",{"$f":"IFERROR(VLOOKUP(TablaPaíses[[#This Row],[Country]],Population[],2,FALSE),\"\")","v":12314743}]
["Europa","Bosnia y Herzegovina",null,{"$f":"IFERROR(VLOOKUP(TablaPaíses[[#This Row],[País]],Nombres[],2,FALSE),IFERROR(VLOOKUP(\"*\"&TablaPaíses[[#This Row],[Country]]&\"*\",Nombres[],2,FALSE),IFERROR(VLOOKUP(TablaPaíses[[#This Row],[Nombre corto]],Nombres[],2,FALSE),IF(TablaPaíses[[#This Row],[Nombre corto]]<>\"\",TablaPaíses[[#This Row],[Nombre corto]],TablaPaíses[[#This Row],[País]]&\"*\"))))","v":"Bosnia y Herzegovina"},"Bosnia and Herzegovina",{"$f":"IFERROR(VLOOKUP(TablaPaíses[[#This Row],[Country]],Population[],2,FALSE),\"\")","v":3274227}]
["África","Botsuana",null,{"$f":"IFERROR(VLOOKUP(TablaPaíses[[#This Row],[País]],Nombres[],2,FALSE),IFERROR(VLOOKUP(\"*\"&TablaPaíses[[#This Row],[Country]]&\"*\",Nombres[],2,FALSE),IFERROR(VLOOKUP(TablaPaíses[[#This Row],[Nombre corto]],Nombres[],2,FALSE),IF(TablaPaíses[[#This Row],[Nombre corto]]<>\"\",TablaPaíses[[#This Row],[Nombre corto]],TablaPaíses[[#This Row],[País]]&\"*\"))))","v":"República de Botswana"},"Botswana",{"$f":"IFERROR(VLOOKUP(TablaPaíses[[#This Row],[Country]],Population[],2,FALSE),\"\")","v":2513633}]
["América del Sur","Brasil",null,{"$f":"IFERROR(VLOOKUP(TablaPaíses[[#This Row],[País]],Nombres[],2,FALSE),IFERROR(VLOOKUP(\"*\"&TablaPaíses[[#This Row],[Country]]&\"*\",Nombres[],2,FALSE),IFERROR(VLOOKUP(TablaPaíses[[#This Row],[Nombre corto]],Nombres[],2,FALSE),IF(TablaPaíses[[#This Row],[Nombre corto]]<>\"\",TablaPaíses[[#This Row],[Nombre corto]],TablaPaíses[[#This Row],[País]]&\"*\"))))","v":"República Federativa de Brasil"},"Brazil",{"$f":"IFERROR(VLOOKUP(TablaPaíses[[#This Row],[Country]],Population[],2,FALSE),\"\")","v":219412680}]
["Asia","Brunéi",null,{"$f":"IFERROR(VLOOKUP(TablaPaíses[[#This Row],[País]],Nombres[],2,FALSE),IFERROR(VLOOKUP(\"*\"&TablaPaíses[[#This Row],[Country]]&\"*\",Nombres[],2,FALSE),IFERROR(VLOOKUP(TablaPaíses[[#This Row],[Nombre corto]],Nombres[],2,FALSE),IF(TablaPaíses[[#This Row],[Nombre corto]]<>\"\",TablaPaíses[[#This Row],[Nombre corto]],TablaPaíses[[#This Row],[País]]&\"*\"))))","v":"Brunei Darussalam"},"Brunei Darussalam",{"$f":"IFERROR(VLOOKUP(TablaPaíses[[#This Row],[Country]],Population[],2,FALSE),\"\")","v":460752}]
["Europa","Bulgaria",null,{"$f":"IFERROR(VLOOKUP(TablaPaíses[[#This Row],[País]],Nombres[],2,FALSE),IFERROR(VLOOKUP(\"*\"&TablaPaíses[[#This Row],[Country]]&\"*\",Nombres[],2,FALSE),IFERROR(VLOOKUP(TablaPaíses[[#This Row],[Nombre corto]],Nombres[],2,FALSE),IF(TablaPaíses[[#This Row],[Nombre corto]]<>\"\",TablaPaíses[[#This Row],[Nombre corto]],TablaPaíses[[#This Row],[País]]&\"*\"))))","v":"República de Bulgaria"},"Bulgaria",{"$f":"IFERROR(VLOOKUP(TablaPaíses[[#This Row],[Country]],Population[],2,FALSE),\"\")","v":6784151}]
["África","Burkina Faso",null,{"$f":"IFERROR(VLOOKUP(TablaPaíses[[#This Row],[País]],Nombres[],2,FALSE),IFERROR(VLOOKUP(\"*\"&TablaPaíses[[#This Row],[Country]]&\"*\",Nombres[],2,FALSE),IFERROR(VLOOKUP(TablaPaíses[[#This Row],[Nombre corto]],Nombres[],2,FALSE),IF(TablaPaíses[[#This Row],[Nombre corto]]<>\"\",TablaPaíses[[#This Row],[Nombre corto]],TablaPaíses[[#This Row],[País]]&\"*\"))))","v":"Burkina Faso"},"Burkina Faso",{"$f":"IFERROR(VLOOKUP(TablaPaíses[[#This Row],[Country]],Population[],2,FALSE),\"\")","v":23070385}]
["África","Burundi",null,{"$f":"IFERROR(VLOOKUP(TablaPaíses[[#This Row],[País]],Nombres[],2,FALSE),IFERROR(VLOOKUP(\"*\"&TablaPaíses[[#This Row],[Country]]&\"*\",Nombres[],2,FALSE),IFERROR(VLOOKUP(TablaPaíses[[#This Row],[Nombre corto]],Nombres[],2,FALSE),IF(TablaPaíses[[#This Row],[Nombre corto]]<>\"\",TablaPaíses[[#This Row],[Nombre corto]],TablaPaíses[[#This Row],[País]]&\"*\"))))","v":"República de Burundi"},"Burundi",{"$f":"IFERROR(VLOOKUP(TablaPaíses[[#This Row],[Country]],Population[],2,FALSE),\"\")","v":13304846}]
["Asia","Bután","Bhután",{"$f":"IFERROR(VLOOKUP(TablaPaíses[[#This Row],[País]],Nombres[],2,FALSE),IFERROR(VLOOKUP(\"*\"&TablaPaíses[[#This Row],[Country]]&\"*\",Nombres[],2,FALSE),IFERROR(VLOOKUP(TablaPaíses[[#This Row],[Nombre corto]],Nombres[],2,FALSE),IF(TablaPaíses[[#This Row],[Nombre corto]]<>\"\",TablaPaíses[[#This Row],[Nombre corto]],TablaPaíses[[#This Row],[País]]&\"*\"))))","v":"Reino de Bhután"},"Bhutan",{"$f":"IFERROR(VLOOKUP(TablaPaíses[[#This Row],[Country]],Population[],2,FALSE),\"\")","v":811962}]
["África","Cabo Verde",null,{"$f":"IFERROR(VLOOKUP(TablaPaíses[[#This Row],[País]],Nombres[],2,FALSE),IFERROR(VLOOKUP(\"*\"&TablaPaíses[[#This Row],[Country]]&\"*\",Nombres[],2,FALSE),IFERROR(VLOOKUP(TablaPaíses[[#This Row],[Nombre corto]],Nombres[],2,FALSE),IF(TablaPaíses[[#This Row],[Nombre corto]]<>\"\",TablaPaíses[[#This Row],[Nombre corto]],TablaPaíses[[#This Row],[País]]&\"*\"))))","v":"República de Cabo Verde"},"Cape Verde",{"$f":"IFERROR(VLOOKUP(TablaPaíses[[#This Row],[Country]],Population[],2,FALSE),\"\")","v":579113}]
["Asia","Camboya",null,{"$f":"IFERROR(VLOOKUP(TablaPaíses[[#This Row],[País]],Nombres[],2,FALSE),IFERROR(VLOOKUP(\"*\"&TablaPaíses[[#This Row],[Country]]&\"*\",Nombres[],2,FALSE),IFERROR(VLOOKUP(TablaPaíses[[#This Row],[Nombre corto]],Nombres[],2,FALSE),IF(TablaPaíses[[#This Row],[Nombre corto]]<>\"\",TablaPaíses[[#This Row],[Nombre corto]],TablaPaíses[[#This Row],[País]]&\"*\"))))","v":"Reino de Camboya"},"Cambodia",{"$f":"IFERROR(VLOOKUP(TablaPaíses[[#This Row],[Country]],Population[],2,FALSE),\"\")","v":17677593}]
["África","Camerún",null,{"$f":"IFERROR(VLOOKUP(TablaPaíses[[#This Row],[País]],Nombres[],2,FALSE),IFERROR(VLOOKUP(\"*\"&TablaPaíses[[#This Row],[Country]]&\"*\",Nombres[],2,FALSE),IFERROR(VLOOKUP(TablaPaíses[[#This Row],[Nombre corto]],Nombres[],2,FALSE),IF(TablaPaíses[[#This Row],[Nombre corto]]<>\"\",TablaPaíses[[#This Row],[Nombre corto]],TablaPaíses[[#This Row],[País]]&\"*\"))))","v":"República de Camerún"},"Cameroon",{"$f":"IFERROR(VLOOKUP(TablaPaíses[[#This Row],[Country]],Population[],2,FALSE),\"\")","v":28866472}]
["América del Norte","Canadá",null,{"$f":"IFERROR(VLOOKUP(TablaPaíses[[#This Row],[País]],Nombres[],2,FALSE),IFERROR(VLOOKUP(\"*\"&TablaPaíses[[#This Row],[Country]]&\"*\",Nombres[],2,FALSE),IFERROR(VLOOKUP(TablaPaíses[[#This Row],[Nombre corto]],Nombres[],2,FALSE),IF(TablaPaíses[[#This Row],[Nombre corto]]<>\"\",TablaPaíses[[#This Row],[Nombre corto]],TablaPaíses[[#This Row],[País]]&\"*\"))))","v":"Canadá"},"Canada",{"$f":"IFERROR(VLOOKUP(TablaPaíses[[#This Row],[Country]],Population[],2,FALSE),\"\")","v":39114670}]
["Asia","Catar",null,{"$f":"IFERROR(VLOOKUP(TablaPaíses[[#This Row],[País]],Nombres[],2,FALSE),IFERROR(VLOOKUP(\"*\"&TablaPaíses[[#This Row],[Country]]&\"*\",Nombres[],2,FALSE),IFERROR(VLOOKUP(TablaPaíses[[#This Row],[Nombre corto]],Nombres[],2,FALSE),IF(TablaPaíses[[#This Row],[Nombre corto]]<>\"\",TablaPaíses[[#This Row],[Nombre corto]],TablaPaíses[[#This Row],[País]]&\"*\"))))","v":"Estado de Qatar"},"Qatar",{"$f":"IFERROR(VLOOKUP(TablaPaíses[[#This Row],[Country]],Population[],2,FALSE),\"\")","v":3415975}]
["África","Chad",null,{"$f":"IFERROR(VLOOKUP(TablaPaíses[[#This Row],[País]],Nombres[],2,FALSE),IFERROR(VLOOKUP(\"*\"&TablaPaíses[[#This Row],[Country]]&\"*\",Nombres[],2,FALSE),IFERROR(VLOOKUP(TablaPaíses[[#This Row],[Nombre corto]],Nombres[],2,FALSE),IF(TablaPaíses[[#This Row],[Nombre corto]]<>\"\",TablaPaíses[[#This Row],[Nombre corto]],TablaPaíses[[#This Row],[País]]&\"*\"))))","v":"República de Chad"},"Chad",{"$f":"IFERROR(VLOOKUP(TablaPaíses[[#This Row],[Country]],Population[],2,FALSE),\"\")","v":18371037}]
["América del Sur","Chile",null,{"$f":"IFERROR(VLOOKUP(TablaPaíses[[#This Row],[País]],Nombres[],2,FALSE),IFERROR(VLOOKUP(\"*\"&TablaPaíses[[#This Row],[Country]]&\"*\",Nombres[],2,FALSE),IFERROR(VLOOKUP(TablaPaíses[[#This Row],[Nombre corto]],Nombres[],2,FALSE),IF(TablaPaíses[[#This Row],[Nombre corto]]<>\"\",TablaPaíses[[#This Row],[Nombre corto]],TablaPaíses[[#This Row],[País]]&\"*\"))))","v":"República de Chile"},"Chile",{"$f":"IFERROR(VLOOKUP(TablaPaíses[[#This Row],[Country]],Population[],2,FALSE),\"\")","v":19837659}]
["Asia","China",null,{"$f":"IFERROR(VLOOKUP(TablaPaíses[[#This Row],[País]],Nombres[],2,FALSE),IFERROR(VLOOKUP(\"*\"&TablaPaíses[[#This Row],[Country]]&\"*\",Nombres[],2,FALSE),IFERROR(VLOOKUP(TablaPaíses[[#This Row],[Nombre corto]],Nombres[],2,FALSE),IF(TablaPaíses[[#This Row],[Nombre corto]]<>\"\",TablaPaíses[[#This Row],[Nombre corto]],TablaPaíses[[#This Row],[País]]&\"*\"))))","v":"República Popular China"},"China",{"$f":"IFERROR(VLOOKUP(TablaPaíses[[#This Row],[Country]],Population[],2,FALSE),\"\")","v":1465645573}]
["Asia","Chipre",null,{"$f":"IFERROR(VLOOKUP(TablaPaíses[[#This Row],[País]],Nombres[],2,FALSE),IFERROR(VLOOKUP(\"*\"&TablaPaíses[[#This Row],[Country]]&\"*\",Nombres[],2,FALSE),IFERROR(VLOOKUP(TablaPaíses[[#This Row],[Nombre corto]],Nombres[],2,FALSE),IF(TablaPaíses[[#This Row],[Nombre corto]]<>\"\",TablaPaíses[[#This Row],[Nombre corto]],TablaPaíses[[#This Row],[País]]&\"*\"))))","v":"República de Chipre"},"Cyprus",{"$f":"IFERROR(VLOOKUP(TablaPaíses[[#This Row],[Country]],Population[],2,FALSE),\"\")","v":1254665}]
["América del Sur","Colombia",null,{"$f":"IFERROR(VLOOKUP(TablaPaíses[[#This Row],[País]],Nombres[],2,FALSE),IFERROR(VLOOKUP(\"*\"&TablaPaíses[[#This Row],[Country]]&\"*\",Nombres[],2,FALSE),IFERROR(VLOOKUP(TablaPaíses[[#This Row],[Nombre corto]],Nombres[],2,FALSE),IF(TablaPaíses[[#This Row],[Nombre corto]]<>\"\",TablaPaíses[[#This Row],[Nombre corto]],TablaPaíses[[#This Row],[País]]&\"*\"))))","v":"República de Colombia"},"Colombia",{"$f":"IFERROR(VLOOKUP(TablaPaíses[[#This Row],[Country]],Population[],2,FALSE),\"\")","v":52573476}]
["África","Comoras",null,{"$f":"IFERROR(VLOOKUP(TablaPaíses[[#This Row],[País]],Nombres[],2,FALSE),IFERROR(VLOOKUP(\"*\"&TablaPaíses[[#This Row],[Country]]&\"*\",Nombres[],2,FALSE),IFERROR(VLOOKUP(TablaPaíses[[#This Row],[Nombre corto]],Nombres[],2,FALSE),IF(TablaPaíses[[#This Row],[Nombre corto]]<>\"\",TablaPaíses[[#This Row],[Nombre corto]],TablaPaíses[[#This Row],[País]]&\"*\"))))","v":"Unión de las Comoras"},"Comoros",{"$f":"IFERROR(VLOOKUP(TablaPaíses[[#This Row],[Country]],Population[],2,FALSE),\"\")","v":944073}]
["Asia","Corea del Norte",null,{"$f":"IFERROR(VLOOKUP(TablaPaíses[[#This Row],[País]],Nombres[],2,FALSE),IFERROR(VLOOKUP(\"*\"&TablaPaíses[[#This Row],[Country]]&\"*\",Nombres[],2,FALSE),IFERROR(VLOOKUP(TablaPaíses[[#This Row],[Nombre corto]],Nombres[],2,FALSE),IF(TablaPaíses[[#This Row],[Nombre corto]]<>\"\",TablaPaíses[[#This Row],[Nombre corto]],TablaPaíses[[#This Row],[País]]&\"*\"))))","v":"República Popular Democrática de Corea"},"Democratic People's Republic of Korea",{"$f":"IFERROR(VLOOKUP(TablaPaíses[[#This Row],[Country]],Population[],2,FALSE),\"\")","v":26255633}]
["Asia","Corea del Sur",null,{"$f":"IFERROR(VLOOKUP(TablaPaíses[[#This Row],[País]],Nombres[],2,FALSE),IFERROR(VLOOKUP(\"*\"&TablaPaíses[[#This Row],[Country]]&\"*\",Nombres[],2,FALSE),IFERROR(VLOOKUP(TablaPaíses[[#This Row],[Nombre corto]],Nombres[],2,FALSE),IF(TablaPaíses[[#This Row],[Nombre corto]]<>\"\",TablaPaíses[[#This Row],[Nombre corto]],TablaPaíses[[#This Row],[País]]&\"*\"))))","v":"República de Corea"},"Republic of Korea",{"$f":"IFERROR(VLOOKUP(TablaPaíses[[#This Row],[Country]],Population[],2,FALSE),\"\")","v":52219858}]
["África","Costa de Marfil",null,{"$f":"IFERROR(VLOOKUP(TablaPaíses[[#This Row],[País]],Nombres[],2,FALSE),IFERROR(VLOOKUP(\"*\"&TablaPaíses[[#This Row],[Country]]&\"*\",Nombres[],2,FALSE),IFERROR(VLOOKUP(TablaPaíses[[#This Row],[Nombre corto]],Nombres[],2,FALSE),IF(TablaPaíses[[#This Row],[Nombre corto]]<>\"\",TablaPaíses[[#This Row],[Nombre corto]],TablaPaíses[[#This Row],[País]]&\"*\"))))","v":"República de Costa de Marfil"},"Cote d'Ivoire",{"$f":"IFERROR(VLOOKUP(TablaPaíses[[#This Row],[Country]],Population[],2,FALSE),\"\")","v":28569696}]
["América del Norte","Costa Rica",null,{"$f":"IFERROR(VLOOKUP(TablaPaíses[[#This Row],[País]],Nombres[],2,FALSE),IFERROR(VLOOKUP(\"*\"&TablaPaíses[[#This Row],[Country]]&\"*\",Nombres[],2,FALSE),IFERROR(VLOOKUP(TablaPaíses[[#This Row],[Nombre corto]],Nombres[],2,FALSE),IF(TablaPaíses[[#This Row],[Nombre corto]]<>\"\",TablaPaíses[[#This Row],[Nombre corto]],TablaPaíses[[#This Row],[País]]&\"*\"))))","v":"República de Costa Rica"},"Costa Rica",{"$f":"IFERROR(VLOOKUP(TablaPaíses[[#This Row],[Country]],Population[],2,FALSE),\"\")","v":5296326}]
["Europa","Croacia",null,{"$f":"IFERROR(VLOOKUP(TablaPaíses[[#This Row],[País]],Nombres[],2,FALSE),IFERROR(VLOOKUP(\"*\"&TablaPaíses[[#This Row],[Country]]&\"*\",Nombres[],2,FALSE),IFERROR(VLOOKUP(TablaPaíses[[#This Row],[Nombre corto]],Nombres[],2,FALSE),IF(TablaPaíses[[#This Row],[Nombre corto]]<>\"\",TablaPaíses[[#This Row],[Nombre corto]],TablaPaíses[[#This Row],[País]]&\"*\"))))","v":"República de Croacia"},"Croatia",{"$f":"IFERROR(VLOOKUP(TablaPaíses[[#This Row],[Country]],Population[],2,FALSE),\"\")","v":4060783}]
["América del Norte","Cuba",null,{"$f":"IFERROR(VLOOKUP(TablaPaíses[[#This Row],[País]],Nombres[],2,FALSE),IFERROR(VLOOKUP(\"*\"&TablaPaíses[[#This Row],[Country]]&\"*\",Nombres[],2,FALSE),IFERROR(VLOOKUP(TablaPaíses[[#This Row],[Nombre corto]],Nombres[],2,FALSE),IF(TablaPaíses[[#This Row],[Nombre corto]]<>\"\",TablaPaíses[[#This Row],[Nombre corto]],TablaPaíses[[#This Row],[País]]&\"*\"))))","v":"República de Cuba"},"Cuba",{"$f":"IFERROR(VLOOKUP(TablaPaíses[[#This Row],[Country]],Population[],2,FALSE),\"\")","v":11393682}]
["Europa","Dinamarca",null,{"$f":"IFERROR(VLOOKUP(TablaPaíses[[#This Row],[País]],Nombres[],2,FALSE),IFERROR(VLOOKUP(\"*\"&TablaPaíses[[#This Row],[Country]]&\"*\",Nombres[],2,FALSE),IFERROR(VLOOKUP(TablaPaíses[[#This Row],[Nombre corto]],Nombres[],2,FALSE),IF(TablaPaíses[[#This Row],[Nombre corto]]<>\"\",TablaPaíses[[#This Row],[Nombre corto]],TablaPaíses[[#This Row],[País]]&\"*\"))))","v":"Reino de Dinamarca"},"Denmark",{"$f":"IFERROR(VLOOKUP(TablaPaíses[[#This Row],[Country]],Population[],2,FALSE),\"\")","v":5877449}]
["América del Sur","Ecuador",null,{"$f":"IFERROR(VLOOKUP(TablaPaíses[[#This Row],[País]],Nombres[],2,FALSE),IFERROR(VLOOKUP(\"*\"&TablaPaíses[[#This Row],[Country]]&\"*\",Nombres[],2,FALSE),IFERROR(VLOOKUP(TablaPaíses[[#This Row],[Nombre corto]],Nombres[],2,FALSE),IF(TablaPaíses[[#This Row],[Nombre corto]]<>\"\",TablaPaíses[[#This Row],[Nombre corto]],TablaPaíses[[#This Row],[País]]&\"*\"))))","v":"República del Ecuador"},"Ecuador",{"$f":"IFERROR(VLOOKUP(TablaPaíses[[#This Row],[Country]],Population[],2,FALSE),\"\")","v":18594072}]
["África","Egipto",null,{"$f":"IFERROR(VLOOKUP(TablaPaíses[[#This Row],[País]],Nombres[],2,FALSE),IFERROR(VLOOKUP(\"*\"&TablaPaíses[[#This Row],[Country]]&\"*\",Nombres[],2,FALSE),IFERROR(VLOOKUP(TablaPaíses[[#This Row],[Nombre corto]],Nombres[],2,FALSE),IF(TablaPaíses[[#This Row],[Nombre corto]]<>\"\",TablaPaíses[[#This Row],[Nombre corto]],TablaPaíses[[#This Row],[País]]&\"*\"))))","v":"República Árabe de Egipto"},"Egypt",{"$f":"IFERROR(VLOOKUP(TablaPaíses[[#This Row],[Country]],Population[],2,FALSE),\"\")","v":110255495}]
["América del Norte","El Salvador",null,{"$f":"IFERROR(VLOOKUP(TablaPaíses[[#This Row],[País]],Nombres[],2,FALSE),IFERROR(VLOOKUP(\"*\"&TablaPaíses[[#This Row],[Country]]&\"*\",Nombres[],2,FALSE),IFERROR(VLOOKUP(TablaPaíses[[#This Row],[Nombre corto]],Nombres[],2,FALSE),IF(TablaPaíses[[#This Row],[Nombre corto]]<>\"\",TablaPaíses[[#This Row],[Nombre corto]],TablaPaíses[[#This Row],[País]]&\"*\"))))","v":"República de El Salvador"},"El Salvador",{"$f":"IFERROR(VLOOKUP(TablaPaíses[[#This Row],[Country]],Population[],2,FALSE),\"\")","v":6543321}]
["Asia","Emiratos Árabes Unidos",null,{"$f":"IFERROR(VLOOKUP(TablaPaíses[[#This Row],[País]],Nombres[],2,FALSE),IFERROR(VLOOKUP(\"*\"&TablaPaíses[[#This Row],[Country]]&\"*\",Nombres[],2,FALSE),IFERROR(VLOOKUP(TablaPaíses[[#This Row],[Nombre corto]],Nombres[],2,FALSE),IF(TablaPaíses[[#This Row],[Nombre corto]]<>\"\",TablaPaíses[[#This Row],[Nombre corto]],TablaPaíses[[#This Row],[País]]&\"*\"))))","v":"Emiratos Árabes Unidos"},"United Arab Emirates",{"$f":"IFERROR(VLOOKUP(TablaPaíses[[#This Row],[Country]],Population[],2,FALSE),\"\")","v":10575549}]
["África","Eritrea",null,{"$f":"IFERROR(VLOOKUP(TablaPaíses[[#This Row],[País]],Nombres[],2,FALSE),IFERROR(VLOOKUP(\"*\"&TablaPaíses[[#This Row],[Country]]&\"*\",Nombres[],2,FALSE),IFERROR(VLOOKUP(TablaPaíses[[#This Row],[Nombre corto]],Nombres[],2,FALSE),IF(TablaPaíses[[#This Row],[Nombre corto]]<>\"\",TablaPaíses[[#This Row],[Nombre corto]],TablaPaíses[[#This Row],[País]]&\"*\"))))","v":"Estado de Eritrea"},"Eritrea",{"$f":"IFERROR(VLOOKUP(TablaPaíses[[#This Row],[Country]],Population[],2,FALSE),\"\")","v":3829142}]
["Europa","Eslovaquia",null,{"$f":"IFERROR(VLOOKUP(TablaPaíses[[#This Row],[País]],Nombres[],2,FALSE),IFERROR(VLOOKUP(\"*\"&TablaPaíses[[#This Row],[Country]]&\"*\",Nombres[],2,FALSE),IFERROR(VLOOKUP(TablaPaíses[[#This Row],[Nombre corto]],Nombres[],2,FALSE),IF(TablaPaíses[[#This Row],[Nombre corto]]<>\"\",TablaPaíses[[#This Row],[Nombre corto]],TablaPaíses[[#This Row],[País]]&\"*\"))))","v":"República Eslovaca"},"Slovakia",{"$f":"IFERROR(VLOOKUP(TablaPaíses[[#This Row],[Country]],Population[],2,FALSE),\"\")","v":5473438}]
["Europa","Eslovenia",null,{"$f":"IFERROR(VLOOKUP(TablaPaíses[[#This Row],[País]],Nombres[],2,FALSE),IFERROR(VLOOKUP(\"*\"&TablaPaíses[[#This Row],[Country]]&\"*\",Nombres[],2,FALSE),IFERROR(VLOOKUP(TablaPaíses[[#This Row],[Nombre corto]],Nombres[],2,FALSE),IF(TablaPaíses[[#This Row],[Nombre corto]]<>\"\",TablaPaíses[[#This Row],[Nombre corto]],TablaPaíses[[#This Row],[País]]&\"*\"))))","v":"República de Eslovenia"},"Slovenia",{"$f":"IFERROR(VLOOKUP(TablaPaíses[[#This Row],[Country]],Population[],2,FALSE),\"\")","v":2090635}]
["Europa","España",null,{"$f":"IFERROR(VLOOKUP(TablaPaíses[[#This Row],[País]],Nombres[],2,FALSE),IFERROR(VLOOKUP(\"*\"&TablaPaíses[[#This Row],[Country]]&\"*\",Nombres[],2,FALSE),IFERROR(VLOOKUP(TablaPaíses[[#This Row],[Nombre corto]],Nombres[],2,FALSE),IF(TablaPaíses[[#This Row],[Nombre corto]]<>\"\",TablaPaíses[[#This Row],[Nombre corto]],TablaPaíses[[#This Row],[País]]&\"*\"))))","v":"Reino de España"},"Spain",{"$f":"IFERROR(VLOOKUP(TablaPaíses[[#This Row],[Country]],Population[],2,FALSE),\"\")","v":46370251}]
["América del Norte","Estados Unidos","Estados Unidos de América",{"$f":"IFERROR(VLOOKUP(TablaPaíses[[#This Row],[País]],Nombres[],2,FALSE),IFERROR(VLOOKUP(\"*\"&TablaPaíses[[#This Row],[Country]]&\"*\",Nombres[],2,FALSE),IFERROR(VLOOKUP(TablaPaíses[[#This Row],[Nombre corto]],Nombres[],2,FALSE),IF(TablaPaíses[[#This Row],[Nombre corto]]<>\"\",TablaPaíses[[#This Row],[Nombre corto]],TablaPaíses[[#This Row],[País]]&\"*\"))))","v":"Estados Unidos de América"},"United States of America (USA)",{"$f":"IFERROR(VLOOKUP(TablaPaíses[[#This Row],[Country]],Population[],2,FALSE),\"\")","v":339821113}]
["Europa","Estonia",null,{"$f":"IFERROR(VLOOKUP(TablaPaíses[[#This Row],[País]],Nombres[],2,FALSE),IFERROR(VLOOKUP(\"*\"&TablaPaíses[[#This Row],[Country]]&\"*\",Nombres[],2,FALSE),IFERROR(VLOOKUP(TablaPaíses[[#This Row],[Nombre corto]],Nombres[],2,FALSE),IF(TablaPaíses[[#This Row],[Nombre corto]]<>\"\",TablaPaíses[[#This Row],[Nombre corto]],TablaPaíses[[#This Row],[País]]&\"*\"))))","v":"República de Estonia"},"Estonia",{"$f":"IFERROR(VLOOKUP(TablaPaíses[[#This Row],[Country]],Population[],2,FALSE),\"\")","v":1310932}]
["África","Etiopía",null,{"$f":"IFERROR(VLOOKUP(TablaPaíses[[#This Row],[País]],Nombres[],2,FALSE),IFERROR(VLOOKUP(\"*\"&TablaPaíses[[#This Row],[Country]]&\"*\",Nombres[],2,FALSE),IFERROR(VLOOKUP(TablaPaíses[[#This Row],[Nombre corto]],Nombres[],2,FALSE),IF(TablaPaíses[[#This Row],[Nombre corto]]<>\"\",TablaPaíses[[#This Row],[Nombre corto]],TablaPaíses[[#This Row],[País]]&\"*\"))))","v":"República Democrática Federal de Etiopía"},"Ethiopia",{"$f":"IFERROR(VLOOKUP(TablaPaíses[[#This Row],[Country]],Population[],2,FALSE),\"\")","v":125130799}]
["Asia","Filipinas",null,{"$f":"IFERROR(VLOOKUP(TablaPaíses[[#This Row],[País]],Nombres[],2,FALSE),IFERROR(VLOOKUP(\"*\"&TablaPaíses[[#This Row],[Country]]&\"*\",Nombres[],2,FALSE),IFERROR(VLOOKUP(TablaPaíses[[#This Row],[Nombre corto]],Nombres[],2,FALSE),IF(TablaPaíses[[#This Row],[Nombre corto]]<>\"\",TablaPaíses[[#This Row],[Nombre corto]],TablaPaíses[[#This Row],[País]]&\"*\"))))","v":"República de Filipinas"},"Philippines",{"$f":"IFERROR(VLOOKUP(TablaPaíses[[#This Row],[Country]],Population[],2,FALSE),\"\")","v":115708944}]
["Europa","Finlandia",null,{"$f":"IFERROR(VLOOKUP(TablaPaíses[[#This Row],[País]],Nombres[],2,FALSE),IFERROR(VLOOKUP(\"*\"&TablaPaíses[[#This Row],[Country]]&\"*\",Nombres[],2,FALSE),IFERROR(VLOOKUP(TablaPaíses[[#This Row],[Nombre corto]],Nombres[],2,FALSE),IF(TablaPaíses[[#This Row],[Nombre corto]]<>\"\",TablaPaíses[[#This Row],[Nombre corto]],TablaPaíses[[#This Row],[País]]&\"*\"))))","v":"República de Finlandia"},"Finland",{"$f":"IFERROR(VLOOKUP(TablaPaíses[[#This Row],[Country]],Population[],2,FALSE),\"\")","v":5644803}]
["Oceanía","Fiyi",null,{"$f":"IFERROR(VLOOKUP(TablaPaíses[[#This Row],[País]],Nombres[],2,FALSE),IFERROR(VLOOKUP(\"*\"&TablaPaíses[[#This Row],[Country]]&\"*\",Nombres[],2,FALSE),IFERROR(VLOOKUP(TablaPaíses[[#This Row],[Nombre corto]],Nombres[],2,FALSE),IF(TablaPaíses[[#This Row],[Nombre corto]]<>\"\",TablaPaíses[[#This Row],[Nombre corto]],TablaPaíses[[#This Row],[País]]&\"*\"))))","v":"República de las Islas Fiji"},"Fiji",{"$f":"IFERROR(VLOOKUP(TablaPaíses[[#This Row],[Country]],Population[],2,FALSE),\"\")","v":919016}]
["Europa","Francia",null,{"$f":"IFERROR(VLOOKUP(TablaPaíses[[#This Row],[País]],Nombres[],2,FALSE),IFERROR(VLOOKUP(\"*\"&TablaPaíses[[#This Row],[Country]]&\"*\",Nombres[],2,FALSE),IFERROR(VLOOKUP(TablaPaíses[[#This Row],[Nombre corto]],Nombres[],2,FALSE),IF(TablaPaíses[[#This Row],[Nombre corto]]<>\"\",TablaPaíses[[#This Row],[Nombre corto]],TablaPaíses[[#This Row],[País]]&\"*\"))))","v":"República Francesa"},"France",{"$f":"IFERROR(VLOOKUP(TablaPaíses[[#This Row],[Country]],Population[],2,FALSE),\"\")","v":66351820}]
["África","Gabón",null,{"$f":"IFERROR(VLOOKUP(TablaPaíses[[#This Row],[País]],Nombres[],2,FALSE),IFERROR(VLOOKUP(\"*\"&TablaPaíses[[#This Row],[Country]]&\"*\",Nombres[],2,FALSE),IFERROR(VLOOKUP(TablaPaíses[[#This Row],[Nombre corto]],Nombres[],2,FALSE),IF(TablaPaíses[[#This Row],[Nombre corto]]<>\"\",TablaPaíses[[#This Row],[Nombre corto]],TablaPaíses[[#This Row],[País]]&\"*\"))))","v":"República Gabonesa"},"Gabon",{"$f":"IFERROR(VLOOKUP(TablaPaíses[[#This Row],[Country]],Population[],2,FALSE),\"\")","v":2397815}]
["África","Gambia",null,{"$f":"IFERROR(VLOOKUP(TablaPaíses[[#This Row],[País]],Nombres[],2,FALSE),IFERROR(VLOOKUP(\"*\"&TablaPaíses[[#This Row],[Country]]&\"*\",Nombres[],2,FALSE),IFERROR(VLOOKUP(TablaPaíses[[#This Row],[Nombre corto]],Nombres[],2,FALSE),IF(TablaPaíses[[#This Row],[Nombre corto]]<>\"\",TablaPaíses[[#This Row],[Nombre corto]],TablaPaíses[[#This Row],[País]]&\"*\"))))","v":"República de Gambia"},"Gambia",{"$f":"IFERROR(VLOOKUP(TablaPaíses[[#This Row],[Country]],Population[],2,FALSE),\"\")","v":2696872}]
["Asia","Georgia",null,{"$f":"IFERROR(VLOOKUP(TablaPaíses[[#This Row],[País]],Nombres[],2,FALSE),IFERROR(VLOOKUP(\"*\"&TablaPaíses[[#This Row],[Country]]&\"*\",Nombres[],2,FALSE),IFERROR(VLOOKUP(TablaPaíses[[#This Row],[Nombre corto]],Nombres[],2,FALSE),IF(TablaPaíses[[#This Row],[Nombre corto]]<>\"\",TablaPaíses[[#This Row],[Nombre corto]],TablaPaíses[[#This Row],[País]]&\"*\"))))","v":"Georgia"},"Georgia",{"$f":"IFERROR(VLOOKUP(TablaPaíses[[#This Row],[Country]],Population[],2,FALSE),\"\")","v":3807546}]
["África","Ghana",null,{"$f":"IFERROR(VLOOKUP(TablaPaíses[[#This Row],[País]],Nombres[],2,FALSE),IFERROR(VLOOKUP(\"*\"&TablaPaíses[[#This Row],[Country]]&\"*\",Nombres[],2,FALSE),IFERROR(VLOOKUP(TablaPaíses[[#This Row],[Nombre corto]],Nombres[],2,FALSE),IF(TablaPaíses[[#This Row],[Nombre corto]]<>\"\",TablaPaíses[[#This Row],[Nombre corto]],TablaPaíses[[#This Row],[País]]&\"*\"))))","v":"República de Ghana"},"Ghana",{"$f":"IFERROR(VLOOKUP(TablaPaíses[[#This Row],[Country]],Population[],2,FALSE),\"\")","v":33710687}]
["Europa","Grecia",null,{"$f":"IFERROR(VLOOKUP(TablaPaíses[[#This Row],[País]],Nombres[],2,FALSE),IFERROR(VLOOKUP(\"*\"&TablaPaíses[[#This Row],[Country]]&\"*\",Nombres[],2,FALSE),IFERROR(VLOOKUP(TablaPaíses[[#This Row],[Nombre corto]],Nombres[],2,FALSE),IF(TablaPaíses[[#This Row],[Nombre corto]]<>\"\",TablaPaíses[[#This Row],[Nombre corto]],TablaPaíses[[#This Row],[País]]&\"*\"))))","v":"República Helénica"},"Greece",{"$f":"IFERROR(VLOOKUP(TablaPaíses[[#This Row],[Country]],Population[],2,FALSE),\"\")","v":10285153}]
["América del Norte","Groenlandia",null,{"$f":"IFERROR(VLOOKUP(TablaPaíses[[#This Row],[País]],Nombres[],2,FALSE),IFERROR(VLOOKUP(\"*\"&TablaPaíses[[#This Row],[Country]]&\"*\",Nombres[],2,FALSE),IFERROR(VLOOKUP(TablaPaíses[[#This Row],[Nombre corto]],Nombres[],2,FALSE),IF(TablaPaíses[[#This Row],[Nombre corto]]<>\"\",TablaPaíses[[#This Row],[Nombre corto]],TablaPaíses[[#This Row],[País]]&\"*\"))))","v":"Groenlandia*"},"Greenland",{"$f":"IFERROR(VLOOKUP(TablaPaíses[[#This Row],[Country]],Population[],2,FALSE),\"\")","v":56825}]
["América del Norte","Guatemala",null,{"$f":"IFERROR(VLOOKUP(TablaPaíses[[#This Row],[País]],Nombres[],2,FALSE),IFERROR(VLOOKUP(\"*\"&TablaPaíses[[#This Row],[Country]]&\"*\",Nombres[],2,FALSE),IFERROR(VLOOKUP(TablaPaíses[[#This Row],[Nombre corto]],Nombres[],2,FALSE),IF(TablaPaíses[[#This Row],[Nombre corto]]<>\"\",TablaPaíses[[#This Row],[Nombre corto]],TablaPaíses[[#This Row],[País]]&\"*\"))))","v":"República de Guatemala"},"Guatemala",{"$f":"IFERROR(VLOOKUP(TablaPaíses[[#This Row],[Country]],Population[],2,FALSE),\"\")","v":19225807}]
["América del Sur","Guayana Francesa",null,{"$f":"IFERROR(VLOOKUP(TablaPaíses[[#This Row],[País]],Nombres[],2,FALSE),IFERROR(VLOOKUP(\"*\"&TablaPaíses[[#This Row],[Country]]&\"*\",Nombres[],2,FALSE),IFERROR(VLOOKUP(TablaPaíses[[#This Row],[Nombre corto]],Nombres[],2,FALSE),IF(TablaPaíses[[#This Row],[Nombre corto]]<>\"\",TablaPaíses[[#This Row],[Nombre corto]],TablaPaíses[[#This Row],[País]]&\"*\"))))","v":"Guayana Francesa*"},"French Guiana",{"$f":"IFERROR(VLOOKUP(TablaPaíses[[#This Row],[Country]],Population[],2,FALSE),\"\")","v":327895}]
["África","Guinea",null,{"$f":"IFERROR(VLOOKUP(TablaPaíses[[#This Row],[País]],Nombres[],2,FALSE),IFERROR(VLOOKUP(\"*\"&TablaPaíses[[#This Row],[Country]]&\"*\",Nombres[],2,FALSE),IFERROR(VLOOKUP(TablaPaíses[[#This Row],[Nombre corto]],Nombres[],2,FALSE),IF(TablaPaíses[[#This Row],[Nombre corto]]<>\"\",TablaPaíses[[#This Row],[Nombre corto]],TablaPaíses[[#This Row],[País]]&\"*\"))))","v":"República de Guinea"},"Guinea",{"$f":"IFERROR(VLOOKUP(TablaPaíses[[#This Row],[Country]],Population[],2,FALSE),\"\")","v":14370773}]
["África","Guinea Ecuatorial",null,{"$f":"IFERROR(VLOOKUP(TablaPaíses[[#This Row],[País]],Nombres[],2,FALSE),IFERROR(VLOOKUP(\"*\"&TablaPaíses[[#This Row],[Country]]&\"*\",Nombres[],2,FALSE),IFERROR(VLOOKUP(TablaPaíses[[#This Row],[Nombre corto]],Nombres[],2,FALSE),IF(TablaPaíses[[#This Row],[Nombre corto]]<>\"\",TablaPaíses[[#This Row],[Nombre corto]],TablaPaíses[[#This Row],[País]]&\"*\"))))","v":"República de Guinea Ecuatorial"},"Equatorial Guinea",{"$f":"IFERROR(VLOOKUP(TablaPaíses[[#This Row],[Country]],Population[],2,FALSE),\"\")","v":1545416}]
["África","Guinea-Bisáu",null,{"$f":"IFERROR(VLOOKUP(TablaPaíses[[#This Row],[País]],Nombres[],2,FALSE),IFERROR(VLOOKUP(\"*\"&TablaPaíses[[#This Row],[Country]]&\"*\",Nombres[],2,FALSE),IFERROR(VLOOKUP(TablaPaíses[[#This Row],[Nombre corto]],Nombres[],2,FALSE),IF(TablaPaíses[[#This Row],[Nombre corto]]<>\"\",TablaPaíses[[#This Row],[Nombre corto]],TablaPaíses[[#This Row],[País]]&\"*\"))))","v":"República de Guinea-Bissau"},"Guinea-Bissau",{"$f":"IFERROR(VLOOKUP(TablaPaíses[[#This Row],[Country]],Population[],2,FALSE),\"\")","v":2134121}]
["América del Sur","Guyana",null,{"$f":"IFERROR(VLOOKUP(TablaPaíses[[#This Row],[País]],Nombres[],2,FALSE),IFERROR(VLOOKUP(\"*\"&TablaPaíses[[#This Row],[Country]]&\"*\",Nombres[],2,FALSE),IFERROR(VLOOKUP(TablaPaíses[[#This Row],[Nombre corto]],Nombres[],2,FALSE),IF(TablaPaíses[[#This Row],[Nombre corto]]<>\"\",TablaPaíses[[#This Row],[Nombre corto]],TablaPaíses[[#This Row],[País]]&\"*\"))))","v":"Cooperativa de Guyana"},"Guyana",{"$f":"IFERROR(VLOOKUP(TablaPaíses[[#This Row],[Country]],Population[],2,FALSE),\"\")","v":795764}]
["América del Norte","Haití",null,{"$f":"IFERROR(VLOOKUP(TablaPaíses[[#This Row],[País]],Nombres[],2,FALSE),IFERROR(VLOOKUP(\"*\"&TablaPaíses[[#This Row],[Country]]&\"*\",Nombres[],2,FALSE),IFERROR(VLOOKUP(TablaPaíses[[#This Row],[Nombre corto]],Nombres[],2,FALSE),IF(TablaPaíses[[#This Row],[Nombre corto]]<>\"\",TablaPaíses[[#This Row],[Nombre corto]],TablaPaíses[[#This Row],[País]]&\"*\"))))","v":"República de Haití"},"Haiti",{"$f":"IFERROR(VLOOKUP(TablaPaíses[[#This Row],[Country]],Population[],2,FALSE),\"\")","v":11951222}]
["América del Norte","Honduras",null,{"$f":"IFERROR(VLOOKUP(TablaPaíses[[#This Row],[País]],Nombres[],2,FALSE),IFERROR(VLOOKUP(\"*\"&TablaPaíses[[#This Row],[Country]]&\"*\",Nombres[],2,FALSE),IFERROR(VLOOKUP(TablaPaíses[[#This Row],[Nombre corto]],Nombres[],2,FALSE),IF(TablaPaíses[[#This Row],[Nombre corto]]<>\"\",TablaPaíses[[#This Row],[Nombre corto]],TablaPaíses[[#This Row],[País]]&\"*\"))))","v":"República de Honduras"},"Honduras",{"$f":"IFERROR(VLOOKUP(TablaPaíses[[#This Row],[Country]],Population[],2,FALSE),\"\")","v":10399095}]
["Europa","Hungría",null,{"$f":"IFERROR(VLOOKUP(TablaPaíses[[#This Row],[País]],Nombres[],2,FALSE),IFERROR(VLOOKUP(\"*\"&TablaPaíses[[#This Row],[Country]]&\"*\",Nombres[],2,FALSE),IFERROR(VLOOKUP(TablaPaíses[[#This Row],[Nombre corto]],Nombres[],2,FALSE),IF(TablaPaíses[[#This Row],[Nombre corto]]<>\"\",TablaPaíses[[#This Row],[Nombre corto]],TablaPaíses[[#This Row],[País]]&\"*\"))))","v":"República de Hungría"},"Hungary",{"$f":"IFERROR(VLOOKUP(TablaPaíses[[#This Row],[Country]],Population[],2,FALSE),\"\")","v":9552136}]
["Asia","India",null,{"$f":"IFERROR(VLOOKUP(TablaPaíses[[#This Row],[País]],Nombres[],2,FALSE),IFERROR(VLOOKUP(\"*\"&TablaPaíses[[#This Row],[Country]]&\"*\",Nombres[],2,FALSE),IFERROR(VLOOKUP(TablaPaíses[[#This Row],[Nombre corto]],Nombres[],2,FALSE),IF(TablaPaíses[[#This Row],[Nombre corto]]<>\"\",TablaPaíses[[#This Row],[Nombre corto]],TablaPaíses[[#This Row],[País]]&\"*\"))))","v":"República de la India"},"India",{"$f":"IFERROR(VLOOKUP(TablaPaíses[[#This Row],[Country]],Population[],2,FALSE),\"\")","v":1441803999}]
["Asia","Indonesia",null,{"$f":"IFERROR(VLOOKUP(TablaPaíses[[#This Row],[País]],Nombres[],2,FALSE),IFERROR(VLOOKUP(\"*\"&TablaPaíses[[#This Row],[Country]]&\"*\",Nombres[],2,FALSE),IFERROR(VLOOKUP(TablaPaíses[[#This Row],[Nombre corto]],Nombres[],2,FALSE),IF(TablaPaíses[[#This Row],[Nombre corto]]<>\"\",TablaPaíses[[#This Row],[Nombre corto]],TablaPaíses[[#This Row],[País]]&\"*\"))))","v":"República de Indonesia"},"Indonesia",{"$f":"IFERROR(VLOOKUP(TablaPaíses[[#This Row],[Country]],Population[],2,FALSE),\"\")","v":285874316}]
["Asia","Irak",null,{"$f":"IFERROR(VLOOKUP(TablaPaíses[[#This Row],[País]],Nombres[],2,FALSE),IFERROR(VLOOKUP(\"*\"&TablaPaíses[[#This Row],[Country]]&\"*\",Nombres[],2,FALSE),IFERROR(VLOOKUP(TablaPaíses[[#This Row],[Nombre corto]],Nombres[],2,FALSE),IF(TablaPaíses[[#This Row],[Nombre corto]]<>\"\",TablaPaíses[[#This Row],[Nombre corto]],TablaPaíses[[#This Row],[País]]&\"*\"))))","v":"República del Iraq"},"Iraq",{"$f":"IFERROR(VLOOKUP(TablaPaíses[[#This Row],[Country]],Population[],2,FALSE),\"\")","v":45132545}]
["Asia","Irán",null,{"$f":"IFERROR(VLOOKUP(TablaPaíses[[#This Row],[País]],Nombres[],2,FALSE),IFERROR(VLOOKUP(\"*\"&TablaPaíses[[#This Row],[Country]]&\"*\",Nombres[],2,FALSE),IFERROR(VLOOKUP(TablaPaíses[[#This Row],[Nombre corto]],Nombres[],2,FALSE),IF(TablaPaíses[[#This Row],[Nombre corto]]<>\"\",TablaPaíses[[#This Row],[Nombre corto]],TablaPaíses[[#This Row],[País]]&\"*\"))))","v":"República Islámica de Irán"},"Iran",{"$f":"IFERROR(VLOOKUP(TablaPaíses[[#This Row],[Country]],Population[],2,FALSE),\"\")","v":87646303}]
["Europa","Irlanda",null,{"$f":"IFERROR(VLOOKUP(TablaPaíses[[#This Row],[País]],Nombres[],2,FALSE),IFERROR(VLOOKUP(\"*\"&TablaPaíses[[#This Row],[Country]]&\"*\",Nombres[],2,FALSE),IFERROR(VLOOKUP(TablaPaíses[[#This Row],[Nombre corto]],Nombres[],2,FALSE),IF(TablaPaíses[[#This Row],[Nombre corto]]<>\"\",TablaPaíses[[#This Row],[Nombre corto]],TablaPaíses[[#This Row],[País]]&\"*\"))))","v":"Irlanda"},"Ireland",{"$f":"IFERROR(VLOOKUP(TablaPaíses[[#This Row],[Country]],Population[],2,FALSE),\"\")","v":4969057}]
["Europa","Islandia",null,{"$f":"IFERROR(VLOOKUP(TablaPaíses[[#This Row],[País]],Nombres[],2,FALSE),IFERROR(VLOOKUP(\"*\"&TablaPaíses[[#This Row],[Country]]&\"*\",Nombres[],2,FALSE),IFERROR(VLOOKUP(TablaPaíses[[#This Row],[Nombre corto]],Nombres[],2,FALSE),IF(TablaPaíses[[#This Row],[Nombre corto]]<>\"\",TablaPaíses[[#This Row],[Nombre corto]],TablaPaíses[[#This Row],[País]]&\"*\"))))","v":"República de Islandia"},"Iceland",{"$f":"IFERROR(VLOOKUP(TablaPaíses[[#This Row],[Country]],Population[],2,FALSE),\"\")","v":349555}]
["América del Sur","Islas Georgias y Sandwich",null,{"$f":"IFERROR(VLOOKUP(TablaPaíses[[#This Row],[País]],Nombres[],2,FALSE),IFERROR(VLOOKUP(\"*\"&TablaPaíses[[#This Row],[Country]]&\"*\",Nombres[],2,FALSE),IFERROR(VLOOKUP(TablaPaíses[[#This Row],[Nombre corto]],Nombres[],2,FALSE),IF(TablaPaíses[[#This Row],[Nombre corto]]<>\"\",TablaPaíses[[#This Row],[Nombre corto]],TablaPaíses[[#This Row],[País]]&\"*\"))))","v":"Islas Georgias y Sandwich*"},"South Georgia and the South Sandwich Islands",{"$f":"IFERROR(VLOOKUP(TablaPaíses[[#This Row],[Country]],Population[],2,FALSE),\"\")","v":""}]
["América del Sur","Islas Malvinas",null,{"$f":"IFERROR(VLOOKUP(TablaPaíses[[#This Row],[País]],Nombres[],2,FALSE),IFERROR(VLOOKUP(\"*\"&TablaPaíses[[#This Row],[Country]]&\"*\",Nombres[],2,FALSE),IFERROR(VLOOKUP(TablaPaíses[[#This Row],[Nombre corto]],Nombres[],2,FALSE),IF(TablaPaíses[[#This Row],[Nombre corto]]<>\"\",TablaPaíses[[#This Row],[Nombre corto]],TablaPaíses[[#This Row],[País]]&\"*\"))))","v":"Islas Malvinas*"},"Maldives",{"$f":"IFERROR(VLOOKUP(TablaPaíses[[#This Row],[Country]],Population[],2,FALSE),\"\")","v":573989}]
["Oceanía","Islas Salomón",null,{"$f":"IFERROR(VLOOKUP(TablaPaíses[[#This Row],[País]],Nombres[],2,FALSE),IFERROR(VLOOKUP(\"*\"&TablaPaíses[[#This Row],[Country]]&\"*\",Nombres[],2,FALSE),IFERROR(VLOOKUP(TablaPaíses[[#This Row],[Nombre corto]],Nombres[],2,FALSE),IF(TablaPaíses[[#This Row],[Nombre corto]]<>\"\",TablaPaíses[[#This Row],[Nombre corto]],TablaPaíses[[#This Row],[País]]&\"*\"))))","v":"Islas Salomón"},"Solomon Islands",{"$f":"IFERROR(VLOOKUP(TablaPaíses[[#This Row],[Country]],Population[],2,FALSE),\"\")","v":734712}]
["Asia","Israel",null,{"$f":"IFERROR(VLOOKUP(TablaPaíses[[#This Row],[País]],Nombres[],2,FALSE),IFERROR(VLOOKUP(\"*\"&TablaPaíses[[#This Row],[Country]]&\"*\",Nombres[],2,FALSE),IFERROR(VLOOKUP(TablaPaíses[[#This Row],[Nombre corto]],Nombres[],2,FALSE),IF(TablaPaíses[[#This Row],[Nombre corto]]<>\"\",TablaPaíses[[#This Row],[Nombre corto]],TablaPaíses[[#This Row],[País]]&\"*\"))))","v":"Estado de Israel"},"Israel",{"$f":"IFERROR(VLOOKUP(TablaPaíses[[#This Row],[Country]],Population[],2,FALSE),\"\")","v":9157115}]
["Europa","Italia",null,{"$f":"IFERROR(VLOOKUP(TablaPaíses[[#This Row],[País]],Nombres[],2,FALSE),IFERROR(VLOOKUP(\"*\"&TablaPaíses[[#This Row],[Country]]&\"*\",Nombres[],2,FALSE),IFERROR(VLOOKUP(TablaPaíses[[#This Row],[Nombre corto]],Nombres[],2,FALSE),IF(TablaPaíses[[#This Row],[Nombre corto]]<>\"\",TablaPaíses[[#This Row],[Nombre corto]],TablaPaíses[[#This Row],[País]]&\"*\"))))","v":"República Italiana"},"Italy",{"$f":"IFERROR(VLOOKUP(TablaPaíses[[#This Row],[Country]],Population[],2,FALSE),\"\")","v":60673139}]
["América del Norte","Jamaica",null,{"$f":"IFERROR(VLOOKUP(TablaPaíses[[#This Row],[País]],Nombres[],2,FALSE),IFERROR(VLOOKUP(\"*\"&TablaPaíses[[#This Row],[Country]]&\"*\",Nombres[],2,FALSE),IFERROR(VLOOKUP(TablaPaíses[[#This Row],[Nombre corto]],Nombres[],2,FALSE),IF(TablaPaíses[[#This Row],[Nombre corto]]<>\"\",TablaPaíses[[#This Row],[Nombre corto]],TablaPaíses[[#This Row],[País]]&\"*\"))))","v":"Jamaica"},"Jamaica",{"$f":"IFERROR(VLOOKUP(TablaPaíses[[#This Row],[Country]],Population[],2,FALSE),\"\")","v":2998245}]
["Asia","Japón",null,{"$f":"IFERROR(VLOOKUP(TablaPaíses[[#This Row],[País]],Nombres[],2,FALSE),IFERROR(VLOOKUP(\"*\"&TablaPaíses[[#This Row],[Country]]&\"*\",Nombres[],2,FALSE),IFERROR(VLOOKUP(TablaPaíses[[#This Row],[Nombre corto]],Nombres[],2,FALSE),IF(TablaPaíses[[#This Row],[Nombre corto]]<>\"\",TablaPaíses[[#This Row],[Nombre corto]],TablaPaíses[[#This Row],[País]]&\"*\"))))","v":"Japón"},"Japan",{"$f":"IFERROR(VLOOKUP(TablaPaíses[[#This Row],[Country]],Population[],2,FALSE),\"\")","v":126086432}]
["Asia","Jordania",null,{"$f":"IFERROR(VLOOKUP(TablaPaíses[[#This Row],[País]],Nombres[],2,FALSE),IFERROR(VLOOKUP(\"*\"&TablaPaíses[[#This Row],[Country]]&\"*\",Nombres[],2,FALSE),IFERROR(VLOOKUP(TablaPaíses[[#This Row],[Nombre corto]],Nombres[],2,FALSE),IF(TablaPaíses[[#This Row],[Nombre corto]]<>\"\",TablaPaíses[[#This Row],[Nombre corto]],TablaPaíses[[#This Row],[País]]&\"*\"))))","v":"Reino Hachemita de Jordania"},"Jordan",{"$f":"IFERROR(VLOOKUP(TablaPaíses[[#This Row],[Country]],Population[],2,FALSE),\"\")","v":11413809}]
["Asia","Kazajistán","Kazajstán",{"$f":"IFERROR(VLOOKUP(TablaPaíses[[#This Row],[País]],Nombres[],2,FALSE),IFERROR(VLOOKUP(\"*\"&TablaPaíses[[#This Row],[Country]]&\"*\",Nombres[],2,FALSE),IFERROR(VLOOKUP(TablaPaíses[[#This Row],[Nombre corto]],Nombres[],2,FALSE),IF(TablaPaíses[[#This Row],[Nombre corto]]<>\"\",TablaPaíses[[#This Row],[Nombre corto]],TablaPaíses[[#This Row],[País]]&\"*\"))))","v":"República de Kazajstán"},"Kazakhstan",{"$f":"IFERROR(VLOOKUP(TablaPaíses[[#This Row],[Country]],Population[],2,FALSE),\"\")","v":19815946}]
["África","Kenia",null,{"$f":"IFERROR(VLOOKUP(TablaPaíses[[#This Row],[País]],Nombres[],2,FALSE),IFERROR(VLOOKUP(\"*\"&TablaPaíses[[#This Row],[Country]]&\"*\",Nombres[],2,FALSE),IFERROR(VLOOKUP(TablaPaíses[[#This Row],[Nombre corto]],Nombres[],2,FALSE),IF(TablaPaíses[[#This Row],[Nombre corto]]<>\"\",TablaPaíses[[#This Row],[Nombre corto]],TablaPaíses[[#This Row],[País]]&\"*\"))))","v":"República de Kenia"},"Kenya",{"$f":"IFERROR(VLOOKUP(TablaPaíses[[#This Row],[Country]],Population[],2,FALSE),\"\")","v":58877734}]
["Asia","Kirguistán",null,{"$f":"IFERROR(VLOOKUP(TablaPaíses[[#This Row],[País]],Nombres[],2,FALSE),IFERROR(VLOOKUP(\"*\"&TablaPaíses[[#This Row],[Country]]&\"*\",Nombres[],2,FALSE),IFERROR(VLOOKUP(TablaPaíses[[#This Row],[Nombre corto]],Nombres[],2,FALSE),IF(TablaPaíses[[#This Row],[Nombre corto]]<>\"\",TablaPaíses[[#This Row],[Nombre corto]],TablaPaíses[[#This Row],[País]]&\"*\"))))","v":"República Kirguisa"},"Kyrgyzstan",{"$f":"IFERROR(VLOOKUP(TablaPaíses[[#This Row],[Country]],Population[],2,FALSE),\"\")","v":6900555}]
["Asia","Kuwait",null,{"$f":"IFERROR(VLOOKUP(TablaPaíses[[#This Row],[País]],Nombres[],2,FALSE),IFERROR(VLOOKUP(\"*\"&TablaPaíses[[#This Row],[Country]]&\"*\",Nombres[],2,FALSE),IFERROR(VLOOKUP(TablaPaíses[[#This Row],[Nombre corto]],Nombres[],2,FALSE),IF(TablaPaíses[[#This Row],[Nombre corto]]<>\"\",TablaPaíses[[#This Row],[Nombre corto]],TablaPaíses[[#This Row],[País]]&\"*\"))))","v":"Estado de Kuwait"},"Kuwait",{"$f":"IFERROR(VLOOKUP(TablaPaíses[[#This Row],[Country]],Population[],2,FALSE),\"\")","v":5086649}]
["Asia","Laos",null,{"$f":"IFERROR(VLOOKUP(TablaPaíses[[#This Row],[País]],Nombres[],2,FALSE),IFERROR(VLOOKUP(\"*\"&TablaPaíses[[#This Row],[Country]]&\"*\",Nombres[],2,FALSE),IFERROR(VLOOKUP(TablaPaíses[[#This Row],[Nombre corto]],Nombres[],2,FALSE),IF(TablaPaíses[[#This Row],[Nombre corto]]<>\"\",TablaPaíses[[#This Row],[Nombre corto]],TablaPaíses[[#This Row],[País]]&\"*\"))))","v":"República Democrática Popular de Lao"},"Laos",{"$f":"IFERROR(VLOOKUP(TablaPaíses[[#This Row],[Country]],Population[],2,FALSE),\"\")","v":7700414}]
["África","Lesoto",null,{"$f":"IFERROR(VLOOKUP(TablaPaíses[[#This Row],[País]],Nombres[],2,FALSE),IFERROR(VLOOKUP(\"*\"&TablaPaíses[[#This Row],[Country]]&\"*\",Nombres[],2,FALSE),IFERROR(VLOOKUP(TablaPaíses[[#This Row],[Nombre corto]],Nombres[],2,FALSE),IF(TablaPaíses[[#This Row],[Nombre corto]]<>\"\",TablaPaíses[[#This Row],[Nombre corto]],TablaPaíses[[#This Row],[País]]&\"*\"))))","v":"Reino de Lesotho"},"Lesotho",{"$f":"IFERROR(VLOOKUP(TablaPaíses[[#This Row],[Country]],Population[],2,FALSE),\"\")","v":2235337}]
["Europa","Letonia",null,{"$f":"IFERROR(VLOOKUP(TablaPaíses[[#This Row],[País]],Nombres[],2,FALSE),IFERROR(VLOOKUP(\"*\"&TablaPaíses[[#This Row],[Country]]&\"*\",Nombres[],2,FALSE),IFERROR(VLOOKUP(TablaPaíses[[#This Row],[Nombre corto]],Nombres[],2,FALSE),IF(TablaPaíses[[#This Row],[Nombre corto]]<>\"\",TablaPaíses[[#This Row],[Nombre corto]],TablaPaíses[[#This Row],[País]]&\"*\"))))","v":"República de Letonia"},"Latvia",{"$f":"IFERROR(VLOOKUP(TablaPaíses[[#This Row],[Country]],Population[],2,FALSE),\"\")","v":1810640}]
["Asia","Líbano",null,{"$f":"IFERROR(VLOOKUP(TablaPaíses[[#This Row],[País]],Nombres[],2,FALSE),IFERROR(VLOOKUP(\"*\"&TablaPaíses[[#This Row],[Country]]&\"*\",Nombres[],2,FALSE),IFERROR(VLOOKUP(TablaPaíses[[#This Row],[Nombre corto]],Nombres[],2,FALSE),IF(TablaPaíses[[#This Row],[Nombre corto]]<>\"\",TablaPaíses[[#This Row],[Nombre corto]],TablaPaíses[[#This Row],[País]]&\"*\"))))","v":"República Libanesa"},"Lebanon",{"$f":"IFERROR(VLOOKUP(TablaPaíses[[#This Row],[Country]],Population[],2,FALSE),\"\")","v":8565437}]
["África","Liberia",null,{"$f":"IFERROR(VLOOKUP(TablaPaíses[[#This Row],[País]],Nombres[],2,FALSE),IFERROR(VLOOKUP(\"*\"&TablaPaíses[[#This Row],[Country]]&\"*\",Nombres[],2,FALSE),IFERROR(VLOOKUP(TablaPaíses[[#This Row],[Nombre corto]],Nombres[],2,FALSE),IF(TablaPaíses[[#This Row],[Nombre corto]]<>\"\",TablaPaíses[[#This Row],[Nombre corto]],TablaPaíses[[#This Row],[País]]&\"*\"))))","v":"República de Liberia"},"Liberia",{"$f":"IFERROR(VLOOKUP(TablaPaíses[[#This Row],[Country]],Population[],2,FALSE),\"\")","v":5518648}]
["África","Libia",null,{"$f":"IFERROR(VLOOKUP(TablaPaíses[[#This Row],[País]],Nombres[],2,FALSE),IFERROR(VLOOKUP(\"*\"&TablaPaíses[[#This Row],[Country]]&\"*\",Nombres[],2,FALSE),IFERROR(VLOOKUP(TablaPaíses[[#This Row],[Nombre corto]],Nombres[],2,FALSE),IF(TablaPaíses[[#This Row],[Nombre corto]]<>\"\",TablaPaíses[[#This Row],[Nombre corto]],TablaPaíses[[#This Row],[País]]&\"*\"))))","v":"Libia"},"Libya",{"$f":"IFERROR(VLOOKUP(TablaPaíses[[#This Row],[Country]],Population[],2,FALSE),\"\")","v":6835260}]
["Europa","Liechtenstein",null,{"$f":"IFERROR(VLOOKUP(TablaPaíses[[#This Row],[País]],Nombres[],2,FALSE),IFERROR(VLOOKUP(\"*\"&TablaPaíses[[#This Row],[Country]]&\"*\",Nombres[],2,FALSE),IFERROR(VLOOKUP(TablaPaíses[[#This Row],[Nombre corto]],Nombres[],2,FALSE),IF(TablaPaíses[[#This Row],[Nombre corto]]<>\"\",TablaPaíses[[#This Row],[Nombre corto]],TablaPaíses[[#This Row],[País]]&\"*\"))))","v":"Principado de Liechtenstein"},"Liechtenstein",{"$f":"IFERROR(VLOOKUP(TablaPaíses[[#This Row],[Country]],Population[],2,FALSE),\"\")","v":39055}]
["Europa","Lituania",null,{"$f":"IFERROR(VLOOKUP(TablaPaíses[[#This Row],[País]],Nombres[],2,FALSE),IFERROR(VLOOKUP(\"*\"&TablaPaíses[[#This Row],[Country]]&\"*\",Nombres[],2,FALSE),IFERROR(VLOOKUP(TablaPaíses[[#This Row],[Nombre corto]],Nombres[],2,FALSE),IF(TablaPaíses[[#This Row],[Nombre corto]]<>\"\",TablaPaíses[[#This Row],[Nombre corto]],TablaPaíses[[#This Row],[País]]&\"*\"))))","v":"República de Lituania"},"Lithuania",{"$f":"IFERROR(VLOOKUP(TablaPaíses[[#This Row],[Country]],Population[],2,FALSE),\"\")","v":2571122}]
["Europa","Luxemburgo",null,{"$f":"IFERROR(VLOOKUP(TablaPaíses[[#This Row],[País]],Nombres[],2,FALSE),IFERROR(VLOOKUP(\"*\"&TablaPaíses[[#This Row],[Country]]&\"*\",Nombres[],2,FALSE),IFERROR(VLOOKUP(TablaPaíses[[#This Row],[Nombre corto]],Nombres[],2,FALSE),IF(TablaPaíses[[#This Row],[Nombre corto]]<>\"\",TablaPaíses[[#This Row],[Nombre corto]],TablaPaíses[[#This Row],[País]]&\"*\"))))","v":"Gran Ducado de Luxemburgo"},"Luxembourg",{"$f":"IFERROR(VLOOKUP(TablaPaíses[[#This Row],[Country]],Population[],2,FALSE),\"\")","v":675867}]
["Europa","Macedonia del Norte",null,{"$f":"IFERROR(VLOOKUP(TablaPaíses[[#This Row],[País]],Nombres[],2,FALSE),IFERROR(VLOOKUP(\"*\"&TablaPaíses[[#This Row],[Country]]&\"*\",Nombres[],2,FALSE),IFERROR(VLOOKUP(TablaPaíses[[#This Row],[Nombre corto]],Nombres[],2,FALSE),IF(TablaPaíses[[#This Row],[Nombre corto]]<>\"\",TablaPaíses[[#This Row],[Nombre corto]],TablaPaíses[[#This Row],[País]]&\"*\"))))","v":"República de Macedonia del Norte"},"North Macedonia",{"$f":"IFERROR(VLOOKUP(TablaPaíses[[#This Row],[Country]],Population[],2,FALSE),\"\")","v":2096019}]
["África","Madagascar",null,{"$f":"IFERROR(VLOOKUP(TablaPaíses[[#This Row],[País]],Nombres[],2,FALSE),IFERROR(VLOOKUP(\"*\"&TablaPaíses[[#This Row],[Country]]&\"*\",Nombres[],2,FALSE),IFERROR(VLOOKUP(TablaPaíses[[#This Row],[Nombre corto]],Nombres[],2,FALSE),IF(TablaPaíses[[#This Row],[Nombre corto]]<>\"\",TablaPaíses[[#This Row],[Nombre corto]],TablaPaíses[[#This Row],[País]]&\"*\"))))","v":"República de Madagascar"},"Madagascar",{"$f":"IFERROR(VLOOKUP(TablaPaíses[[#This Row],[Country]],Population[],2,FALSE),\"\")","v":30419341}]
["Asia","Malasia",null,{"$f":"IFERROR(VLOOKUP(TablaPaíses[[#This Row],[País]],Nombres[],2,FALSE),IFERROR(VLOOKUP(\"*\"&TablaPaíses[[#This Row],[Country]]&\"*\",Nombres[],2,FALSE),IFERROR(VLOOKUP(TablaPaíses[[#This Row],[Nombre corto]],Nombres[],2,FALSE),IF(TablaPaíses[[#This Row],[Nombre corto]]<>\"\",TablaPaíses[[#This Row],[Nombre corto]],TablaPaíses[[#This Row],[País]]&\"*\"))))","v":"Malasia"},"Malaysia",{"$f":"IFERROR(VLOOKUP(TablaPaíses[[#This Row],[Country]],Population[],2,FALSE),\"\")","v":34096836}]
["África","Malaui",null,{"$f":"IFERROR(VLOOKUP(TablaPaíses[[#This Row],[País]],Nombres[],2,FALSE),IFERROR(VLOOKUP(\"*\"&TablaPaíses[[#This Row],[Country]]&\"*\",Nombres[],2,FALSE),IFERROR(VLOOKUP(TablaPaíses[[#This Row],[Nombre corto]],Nombres[],2,FALSE),IF(TablaPaíses[[#This Row],[Nombre corto]]<>\"\",TablaPaíses[[#This Row],[Nombre corto]],TablaPaíses[[#This Row],[País]]&\"*\"))))","v":"República de Malawi"},"Malawi",{"$f":"IFERROR(VLOOKUP(TablaPaíses[[#This Row],[Country]],Population[],2,FALSE),\"\")","v":21230796}]
["África","Malí",null,{"$f":"IFERROR(VLOOKUP(TablaPaíses[[#This Row],[País]],Nombres[],2,FALSE),IFERROR(VLOOKUP(\"*\"&TablaPaíses[[#This Row],[Country]]&\"*\",Nombres[],2,FALSE),IFERROR(VLOOKUP(TablaPaíses[[#This Row],[Nombre corto]],Nombres[],2,FALSE),IF(TablaPaíses[[#This Row],[Nombre corto]]<>\"\",TablaPaíses[[#This Row],[Nombre corto]],TablaPaíses[[#This Row],[País]]&\"*\"))))","v":"República de Malí"},"Mali",{"$f":"IFERROR(VLOOKUP(TablaPaíses[[#This Row],[Country]],Population[],2,FALSE),\"\")","v":22365412}]
["Europa","Malta",null,{"$f":"IFERROR(VLOOKUP(TablaPaíses[[#This Row],[País]],Nombres[],2,FALSE),IFERROR(VLOOKUP(\"*\"&TablaPaíses[[#This Row],[Country]]&\"*\",Nombres[],2,FALSE),IFERROR(VLOOKUP(TablaPaíses[[#This Row],[Nombre corto]],Nombres[],2,FALSE),IF(TablaPaíses[[#This Row],[Nombre corto]]<>\"\",TablaPaíses[[#This Row],[Nombre corto]],TablaPaíses[[#This Row],[País]]&\"*\"))))","v":"República de Malta"},"Malta",{"$f":"IFERROR(VLOOKUP(TablaPaíses[[#This Row],[Country]],Population[],2,FALSE),\"\")","v":446463}]
["África","Marruecos",null,{"$f":"IFERROR(VLOOKUP(TablaPaíses[[#This Row],[País]],Nombres[],2,FALSE),IFERROR(VLOOKUP(\"*\"&TablaPaíses[[#This Row],[Country]]&\"*\",Nombres[],2,FALSE),IFERROR(VLOOKUP(TablaPaíses[[#This Row],[Nombre corto]],Nombres[],2,FALSE),IF(TablaPaíses[[#This Row],[Nombre corto]]<>\"\",TablaPaíses[[#This Row],[Nombre corto]],TablaPaíses[[#This Row],[País]]&\"*\"))))","v":"Reino de Marruecos"},"Morocco",{"$f":"IFERROR(VLOOKUP(TablaPaíses[[#This Row],[Country]],Population[],2,FALSE),\"\")","v":38682907}]
["África","Mauricio",null,{"$f":"IFERROR(VLOOKUP(TablaPaíses[[#This Row],[País]],Nombres[],2,FALSE),IFERROR(VLOOKUP(\"*\"&TablaPaíses[[#This Row],[Country]]&\"*\",Nombres[],2,FALSE),IFERROR(VLOOKUP(TablaPaíses[[#This Row],[Nombre corto]],Nombres[],2,FALSE),IF(TablaPaíses[[#This Row],[Nombre corto]]<>\"\",TablaPaíses[[#This Row],[Nombre corto]],TablaPaíses[[#This Row],[País]]&\"*\"))))","v":"República de Mauricio"},"Mauritius",{"$f":"IFERROR(VLOOKUP(TablaPaíses[[#This Row],[Country]],Population[],2,FALSE),\"\")","v":1290679}]
["África","Mauritania",null,{"$f":"IFERROR(VLOOKUP(TablaPaíses[[#This Row],[País]],Nombres[],2,FALSE),IFERROR(VLOOKUP(\"*\"&TablaPaíses[[#This Row],[Country]]&\"*\",Nombres[],2,FALSE),IFERROR(VLOOKUP(TablaPaíses[[#This Row],[Nombre corto]],Nombres[],2,FALSE),IF(TablaPaíses[[#This Row],[Nombre corto]]<>\"\",TablaPaíses[[#This Row],[Nombre corto]],TablaPaíses[[#This Row],[País]]&\"*\"))))","v":"República Islámica de Mauritania"},"Mauritania",{"$f":"IFERROR(VLOOKUP(TablaPaíses[[#This Row],[Country]],Population[],2,FALSE),\"\")","v":5048429}]
["América del Norte","México",null,{"$f":"IFERROR(VLOOKUP(TablaPaíses[[#This Row],[País]],Nombres[],2,FALSE),IFERROR(VLOOKUP(\"*\"&TablaPaíses[[#This Row],[Country]]&\"*\",Nombres[],2,FALSE),IFERROR(VLOOKUP(TablaPaíses[[#This Row],[Nombre corto]],Nombres[],2,FALSE),IF(TablaPaíses[[#This Row],[Nombre corto]]<>\"\",TablaPaíses[[#This Row],[Nombre corto]],TablaPaíses[[#This Row],[País]]&\"*\"))))","v":"Estados Unidos Mexicanos"},"Mexico",{"$f":"IFERROR(VLOOKUP(TablaPaíses[[#This Row],[Country]],Population[],2,FALSE),\"\")","v":135226177}]
["Europa","Moldavia",null,{"$f":"IFERROR(VLOOKUP(TablaPaíses[[#This Row],[País]],Nombres[],2,FALSE),IFERROR(VLOOKUP(\"*\"&TablaPaíses[[#This Row],[Country]]&\"*\",Nombres[],2,FALSE),IFERROR(VLOOKUP(TablaPaíses[[#This Row],[Nombre corto]],Nombres[],2,FALSE),IF(TablaPaíses[[#This Row],[Nombre corto]]<>\"\",TablaPaíses[[#This Row],[Nombre corto]],TablaPaíses[[#This Row],[País]]&\"*\"))))","v":"República de Moldavia"},"Republic of Moldova",{"$f":"IFERROR(VLOOKUP(TablaPaíses[[#This Row],[Country]],Population[],2,FALSE),\"\")","v":4026492}]
["Europa","Mónaco",null,{"$f":"IFERROR(VLOOKUP(TablaPaíses[[#This Row],[País]],Nombres[],2,FALSE),IFERROR(VLOOKUP(\"*\"&TablaPaíses[[#This Row],[Country]]&\"*\",Nombres[],2,FALSE),IFERROR(VLOOKUP(TablaPaíses[[#This Row],[Nombre corto]],Nombres[],2,FALSE),IF(TablaPaíses[[#This Row],[Nombre corto]]<>\"\",TablaPaíses[[#This Row],[Nombre corto]],TablaPaíses[[#This Row],[País]]&\"*\"))))","v":"Principado de Mónaco"},"Monaco",{"$f":"IFERROR(VLOOKUP(TablaPaíses[[#This Row],[Country]],Population[],2,FALSE),\"\")","v":38919}]
["Asia","Mongolia",null,{"$f":"IFERROR(VLOOKUP(TablaPaíses[[#This Row],[País]],Nombres[],2,FALSE),IFERROR(VLOOKUP(\"*\"&TablaPaíses[[#This Row],[Country]]&\"*\",Nombres[],2,FALSE),IFERROR(VLOOKUP(TablaPaíses[[#This Row],[Nombre corto]],Nombres[],2,FALSE),IF(TablaPaíses[[#This Row],[Nombre corto]]<>\"\",TablaPaíses[[#This Row],[Nombre corto]],TablaPaíses[[#This Row],[País]]&\"*\"))))","v":"Mongolia"},"Mongolia",{"$f":"IFERROR(VLOOKUP(TablaPaíses[[#This Row],[Country]],Population[],2,FALSE),\"\")","v":3477548}]
["Europa","Montenegro",null,{"$f":"IFERROR(VLOOKUP(TablaPaíses[[#This Row],[País]],Nombres[],2,FALSE),IFERROR(VLOOKUP(\"*\"&TablaPaíses[[#This Row],[Country]]&\"*\",Nombres[],2,FALSE),IFERROR(VLOOKUP(TablaPaíses[[#This Row],[Nombre corto]],Nombres[],2,FALSE),IF(TablaPaíses[[#This Row],[Nombre corto]]<>\"\",TablaPaíses[[#This Row],[Nombre corto]],TablaPaíses[[#This Row],[País]]&\"*\"))))","v":"Montenegro"},"Montenegro",{"$f":"IFERROR(VLOOKUP(TablaPaíses[[#This Row],[Country]],Population[],2,FALSE),\"\")","v":631036}]
["África","Mozambique",null,{"$f":"IFERROR(VLOOKUP(TablaPaíses[[#This Row],[País]],Nombres[],2,FALSE),IFERROR(VLOOKUP(\"*\"&TablaPaíses[[#This Row],[Country]]&\"*\",Nombres[],2,FALSE),IFERROR(VLOOKUP(TablaPaíses[[#This Row],[Nombre corto]],Nombres[],2,FALSE),IF(TablaPaíses[[#This Row],[Nombre corto]]<>\"\",TablaPaíses[[#This Row],[Nombre corto]],TablaPaíses[[#This Row],[País]]&\"*\"))))","v":"República de Mozambique"},"Mozambique",{"$f":"IFERROR(VLOOKUP(TablaPaíses[[#This Row],[Country]],Population[],2,FALSE),\"\")","v":34306564}]
["África","Namibia",null,{"$f":"IFERROR(VLOOKUP(TablaPaíses[[#This Row],[País]],Nombres[],2,FALSE),IFERROR(VLOOKUP(\"*\"&TablaPaíses[[#This Row],[Country]]&\"*\",Nombres[],2,FALSE),IFERROR(VLOOKUP(TablaPaíses[[#This Row],[Nombre corto]],Nombres[],2,FALSE),IF(TablaPaíses[[#This Row],[Nombre corto]]<>\"\",TablaPaíses[[#This Row],[Nombre corto]],TablaPaíses[[#This Row],[País]]&\"*\"))))","v":"República de Namibia"},"Namibia",{"$f":"IFERROR(VLOOKUP(TablaPaíses[[#This Row],[Country]],Population[],2,FALSE),\"\")","v":2748780}]
["Asia","Nepal",null,{"$f":"IFERROR(VLOOKUP(TablaPaíses[[#This Row],[País]],Nombres[],2,FALSE),IFERROR(VLOOKUP(\"*\"&TablaPaíses[[#This Row],[Country]]&\"*\",Nombres[],2,FALSE),IFERROR(VLOOKUP(TablaPaíses[[#This Row],[Nombre corto]],Nombres[],2,FALSE),IF(TablaPaíses[[#This Row],[Nombre corto]]<>\"\",TablaPaíses[[#This Row],[Nombre corto]],TablaPaíses[[#This Row],[País]]&\"*\"))))","v":"República Democrática Federal de Nepal"},"Nepal",{"$f":"IFERROR(VLOOKUP(TablaPaíses[[#This Row],[Country]],Population[],2,FALSE),\"\")","v":30227160}]
["América del Norte","Nicaragua",null,{"$f":"IFERROR(VLOOKUP(TablaPaíses[[#This Row],[País]],Nombres[],2,FALSE),IFERROR(VLOOKUP(\"*\"&TablaPaíses[[#This Row],[Country]]&\"*\",Nombres[],2,FALSE),IFERROR(VLOOKUP(TablaPaíses[[#This Row],[Nombre corto]],Nombres[],2,FALSE),IF(TablaPaíses[[#This Row],[Nombre corto]]<>\"\",TablaPaíses[[#This Row],[Nombre corto]],TablaPaíses[[#This Row],[País]]&\"*\"))))","v":"República de Nicaragua"},"Nicaragua",{"$f":"IFERROR(VLOOKUP(TablaPaíses[[#This Row],[Country]],Population[],2,FALSE),\"\")","v":6889034}]
["África","Níger",null,{"$f":"IFERROR(VLOOKUP(TablaPaíses[[#This Row],[País]],Nombres[],2,FALSE),IFERROR(VLOOKUP(\"*\"&TablaPaíses[[#This Row],[Country]]&\"*\",Nombres[],2,FALSE),IFERROR(VLOOKUP(TablaPaíses[[#This Row],[Nombre corto]],Nombres[],2,FALSE),IF(TablaPaíses[[#This Row],[Nombre corto]]<>\"\",TablaPaíses[[#This Row],[Nombre corto]],TablaPaíses[[#This Row],[País]]&\"*\"))))","v":"República de Niger"},"Niger",{"$f":"IFERROR(VLOOKUP(TablaPaíses[[#This Row],[Country]],Population[],2,FALSE),\"\")","v":27668402}]
["África","Nigeria",null,{"$f":"IFERROR(VLOOKUP(TablaPaíses[[#This Row],[País]],Nombres[],2,FALSE),IFERROR(VLOOKUP(\"*\"&TablaPaíses[[#This Row],[Country]]&\"*\",Nombres[],2,FALSE),IFERROR(VLOOKUP(TablaPaíses[[#This Row],[Nombre corto]],Nombres[],2,FALSE),IF(TablaPaíses[[#This Row],[Nombre corto]]<>\"\",TablaPaíses[[#This Row],[Nombre corto]],TablaPaíses[[#This Row],[País]]&\"*\"))))","v":"República Federal de Nigeria"},"Nigeria",{"$f":"IFERROR(VLOOKUP(TablaPaíses[[#This Row],[Country]],Population[],2,FALSE),\"\")","v":225538686}]
["Europa","Noruega",null,{"$f":"IFERROR(VLOOKUP(TablaPaíses[[#This Row],[País]],Nombres[],2,FALSE),IFERROR(VLOOKUP(\"*\"&TablaPaíses[[#This Row],[Country]]&\"*\",Nombres[],2,FALSE),IFERROR(VLOOKUP(TablaPaíses[[#This Row],[Nombre corto]],Nombres[],2,FALSE),IF(TablaPaíses[[#This Row],[Nombre corto]]<>\"\",TablaPaíses[[#This Row],[Nombre corto]],TablaPaíses[[#This Row],[País]]&\"*\"))))","v":"Reino de Noruega"},"Norway",{"$f":"IFERROR(VLOOKUP(TablaPaíses[[#This Row],[Country]],Population[],2,FALSE),\"\")","v":5671282}]
["Oceanía","Nueva Zelanda",null,{"$f":"IFERROR(VLOOKUP(TablaPaíses[[#This Row],[País]],Nombres[],2,FALSE),IFERROR(VLOOKUP(\"*\"&TablaPaíses[[#This Row],[Country]]&\"*\",Nombres[],2,FALSE),IFERROR(VLOOKUP(TablaPaíses[[#This Row],[Nombre corto]],Nombres[],2,FALSE),IF(TablaPaíses[[#This Row],[Nombre corto]]<>\"\",TablaPaíses[[#This Row],[Nombre corto]],TablaPaíses[[#This Row],[País]]&\"*\"))))","v":"Nueva Zelanda"},"New Zealand",{"$f":"IFERROR(VLOOKUP(TablaPaíses[[#This Row],[Country]],Population[],2,FALSE),\"\")","v":4938228}]
["Asia","Omán",null,{"$f":"IFERROR(VLOOKUP(TablaPaíses[[#This Row],[País]],Nombres[],2,FALSE),IFERROR(VLOOKUP(\"*\"&TablaPaíses[[#This Row],[Country]]&\"*\",Nombres[],2,FALSE),IFERROR(VLOOKUP(TablaPaíses[[#This Row],[Nombre corto]],Nombres[],2,FALSE),IF(TablaPaíses[[#This Row],[Nombre corto]]<>\"\",TablaPaíses[[#This Row],[Nombre corto]],TablaPaíses[[#This Row],[País]]&\"*\"))))","v":"Sultanía de Omán"},"Oman",{"$f":"IFERROR(VLOOKUP(TablaPaíses[[#This Row],[Country]],Population[],2,FALSE),\"\")","v":6883637}]
["Europa","Países Bajos",null,{"$f":"IFERROR(VLOOKUP(TablaPaíses[[#This Row],[País]],Nombres[],2,FALSE),IFERROR(VLOOKUP(\"*\"&TablaPaíses[[#This Row],[Country]]&\"*\",Nombres[],2,FALSE),IFERROR(VLOOKUP(TablaPaíses[[#This Row],[Nombre corto]],Nombres[],2,FALSE),IF(TablaPaíses[[#This Row],[Nombre corto]]<>\"\",TablaPaíses[[#This Row],[Nombre corto]],TablaPaíses[[#This Row],[País]]&\"*\"))))","v":"Reino de los Países Bajos"},"Netherlands",{"$f":"IFERROR(VLOOKUP(TablaPaíses[[#This Row],[Country]],Population[],2,FALSE),\"\")","v":17349846}]
["Asia","Pakistán",null,{"$f":"IFERROR(VLOOKUP(TablaPaíses[[#This Row],[País]],Nombres[],2,FALSE),IFERROR(VLOOKUP(\"*\"&TablaPaíses[[#This Row],[Country]]&\"*\",Nombres[],2,FALSE),IFERROR(VLOOKUP(TablaPaíses[[#This Row],[Nombre corto]],Nombres[],2,FALSE),IF(TablaPaíses[[#This Row],[Nombre corto]]<>\"\",TablaPaíses[[#This Row],[Nombre corto]],TablaPaíses[[#This Row],[País]]&\"*\"))))","v":"República Islámica de Pakistán"},"Pakistan",{"$f":"IFERROR(VLOOKUP(TablaPaíses[[#This Row],[Country]],Population[],2,FALSE),\"\")","v":237206546}]
["Asia","Palestina",null,{"$f":"IFERROR(VLOOKUP(TablaPaíses[[#This Row],[País]],Nombres[],2,FALSE),IFERROR(VLOOKUP(\"*\"&TablaPaíses[[#This Row],[Country]]&\"*\",Nombres[],2,FALSE),IFERROR(VLOOKUP(TablaPaíses[[#This Row],[Nombre corto]],Nombres[],2,FALSE),IF(TablaPaíses[[#This Row],[Nombre corto]]<>\"\",TablaPaíses[[#This Row],[Nombre corto]],TablaPaíses[[#This Row],[País]]&\"*\"))))","v":"Palestina*"},"Palestinian Authority",{"$f":"IFERROR(VLOOKUP(TablaPaíses[[#This Row],[Country]],Population[],2,FALSE),\"\")","v":5602506}]
["América del Norte","Panamá",null,{"$f":"IFERROR(VLOOKUP(TablaPaíses[[#This Row],[País]],Nombres[],2,FALSE),IFERROR(VLOOKUP(\"*\"&TablaPaíses[[#This Row],[Country]]&\"*\",Nombres[],2,FALSE),IFERROR(VLOOKUP(TablaPaíses[[#This Row],[Nombre corto]],Nombres[],2,FALSE),IF(TablaPaíses[[#This Row],[Nombre corto]]<>\"\",TablaPaíses[[#This Row],[Nombre corto]],TablaPaíses[[#This Row],[País]]&\"*\"))))","v":"República de Panamá"},"Panama",{"$f":"IFERROR(VLOOKUP(TablaPaíses[[#This Row],[Country]],Population[],2,FALSE),\"\")","v":4560019}]
["Oceanía","Papúa Nueva Guinea",null,{"$f":"IFERROR(VLOOKUP(TablaPaíses[[#This Row],[País]],Nombres[],2,FALSE),IFERROR(VLOOKUP(\"*\"&TablaPaíses[[#This Row],[Country]]&\"*\",Nombres[],2,FALSE),IFERROR(VLOOKUP(TablaPaíses[[#This Row],[Nombre corto]],Nombres[],2,FALSE),IF(TablaPaíses[[#This Row],[Nombre corto]]<>\"\",TablaPaíses[[#This Row],[Nombre corto]],TablaPaíses[[#This Row],[País]]&\"*\"))))","v":"Papúa Nueva Guinea"},"Papua New Guinea",{"$f":"IFERROR(VLOOKUP(TablaPaíses[[#This Row],[Country]],Population[],2,FALSE),\"\")","v":9621537}]
["América del Sur","Paraguay",null,{"$f":"IFERROR(VLOOKUP(TablaPaíses[[#This Row],[País]],Nombres[],2,FALSE),IFERROR(VLOOKUP(\"*\"&TablaPaíses[[#This Row],[Country]]&\"*\",Nombres[],2,FALSE),IFERROR(VLOOKUP(TablaPaíses[[#This Row],[Nombre corto]],Nombres[],2,FALSE),IF(TablaPaíses[[#This Row],[Nombre corto]]<>\"\",TablaPaíses[[#This Row],[Nombre corto]],TablaPaíses[[#This Row],[País]]&\"*\"))))","v":"República del Paraguay"},"Paraguay",{"$f":"IFERROR(VLOOKUP(TablaPaíses[[#This Row],[Country]],Population[],2,FALSE),\"\")","v":7464781}]
["América del Sur","Perú",null,{"$f":"IFERROR(VLOOKUP(TablaPaíses[[#This Row],[País]],Nombres[],2,FALSE),IFERROR(VLOOKUP(\"*\"&TablaPaíses[[#This Row],[Country]]&\"*\",Nombres[],2,FALSE),IFERROR(VLOOKUP(TablaPaíses[[#This Row],[Nombre corto]],Nombres[],2,FALSE),IF(TablaPaíses[[#This Row],[Nombre corto]]<>\"\",TablaPaíses[[#This Row],[Nombre corto]],TablaPaíses[[#This Row],[País]]&\"*\"))))","v":"República del Perú"},"Peru",{"$f":"IFERROR(VLOOKUP(TablaPaíses[[#This Row],[Country]],Population[],2,FALSE),\"\")","v":34456389}]
["Europa","Polonia",null,{"$f":"IFERROR(VLOOKUP(TablaPaíses[[#This Row],[País]],Nombres[],2,FALSE),IFERROR(VLOOKUP(\"*\"&TablaPaíses[[#This Row],[Country]]&\"*\",Nombres[],2,FALSE),IFERROR(VLOOKUP(TablaPaíses[[#This Row],[Nombre corto]],Nombres[],2,FALSE),IF(TablaPaíses[[#This Row],[Nombre corto]]<>\"\",TablaPaíses[[#This Row],[Nombre corto]],TablaPaíses[[#This Row],[País]]&\"*\"))))","v":"República de Polonia"},"Poland",{"$f":"IFERROR(VLOOKUP(TablaPaíses[[#This Row],[Country]],Population[],2,FALSE),\"\")","v":37895094}]
["Europa","Portugal",null,{"$f":"IFERROR(VLOOKUP(TablaPaíses[[#This Row],[País]],Nombres[],2,FALSE),IFERROR(VLOOKUP(\"*\"&TablaPaíses[[#This Row],[Country]]&\"*\",Nombres[],2,FALSE),IFERROR(VLOOKUP(TablaPaíses[[#This Row],[Nombre corto]],Nombres[],2,FALSE),IF(TablaPaíses[[#This Row],[Nombre corto]]<>\"\",TablaPaíses[[#This Row],[Nombre corto]],TablaPaíses[[#This Row],[País]]&\"*\"))))","v":"República Portuguesa"},"Portugal",{"$f":"IFERROR(VLOOKUP(TablaPaíses[[#This Row],[Country]],Population[],2,FALSE),\"\")","v":10034031}]
["Europa","Reino Unido",null,{"$f":"IFERROR(VLOOKUP(TablaPaíses[[#This Row],[País]],Nombres[],2,FALSE),IFERROR(VLOOKUP(\"*\"&TablaPaíses[[#This Row],[Country]]&\"*\",Nombres[],2,FALSE),IFERROR(VLOOKUP(TablaPaíses[[#This Row],[Nombre corto]],Nombres[],2,FALSE),IF(TablaPaíses[[#This Row],[Nombre corto]]<>\"\",TablaPaíses[[#This Row],[Nombre corto]],TablaPaíses[[#This Row],[País]]&\"*\"))))","v":"Reino Unido*"},"United Kingdom (UK)",{"$f":"IFERROR(VLOOKUP(TablaPaíses[[#This Row],[Country]],Population[],2,FALSE),\"\")","v":69379700}]
["África","República Centroafricana",null,{"$f":"IFERROR(VLOOKUP(TablaPaíses[[#This Row],[País]],Nombres[],2,FALSE),IFERROR(VLOOKUP(\"*\"&TablaPaíses[[#This Row],[Country]]&\"*\",Nombres[],2,FALSE),IFERROR(VLOOKUP(TablaPaíses[[#This Row],[Nombre corto]],Nombres[],2,FALSE),IF(TablaPaíses[[#This Row],[Nombre corto]]<>\"\",TablaPaíses[[#This Row],[Nombre corto]],TablaPaíses[[#This Row],[País]]&\"*\"))))","v":"República Centroafricana"},"Central African Republic",{"$f":"IFERROR(VLOOKUP(TablaPaíses[[#This Row],[Country]],Population[],2,FALSE),\"\")","v":5161442}]
["Europa","República Checa",null,{"$f":"IFERROR(VLOOKUP(TablaPaíses[[#This Row],[País]],Nombres[],2,FALSE),IFERROR(VLOOKUP(\"*\"&TablaPaíses[[#This Row],[Country]]&\"*\",Nombres[],2,FALSE),IFERROR(VLOOKUP(TablaPaíses[[#This Row],[Nombre corto]],Nombres[],2,FALSE),IF(TablaPaíses[[#This Row],[Nombre corto]]<>\"\",TablaPaíses[[#This Row],[Nombre corto]],TablaPaíses[[#This Row],[País]]&\"*\"))))","v":"República Checa"},"Czech Republic",{"$f":"IFERROR(VLOOKUP(TablaPaíses[[#This Row],[Country]],Population[],2,FALSE),\"\")","v":10727922}]
["África","República del Congo",null,{"$f":"IFERROR(VLOOKUP(TablaPaíses[[#This Row],[País]],Nombres[],2,FALSE),IFERROR(VLOOKUP(\"*\"&TablaPaíses[[#This Row],[Country]]&\"*\",Nombres[],2,FALSE),IFERROR(VLOOKUP(TablaPaíses[[#This Row],[Nombre corto]],Nombres[],2,FALSE),IF(TablaPaíses[[#This Row],[Nombre corto]]<>\"\",TablaPaíses[[#This Row],[Nombre corto]],TablaPaíses[[#This Row],[País]]&\"*\"))))","v":"República del Congo"},"Congo",{"$f":"IFERROR(VLOOKUP(TablaPaíses[[#This Row],[Country]],Population[],2,FALSE),\"\")","v":6011610}]
["África","República Democrática del Congo",null,{"$f":"IFERROR(VLOOKUP(TablaPaíses[[#This Row],[País]],Nombres[],2,FALSE),IFERROR(VLOOKUP(\"*\"&TablaPaíses[[#This Row],[Country]]&\"*\",Nombres[],2,FALSE),IFERROR(VLOOKUP(TablaPaíses[[#This Row],[Nombre corto]],Nombres[],2,FALSE),IF(TablaPaíses[[#This Row],[Nombre corto]]<>\"\",TablaPaíses[[#This Row],[Nombre corto]],TablaPaíses[[#This Row],[País]]&\"*\"))))","v":"República Democrática del Congo"},"Democratic Republic of the Congo",{"$f":"IFERROR(VLOOKUP(TablaPaíses[[#This Row],[Country]],Population[],2,FALSE),\"\")","v":99557681}]
["América del Norte","República Dominicana",null,{"$f":"IFERROR(VLOOKUP(TablaPaíses[[#This Row],[País]],Nombres[],2,FALSE),IFERROR(VLOOKUP(\"*\"&TablaPaíses[[#This Row],[Country]]&\"*\",Nombres[],2,FALSE),IFERROR(VLOOKUP(TablaPaíses[[#This Row],[Nombre corto]],Nombres[],2,FALSE),IF(TablaPaíses[[#This Row],[Nombre corto]]<>\"\",TablaPaíses[[#This Row],[Nombre corto]],TablaPaíses[[#This Row],[País]]&\"*\"))))","v":"República Dominicana"},"Dominican Republic",{"$f":"IFERROR(VLOOKUP(TablaPaíses[[#This Row],[Country]],Population[],2,FALSE),\"\")","v":11321684}]
["África","Ruanda",null,{"$f":"IFERROR(VLOOKUP(TablaPaíses[[#This Row],[País]],Nombres[],2,FALSE),IFERROR(VLOOKUP(\"*\"&TablaPaíses[[#This Row],[Country]]&\"*\",Nombres[],2,FALSE),IFERROR(VLOOKUP(TablaPaíses[[#This Row],[Nombre corto]],Nombres[],2,FALSE),IF(TablaPaíses[[#This Row],[Nombre corto]]<>\"\",TablaPaíses[[#This Row],[Nombre corto]],TablaPaíses[[#This Row],[País]]&\"*\"))))","v":"República de Rwanda"},"Rwanda",{"$f":"IFERROR(VLOOKUP(TablaPaíses[[#This Row],[Country]],Population[],2,FALSE),\"\")","v":14029645}]
["Europa","Rumanía","Rumanía",{"$f":"IFERROR(VLOOKUP(TablaPaíses[[#This Row],[País]],Nombres[],2,FALSE),IFERROR(VLOOKUP(\"*\"&TablaPaíses[[#This Row],[Country]]&\"*\",Nombres[],2,FALSE),IFERROR(VLOOKUP(TablaPaíses[[#This Row],[Nombre corto]],Nombres[],2,FALSE),IF(TablaPaíses[[#This Row],[Nombre corto]]<>\"\",TablaPaíses[[#This Row],[Nombre corto]],TablaPaíses[[#This Row],[País]]&\"*\"))))","v":"Rumanía"},"Romania",{"$f":"IFERROR(VLOOKUP(TablaPaíses[[#This Row],[Country]],Population[],2,FALSE),\"\")","v":18713233}]
["Europa","Rusia","Federación de Rusia",{"$f":"IFERROR(VLOOKUP(TablaPaíses[[#This Row],[País]],Nombres[],2,FALSE),IFERROR(VLOOKUP(\"*\"&TablaPaíses[[#This Row],[Country]]&\"*\",Nombres[],2,FALSE),IFERROR(VLOOKUP(TablaPaíses[[#This Row],[Nombre corto]],Nombres[],2,FALSE),IF(TablaPaíses[[#This Row],[Nombre corto]]<>\"\",TablaPaíses[[#This Row],[Nombre corto]],TablaPaíses[[#This Row],[País]]&\"*\"))))","v":"Federación de Rusia"},"Russian Federation",{"$f":"IFERROR(VLOOKUP(TablaPaíses[[#This Row],[Country]],Population[],2,FALSE),\"\")","v":146136559}]
["Europa","San Marino",null,{"$f":"IFERROR(VLOOKUP(TablaPaíses[[#This Row],[País]],Nombres[],2,FALSE),IFERROR(VLOOKUP(\"*\"&TablaPaíses[[#This Row],[Country]]&\"*\",Nombres[],2,FALSE),IFERROR(VLOOKUP(TablaPaíses[[#This Row],[Nombre corto]],Nombres[],2,FALSE),IF(TablaPaíses[[#This Row],[Nombre corto]]<>\"\",TablaPaíses[[#This Row],[Nombre corto]],TablaPaíses[[#This Row],[País]]&\"*\"))))","v":"República de San Marino"},"San Marino",{"$f":"IFERROR(VLOOKUP(TablaPaíses[[#This Row],[Country]],Population[],2,FALSE),\"\")","v":35299}]
["África","Santo Tomé y Príncipe",null,{"$f":"IFERROR(VLOOKUP(TablaPaíses[[#This Row],[País]],Nombres[],2,FALSE),IFERROR(VLOOKUP(\"*\"&TablaPaíses[[#This Row],[Country]]&\"*\",Nombres[],2,FALSE),IFERROR(VLOOKUP(TablaPaíses[[#This Row],[Nombre corto]],Nombres[],2,FALSE),IF(TablaPaíses[[#This Row],[Nombre corto]]<>\"\",TablaPaíses[[#This Row],[Nombre corto]],TablaPaíses[[#This Row],[País]]&\"*\"))))","v":"República Democrática de Santo Tomé y Príncipe"},"Sao Tome and Principe",{"$f":"IFERROR(VLOOKUP(TablaPaíses[[#This Row],[Country]],Population[],2,FALSE),\"\")","v":235913}]
["África","Sáhara Occidental","República Árabe Saharaui Democrática",{"$f":"IFERROR(VLOOKUP(TablaPaíses[[#This Row],[País]],Nombres[],2,FALSE),IFERROR(VLOOKUP(\"*\"&TablaPaíses[[#This Row],[Country]]&\"*\",Nombres[],2,FALSE),IFERROR(VLOOKUP(TablaPaíses[[#This Row],[Nombre corto]],Nombres[],2,FALSE),IF(TablaPaíses[[#This Row],[Nombre corto]]<>\"\",TablaPaíses[[#This Row],[Nombre corto]],TablaPaíses[[#This Row],[País]]&\"*\"))))","v":"República Árabe Saharaui Democrática"},"Western Sahara",{"$f":"IFERROR(VLOOKUP(TablaPaíses[[#This Row],[Country]],Population[],2,FALSE),\"\")","v":642843}]
["África","Senegal",null,{"$f":"IFERROR(VLOOKUP(TablaPaíses[[#This Row],[País]],Nombres[],2,FALSE),IFERROR(VLOOKUP(\"*\"&TablaPaíses[[#This Row],[Country]]&\"*\",Nombres[],2,FALSE),IFERROR(VLOOKUP(TablaPaíses[[#This Row],[Nombre corto]],Nombres[],2,FALSE),IF(TablaPaíses[[#This Row],[Nombre corto]]<>\"\",TablaPaíses[[#This Row],[Nombre corto]],TablaPaíses[[#This Row],[País]]&\"*\"))))","v":"República de Senegal"},"Senegal",{"$f":"IFERROR(VLOOKUP(TablaPaíses[[#This Row],[Country]],Population[],2,FALSE),\"\")","v":18603776}]
["Europa","Serbia",null,{"$f":"IFERROR(VLOOKUP(TablaPaíses[[#This Row],[País]],Nombres[],2,FALSE),IFERROR(VLOOKUP(\"*\"&TablaPaíses[[#This Row],[Country]]&\"*\",Nombres[],2,FALSE),IFERROR(VLOOKUP(TablaPaíses[[#This Row],[Nombre corto]],Nombres[],2,FALSE),IF(TablaPaíses[[#This Row],[Nombre corto]]<>\"\",TablaPaíses[[#This Row],[Nombre corto]],TablaPaíses[[#This Row],[País]]&\"*\"))))","v":"República de Serbia"},"Serbia",{"$f":"IFERROR(VLOOKUP(TablaPaíses[[#This Row],[Country]],Population[],2,FALSE),\"\")","v":8597624}]
["África","Sierra Leona",null,{"$f":"IFERROR(VLOOKUP(TablaPaíses[[#This Row],[País]],Nombres[],2,FALSE),IFERROR(VLOOKUP(\"*\"&TablaPaíses[[#This Row],[Country]]&\"*\",Nombres[],2,FALSE),IFERROR(VLOOKUP(TablaPaíses[[#This Row],[Nombre corto]],Nombres[],2,FALSE),IF(TablaPaíses[[#This Row],[Nombre corto]]<>\"\",TablaPaíses[[#This Row],[Nombre corto]],TablaPaíses[[#This Row],[País]]&\"*\"))))","v":"República de Sierra Leona"},"Sierra Leone",{"$f":"IFERROR(VLOOKUP(TablaPaíses[[#This Row],[Country]],Population[],2,FALSE),\"\")","v":8598720}]
["Asia","Singapur",null,{"$f":"IFERROR(VLOOKUP(TablaPaíses[[#This Row],[País]],Nombres[],2,FALSE),IFERROR(VLOOKUP(\"*\"&TablaPaíses[[#This Row],[Country]]&\"*\",Nombres[],2,FALSE),IFERROR(VLOOKUP(TablaPaíses[[#This Row],[Nombre corto]],Nombres[],2,FALSE),IF(TablaPaíses[[#This Row],[Nombre corto]]<>\"\",TablaPaíses[[#This Row],[Nombre corto]],TablaPaíses[[#This Row],[País]]&\"*\"))))","v":"República de Singapur"},"Singapore",{"$f":"IFERROR(VLOOKUP(TablaPaíses[[#This Row],[Country]],Population[],2,FALSE),\"\")","v":6286216}]
["Asia","Siria",null,{"$f":"IFERROR(VLOOKUP(TablaPaíses[[#This Row],[País]],Nombres[],2,FALSE),IFERROR(VLOOKUP(\"*\"&TablaPaíses[[#This Row],[Country]]&\"*\",Nombres[],2,FALSE),IFERROR(VLOOKUP(TablaPaíses[[#This Row],[Nombre corto]],Nombres[],2,FALSE),IF(TablaPaíses[[#This Row],[Nombre corto]]<>\"\",TablaPaíses[[#This Row],[Nombre corto]],TablaPaíses[[#This Row],[País]]&\"*\"))))","v":"República Árabe Siria"},"Syria",{"$f":"IFERROR(VLOOKUP(TablaPaíses[[#This Row],[Country]],Population[],2,FALSE),\"\")","v":15813766}]
["África","Somalia",null,{"$f":"IFERROR(VLOOKUP(TablaPaíses[[#This Row],[País]],Nombres[],2,FALSE),IFERROR(VLOOKUP(\"*\"&TablaPaíses[[#This Row],[Country]]&\"*\",Nombres[],2,FALSE),IFERROR(VLOOKUP(TablaPaíses[[#This Row],[Nombre corto]],Nombres[],2,FALSE),IF(TablaPaíses[[#This Row],[Nombre corto]]<>\"\",TablaPaíses[[#This Row],[Nombre corto]],TablaPaíses[[#This Row],[País]]&\"*\"))))","v":"República Somalí "},"Somalia",{"$f":"IFERROR(VLOOKUP(TablaPaíses[[#This Row],[Country]],Population[],2,FALSE),\"\")","v":17163207}]
["Asia","Sri Lanka",null,{"$f":"IFERROR(VLOOKUP(TablaPaíses[[#This Row],[País]],Nombres[],2,FALSE),IFERROR(VLOOKUP(\"*\"&TablaPaíses[[#This Row],[Country]]&\"*\",Nombres[],2,FALSE),IFERROR(VLOOKUP(TablaPaíses[[#This Row],[Nombre corto]],Nombres[],2,FALSE),IF(TablaPaíses[[#This Row],[Nombre corto]]<>\"\",TablaPaíses[[#This Row],[Nombre corto]],TablaPaíses[[#This Row],[País]]&\"*\"))))","v":"República Socialista Democrática de Sri Lanka"},"Sri Lanka",{"$f":"IFERROR(VLOOKUP(TablaPaíses[[#This Row],[Country]],Population[],2,FALSE),\"\")","v":21789428}]
["África","Suazilandia",null,{"$f":"IFERROR(VLOOKUP(TablaPaíses[[#This Row],[País]],Nombres[],2,FALSE),IFERROR(VLOOKUP(\"*\"&TablaPaíses[[#This Row],[Country]]&\"*\",Nombres[],2,FALSE),IFERROR(VLOOKUP(TablaPaíses[[#This Row],[Nombre corto]],Nombres[],2,FALSE),IF(TablaPaíses[[#This Row],[Nombre corto]]<>\"\",TablaPaíses[[#This Row],[Nombre corto]],TablaPaíses[[#This Row],[País]]&\"*\"))))","v":"Reino de Swazilandia"},"Swaziland",{"$f":"IFERROR(VLOOKUP(TablaPaíses[[#This Row],[Country]],Population[],2,FALSE),\"\")","v":1223682}]
["África","Sudáfrica",null,{"$f":"IFERROR(VLOOKUP(TablaPaíses[[#This Row],[País]],Nombres[],2,FALSE),IFERROR(VLOOKUP(\"*\"&TablaPaíses[[#This Row],[Country]]&\"*\",Nombres[],2,FALSE),IFERROR(VLOOKUP(TablaPaíses[[#This Row],[Nombre corto]],Nombres[],2,FALSE),IF(TablaPaíses[[#This Row],[Nombre corto]]<>\"\",TablaPaíses[[#This Row],[Nombre corto]],TablaPaíses[[#This Row],[País]]&\"*\"))))","v":"República de Sudáfrica"},"South Africa",{"$f":"IFERROR(VLOOKUP(TablaPaíses[[#This Row],[Country]],Population[],2,FALSE),\"\")","v":61455217}]
["África","Sudán",null,{"$f":"IFERROR(VLOOKUP(TablaPaíses[[#This Row],[País]],Nombres[],2,FALSE),IFERROR(VLOOKUP(\"*\"&TablaPaíses[[#This Row],[Country]]&\"*\",Nombres[],2,FALSE),IFERROR(VLOOKUP(TablaPaíses[[#This Row],[Nombre corto]],Nombres[],2,FALSE),IF(TablaPaíses[[#This Row],[Nombre corto]]<>\"\",TablaPaíses[[#This Row],[Nombre corto]],TablaPaíses[[#This Row],[País]]&\"*\"))))","v":"República de Sudán"},"Sudan",{"$f":"IFERROR(VLOOKUP(TablaPaíses[[#This Row],[Country]],Population[],2,FALSE),\"\")","v":47092782}]
["África","Sudán del Sur",null,{"$f":"IFERROR(VLOOKUP(TablaPaíses[[#This Row],[País]],Nombres[],2,FALSE),IFERROR(VLOOKUP(\"*\"&TablaPaíses[[#This Row],[Country]]&\"*\",Nombres[],2,FALSE),IFERROR(VLOOKUP(TablaPaíses[[#This Row],[Nombre corto]],Nombres[],2,FALSE),IF(TablaPaíses[[#This Row],[Nombre corto]]<>\"\",TablaPaíses[[#This Row],[Nombre corto]],TablaPaíses[[#This Row],[País]]&\"*\"))))","v":"República de Sudán del Sur"},"South Sudan",{"$f":"IFERROR(VLOOKUP(TablaPaíses[[#This Row],[Country]],Population[],2,FALSE),\"\")","v":13003435}]
["Europa","Suecia",null,{"$f":"IFERROR(VLOOKUP(TablaPaíses[[#This Row],[País]],Nombres[],2,FALSE),IFERROR(VLOOKUP(\"*\"&TablaPaíses[[#This Row],[Country]]&\"*\",Nombres[],2,FALSE),IFERROR(VLOOKUP(TablaPaíses[[#This Row],[Nombre corto]],Nombres[],2,FALSE),IF(TablaPaíses[[#This Row],[Nombre corto]]<>\"\",TablaPaíses[[#This Row],[Nombre corto]],TablaPaíses[[#This Row],[País]]&\"*\"))))","v":"Reino de Suecia"},"Sweden",{"$f":"IFERROR(VLOOKUP(TablaPaíses[[#This Row],[Country]],Population[],2,FALSE),\"\")","v":10396890}]
["Europa","Suiza",null,{"$f":"IFERROR(VLOOKUP(TablaPaíses[[#This Row],[País]],Nombres[],2,FALSE),IFERROR(VLOOKUP(\"*\"&TablaPaíses[[#This Row],[Country]]&\"*\",Nombres[],2,FALSE),IFERROR(VLOOKUP(TablaPaíses[[#This Row],[Nombre corto]],Nombres[],2,FALSE),IF(TablaPaíses[[#This Row],[Nombre corto]]<>\"\",TablaPaíses[[#This Row],[Nombre corto]],TablaPaíses[[#This Row],[País]]&\"*\"))))","v":"Confederación Suiza"},"Switzerland",{"$f":"IFERROR(VLOOKUP(TablaPaíses[[#This Row],[Country]],Population[],2,FALSE),\"\")","v":9019575}]
["América del Sur","Surinam",null,{"$f":"IFERROR(VLOOKUP(TablaPaíses[[#This Row],[País]],Nombres[],2,FALSE),IFERROR(VLOOKUP(\"*\"&TablaPaíses[[#This Row],[Country]]&\"*\",Nombres[],2,FALSE),IFERROR(VLOOKUP(TablaPaíses[[#This Row],[Nombre corto]],Nombres[],2,FALSE),IF(TablaPaíses[[#This Row],[Nombre corto]]<>\"\",TablaPaíses[[#This Row],[Nombre corto]],TablaPaíses[[#This Row],[País]]&\"*\"))))","v":"República de Surinam"},"Suriname",{"$f":"IFERROR(VLOOKUP(TablaPaíses[[#This Row],[Country]],Population[],2,FALSE),\"\")","v":605587}]
["Asia","Tailandia",null,{"$f":"IFERROR(VLOOKUP(TablaPaíses[[#This Row],[País]],Nombres[],2,FALSE),IFERROR(VLOOKUP(\"*\"&TablaPaíses[[#This Row],[Country]]&\"*\",Nombres[],2,FALSE),IFERROR(VLOOKUP(TablaPaíses[[#This Row],[Nombre corto]],Nombres[],2,FALSE),IF(TablaPaíses[[#This Row],[Nombre corto]]<>\"\",TablaPaíses[[#This Row],[Nombre corto]],TablaPaíses[[#This Row],[País]]&\"*\"))))","v":"Reino de Tailandia"},"Thailand",{"$f":"IFERROR(VLOOKUP(TablaPaíses[[#This Row],[Country]],Population[],2,FALSE),\"\")","v":70742091}]
["África","Tanzania",null,{"$f":"IFERROR(VLOOKUP(TablaPaíses[[#This Row],[País]],Nombres[],2,FALSE),IFERROR(VLOOKUP(\"*\"&TablaPaíses[[#This Row],[Country]]&\"*\",Nombres[],2,FALSE),IFERROR(VLOOKUP(TablaPaíses[[#This Row],[Nombre corto]],Nombres[],2,FALSE),IF(TablaPaíses[[#This Row],[Nombre corto]]<>\"\",TablaPaíses[[#This Row],[Nombre corto]],TablaPaíses[[#This Row],[País]]&\"*\"))))","v":"República Unida de Tanzania"},"Tanzania",{"$f":"IFERROR(VLOOKUP(TablaPaíses[[#This Row],[Country]],Population[],2,FALSE),\"\")","v":66448260}]
["Asia","Tayikistán",null,{"$f":"IFERROR(VLOOKUP(TablaPaíses[[#This Row],[País]],Nombres[],2,FALSE),IFERROR(VLOOKUP(\"*\"&TablaPaíses[[#This Row],[Country]]&\"*\",Nombres[],2,FALSE),IFERROR(VLOOKUP(TablaPaíses[[#This Row],[Nombre corto]],Nombres[],2,FALSE),IF(TablaPaíses[[#This Row],[Nombre corto]]<>\"\",TablaPaíses[[#This Row],[Nombre corto]],TablaPaíses[[#This Row],[País]]&\"*\"))))","v":"República de Tayikistán"},"Tajikistan",{"$f":"IFERROR(VLOOKUP(TablaPaíses[[#This Row],[Country]],Population[],2,FALSE),\"\")","v":10280323}]
["Asia","Timor Oriental",null,{"$f":"IFERROR(VLOOKUP(TablaPaíses[[#This Row],[País]],Nombres[],2,FALSE),IFERROR(VLOOKUP(\"*\"&TablaPaíses[[#This Row],[Country]]&\"*\",Nombres[],2,FALSE),IFERROR(VLOOKUP(TablaPaíses[[#This Row],[Nombre corto]],Nombres[],2,FALSE),IF(TablaPaíses[[#This Row],[Nombre corto]]<>\"\",TablaPaíses[[#This Row],[Nombre corto]],TablaPaíses[[#This Row],[País]]&\"*\"))))","v":"República Democrática de Timor Oriental"},"Timor-Leste",{"$f":"IFERROR(VLOOKUP(TablaPaíses[[#This Row],[Country]],Population[],2,FALSE),\"\")","v":1425512}]
["África","Togo",null,{"$f":"IFERROR(VLOOKUP(TablaPaíses[[#This Row],[País]],Nombres[],2,FALSE),IFERROR(VLOOKUP(\"*\"&TablaPaíses[[#This Row],[Country]]&\"*\",Nombres[],2,FALSE),IFERROR(VLOOKUP(TablaPaíses[[#This Row],[Nombre corto]],Nombres[],2,FALSE),IF(TablaPaíses[[#This Row],[Nombre corto]]<>\"\",TablaPaíses[[#This Row],[Nombre corto]],TablaPaíses[[#This Row],[País]]&\"*\"))))","v":"República Togolesa"},"Togo",{"$f":"IFERROR(VLOOKUP(TablaPaíses[[#This Row],[Country]],Population[],2,FALSE),\"\")","v":9064498}]
["África","Túnez",null,{"$f":"IFERROR(VLOOKUP(TablaPaíses[[#This Row],[País]],Nombres[],2,FALSE),IFERROR(VLOOKUP(\"*\"&TablaPaíses[[#This Row],[Country]]&\"*\",Nombres[],2,FALSE),IFERROR(VLOOKUP(TablaPaíses[[#This Row],[Nombre corto]],Nombres[],2,FALSE),IF(TablaPaíses[[#This Row],[Nombre corto]]<>\"\",TablaPaíses[[#This Row],[Nombre corto]],TablaPaíses[[#This Row],[País]]&\"*\"))))","v":"República de Túnez"},"Tunisia",{"$f":"IFERROR(VLOOKUP(TablaPaíses[[#This Row],[Country]],Population[],2,FALSE),\"\")","v":12279035}]
["Asia","Turkmenistán",null,{"$f":"IFERROR(VLOOKUP(TablaPaíses[[#This Row],[País]],Nombres[],2,FALSE),IFERROR(VLOOKUP(\"*\"&TablaPaíses[[#This Row],[Country]]&\"*\",Nombres[],2,FALSE),IFERROR(VLOOKUP(TablaPaíses[[#This Row],[Nombre corto]],Nombres[],2,FALSE),IF(TablaPaíses[[#This Row],[Nombre corto]]<>\"\",TablaPaíses[[#This Row],[Nombre corto]],TablaPaíses[[#This Row],[País]]&\"*\"))))","v":"Turkmenistán"},"Turkmenistan",{"$f":"IFERROR(VLOOKUP(TablaPaíses[[#This Row],[Country]],Population[],2,FALSE),\"\")","v":6289149}]
["Asia","Turquía",null,{"$f":"IFERROR(VLOOKUP(TablaPaíses[[#This Row],[País]],Nombres[],2,FALSE),IFERROR(VLOOKUP(\"*\"&TablaPaíses[[#This Row],[Country]]&\"*\",Nombres[],2,FALSE),IFERROR(VLOOKUP(TablaPaíses[[#This Row],[Nombre corto]],Nombres[],2,FALSE),IF(TablaPaíses[[#This Row],[Nombre corto]]<>\"\",TablaPaíses[[#This Row],[Nombre corto]],TablaPaíses[[#This Row],[País]]&\"*\"))))","v":"República de Turquía"},"Turkey",{"$f":"IFERROR(VLOOKUP(TablaPaíses[[#This Row],[Country]],Population[],2,FALSE),\"\")","v":89523086}]
["Europa","Ucrania",null,{"$f":"IFERROR(VLOOKUP(TablaPaíses[[#This Row],[País]],Nombres[],2,FALSE),IFERROR(VLOOKUP(\"*\"&TablaPaíses[[#This Row],[Country]]&\"*\",Nombres[],2,FALSE),IFERROR(VLOOKUP(TablaPaíses[[#This Row],[Nombre corto]],Nombres[],2,FALSE),IF(TablaPaíses[[#This Row],[Nombre corto]]<>\"\",TablaPaíses[[#This Row],[Nombre corto]],TablaPaíses[[#This Row],[País]]&\"*\"))))","v":"Ucrania"},"Ukraine",{"$f":"IFERROR(VLOOKUP(TablaPaíses[[#This Row],[Country]],Population[],2,FALSE),\"\")","v":43244699}]
["África","Uganda",null,{"$f":"IFERROR(VLOOKUP(TablaPaíses[[#This Row],[País]],Nombres[],2,FALSE),IFERROR(VLOOKUP(\"*\"&TablaPaíses[[#This Row],[Country]]&\"*\",Nombres[],2,FALSE),IFERROR(VLOOKUP(TablaPaíses[[#This Row],[Nombre corto]],Nombres[],2,FALSE),IF(TablaPaíses[[#This Row],[Nombre corto]]<>\"\",TablaPaíses[[#This Row],[Nombre corto]],TablaPaíses[[#This Row],[País]]&\"*\"))))","v":"República de Uganda"},"Uganda",{"$f":"IFERROR(VLOOKUP(TablaPaíses[[#This Row],[Country]],Population[],2,FALSE),\"\")","v":51001127}]
["América del Sur","Uruguay",null,{"$f":"IFERROR(VLOOKUP(TablaPaíses[[#This Row],[País]],Nombres[],2,FALSE),IFERROR(VLOOKUP(\"*\"&TablaPaíses[[#This Row],[Country]]&\"*\",Nombres[],2,FALSE),IFERROR(VLOOKUP(TablaPaíses[[#This Row],[Nombre corto]],Nombres[],2,FALSE),IF(TablaPaíses[[#This Row],[Nombre corto]]<>\"\",TablaPaíses[[#This Row],[Nombre corto]],TablaPaíses[[#This Row],[País]]&\"*\"))))","v":"República Oriental del Uruguay"},"Uruguay",{"$f":"IFERROR(VLOOKUP(TablaPaíses[[#This Row],[Country]],Population[],2,FALSE),\"\")","v":3513347}]
["Asia","Uzbekistán",null,{"$f":"IFERROR(VLOOKUP(TablaPaíses[[#This Row],[País]],Nombres[],2,FALSE),IFERROR(VLOOKUP(\"*\"&TablaPaíses[[#This Row],[Country]]&\"*\",Nombres[],2,FALSE),IFERROR(VLOOKUP(TablaPaíses[[#This Row],[Nombre corto]],Nombres[],2,FALSE),IF(TablaPaíses[[#This Row],[Nombre corto]]<>\"\",TablaPaíses[[#This Row],[Nombre corto]],TablaPaíses[[#This Row],[País]]&\"*\"))))","v":"República de Uzbekistán"},"Uzbekistan",{"$f":"IFERROR(VLOOKUP(TablaPaíses[[#This Row],[Country]],Population[],2,FALSE),\"\")","v":35203261}]
["Oceanía","Vanuatu",null,{"$f":"IFERROR(VLOOKUP(TablaPaíses[[#This Row],[País]],Nombres[],2,FALSE),IFERROR(VLOOKUP(\"*\"&TablaPaíses[[#This Row],[Country]]&\"*\",Nombres[],2,FALSE),IFERROR(VLOOKUP(TablaPaíses[[#This Row],[Nombre corto]],Nombres[],2,FALSE),IF(TablaPaíses[[#This Row],[Nombre corto]]<>\"\",TablaPaíses[[#This Row],[Nombre corto]],TablaPaíses[[#This Row],[País]]&\"*\"))))","v":"República de Vanuatu"},"Vanuatu",{"$f":"IFERROR(VLOOKUP(TablaPaíses[[#This Row],[Country]],Population[],2,FALSE),\"\")","v":331187}]
["Europa","Ciudad del Vaticano","Estado de la Ciudad del Vaticano",{"$f":"IFERROR(VLOOKUP(TablaPaíses[[#This Row],[País]],Nombres[],2,FALSE),IFERROR(VLOOKUP(\"*\"&TablaPaíses[[#This Row],[Country]]&\"*\",Nombres[],2,FALSE),IFERROR(VLOOKUP(TablaPaíses[[#This Row],[Nombre corto]],Nombres[],2,FALSE),IF(TablaPaíses[[#This Row],[Nombre corto]]<>\"\",TablaPaíses[[#This Row],[Nombre corto]],TablaPaíses[[#This Row],[País]]&\"*\"))))","v":"Estado de la Ciudad del Vaticano"},"Vatican City",{"$f":"IFERROR(VLOOKUP(TablaPaíses[[#This Row],[Country]],Population[],2,FALSE),\"\")","v":""}]
["América del Sur","Venezuela",null,{"$f":"IFERROR(VLOOKUP(TablaPaíses[[#This Row],[País]],Nombres[],2,FALSE),IFERROR(VLOOKUP(\"*\"&TablaPaíses[[#This Row],[Country]]&\"*\",Nombres[],2,FALSE),IFERROR(VLOOKUP(TablaPaíses[[#This Row],[Nombre corto]],Nombres[],2,FALSE),IF(TablaPaíses[[#This Row],[Nombre corto]]<>\"\",TablaPaíses[[#This Row],[Nombre corto]],TablaPaíses[[#This Row],[País]]&\"*\"))))","v":"República Bolivariana de Venezuela"},"Venezuela",{"$f":"IFERROR(VLOOKUP(TablaPaíses[[#This Row],[Country]],Population[],2,FALSE),\"\")","v":30065468}]
["Asia","Vietnam",null,{"$f":"IFERROR(VLOOKUP(TablaPaíses[[#This Row],[País]],Nombres[],2,FALSE),IFERROR(VLOOKUP(\"*\"&TablaPaíses[[#This Row],[Country]]&\"*\",Nombres[],2,FALSE),IFERROR(VLOOKUP(TablaPaíses[[#This Row],[Nombre corto]],Nombres[],2,FALSE),IF(TablaPaíses[[#This Row],[Nombre corto]]<>\"\",TablaPaíses[[#This Row],[Nombre corto]],TablaPaíses[[#This Row],[País]]&\"*\"))))","v":"República Socialista de Vietnam"},"Vietnam",{"$f":"IFERROR(VLOOKUP(TablaPaíses[[#This Row],[Country]],Population[],2,FALSE),\"\")","v":101197557}]
["Asia","Yemen",null,{"$f":"IFERROR(VLOOKUP(TablaPaíses[[#This Row],[País]],Nombres[],2,FALSE),IFERROR(VLOOKUP(\"*\"&TablaPaíses[[#This Row],[Country]]&\"*\",Nombres[],2,FALSE),IFERROR(VLOOKUP(TablaPaíses[[#This Row],[Nombre corto]],Nombres[],2,FALSE),IF(TablaPaíses[[#This Row],[Nombre corto]]<>\"\",TablaPaíses[[#This Row],[Nombre corto]],TablaPaíses[[#This Row],[País]]&\"*\"))))","v":"República de Yemen"},"Yemen",{"$f":"IFERROR(VLOOKUP(TablaPaíses[[#This Row],[Country]],Population[],2,FALSE),\"\")","v":32559426}]
["África","Yibuti",null,{"$f":"IFERROR(VLOOKUP(TablaPaíses[[#This Row],[País]],Nombres[],2,FALSE),IFERROR(VLOOKUP(\"*\"&TablaPaíses[[#This Row],[Country]]&\"*\",Nombres[],2,FALSE),IFERROR(VLOOKUP(TablaPaíses[[#This Row],[Nombre corto]],Nombres[],2,FALSE),IF(TablaPaíses[[#This Row],[Nombre corto]]<>\"\",TablaPaíses[[#This Row],[Nombre corto]],TablaPaíses[[#This Row],[País]]&\"*\"))))","v":"República de Djibouti"},"Djibouti",{"$f":"IFERROR(VLOOKUP(TablaPaíses[[#This Row],[Country]],Population[],2,FALSE),\"\")","v":1032559}]
["África","Zambia",null,{"$f":"IFERROR(VLOOKUP(TablaPaíses[[#This Row],[País]],Nombres[],2,FALSE),IFERROR(VLOOKUP(\"*\"&TablaPaíses[[#This Row],[Country]]&\"*\",Nombres[],2,FALSE),IFERROR(VLOOKUP(TablaPaíses[[#This Row],[Nombre corto]],Nombres[],2,FALSE),IF(TablaPaíses[[#This Row],[Nombre corto]]<>\"\",TablaPaíses[[#This Row],[Nombre corto]],TablaPaíses[[#This Row],[País]]&\"*\"))))","v":"República de Zambia"},"Zambia",{"$f":"IFERROR(VLOOKUP(TablaPaíses[[#This Row],[Country]],Population[],2,FALSE),\"\")","v":20370558}]
["África","Zimbabue",null,{"$f":"IFERROR(VLOOKUP(TablaPaíses[[#This Row],[País]],Nombres[],2,FALSE),IFERROR(VLOOKUP(\"*\"&TablaPaíses[[#This Row],[Country]]&\"*\",Nombres[],2,FALSE),IFERROR(VLOOKUP(TablaPaíses[[#This Row],[Nombre corto]],Nombres[],2,FALSE),IF(TablaPaíses[[#This Row],[Nombre corto]]<>\"\",TablaPaíses[[#This Row],[Nombre corto]],TablaPaíses[[#This Row],[País]]&\"*\"))))","v":"República de Zimbabwe"},"Zimbabwe",{"$f":"IFERROR(VLOOKUP(TablaPaíses[[#This Row],[Country]],Population[],2,FALSE),\"\")","v":16062121}]
["Oceanía","Samoa Americana",null,{"$f":"IFERROR(VLOOKUP(TablaPaíses[[#This Row],[País]],Nombres[],2,FALSE),IFERROR(VLOOKUP(\"*\"&TablaPaíses[[#This Row],[Country]]&\"*\",Nombres[],2,FALSE),IFERROR(VLOOKUP(TablaPaíses[[#This Row],[Nombre corto]],Nombres[],2,FALSE),IF(TablaPaíses[[#This Row],[Nombre corto]]<>\"\",TablaPaíses[[#This Row],[Nombre corto]],TablaPaíses[[#This Row],[País]]&\"*\"))))","v":"Samoa Americana*"},"American Samoa",{"$f":"IFERROR(VLOOKUP(TablaPaíses[[#This Row],[Country]],Population[],2,FALSE),\"\")","v":57905}]
["América del Norte","Anguila",null,{"$f":"IFERROR(VLOOKUP(TablaPaíses[[#This Row],[País]],Nombres[],2,FALSE),IFERROR(VLOOKUP(\"*\"&TablaPaíses[[#This Row],[Country]]&\"*\",Nombres[],2,FALSE),IFERROR(VLOOKUP(TablaPaíses[[#This Row],[Nombre corto]],Nombres[],2,FALSE),IF(TablaPaíses[[#This Row],[Nombre corto]]<>\"\",TablaPaíses[[#This Row],[Nombre corto]],TablaPaíses[[#This Row],[País]]&\"*\"))))","v":"Anguila*"},"Anguilla",{"$f":"IFERROR(VLOOKUP(TablaPaíses[[#This Row],[Country]],Population[],2,FALSE),\"\")","v":16242}]
["América del Norte","Antigua y Barbuda",null,{"$f":"IFERROR(VLOOKUP(TablaPaíses[[#This Row],[País]],Nombres[],2,FALSE),IFERROR(VLOOKUP(\"*\"&TablaPaíses[[#This Row],[Country]]&\"*\",Nombres[],2,FALSE),IFERROR(VLOOKUP(TablaPaíses[[#This Row],[Nombre corto]],Nombres[],2,FALSE),IF(TablaPaíses[[#This Row],[Nombre corto]]<>\"\",TablaPaíses[[#This Row],[Nombre corto]],TablaPaíses[[#This Row],[País]]&\"*\"))))","v":"Antigua y Barbuda"},"Antigua and Barbuda",{"$f":"IFERROR(VLOOKUP(TablaPaíses[[#This Row],[Country]],Population[],2,FALSE),\"\")","v":101471}]
["América del Sur","Aruba",null,{"$f":"IFERROR(VLOOKUP(TablaPaíses[[#This Row],[País]],Nombres[],2,FALSE),IFERROR(VLOOKUP(\"*\"&TablaPaíses[[#This Row],[Country]]&\"*\",Nombres[],2,FALSE),IFERROR(VLOOKUP(TablaPaíses[[#This Row],[Nombre corto]],Nombres[],2,FALSE),IF(TablaPaíses[[#This Row],[Nombre corto]]<>\"\",TablaPaíses[[#This Row],[Nombre corto]],TablaPaíses[[#This Row],[País]]&\"*\"))))","v":"Aruba*"},"Aruba",{"$f":"IFERROR(VLOOKUP(TablaPaíses[[#This Row],[Country]],Population[],2,FALSE),\"\")","v":108404}]
["América del Norte","Barbados",null,{"$f":"IFERROR(VLOOKUP(TablaPaíses[[#This Row],[País]],Nombres[],2,FALSE),IFERROR(VLOOKUP(\"*\"&TablaPaíses[[#This Row],[Country]]&\"*\",Nombres[],2,FALSE),IFERROR(VLOOKUP(TablaPaíses[[#This Row],[Nombre corto]],Nombres[],2,FALSE),IF(TablaPaíses[[#This Row],[Nombre corto]]<>\"\",TablaPaíses[[#This Row],[Nombre corto]],TablaPaíses[[#This Row],[País]]&\"*\"))))","v":"Barbados"},"Barbados",{"$f":"IFERROR(VLOOKUP(TablaPaíses[[#This Row],[Country]],Population[],2,FALSE),\"\")","v":290905}]
["América del Norte","Bermudas",null,{"$f":"IFERROR(VLOOKUP(TablaPaíses[[#This Row],[País]],Nombres[],2,FALSE),IFERROR(VLOOKUP(\"*\"&TablaPaíses[[#This Row],[Country]]&\"*\",Nombres[],2,FALSE),IFERROR(VLOOKUP(TablaPaíses[[#This Row],[Nombre corto]],Nombres[],2,FALSE),IF(TablaPaíses[[#This Row],[Nombre corto]]<>\"\",TablaPaíses[[#This Row],[Nombre corto]],TablaPaíses[[#This Row],[País]]&\"*\"))))","v":"Bermudas*"},"Bermuda",{"$f":"IFERROR(VLOOKUP(TablaPaíses[[#This Row],[Country]],Population[],2,FALSE),\"\")","v":63848}]
["América del Norte","Islas Vírgenes Británicas",null,{"$f":"IFERROR(VLOOKUP(TablaPaíses[[#This Row],[País]],Nombres[],2,FALSE),IFERROR(VLOOKUP(\"*\"&TablaPaíses[[#This Row],[Country]]&\"*\",Nombres[],2,FALSE),IFERROR(VLOOKUP(TablaPaíses[[#This Row],[Nombre corto]],Nombres[],2,FALSE),IF(TablaPaíses[[#This Row],[Nombre corto]]<>\"\",TablaPaíses[[#This Row],[Nombre corto]],TablaPaíses[[#This Row],[País]]&\"*\"))))","v":"Islas Vírgenes Británicas*"},"British Virgin Islands",{"$f":"IFERROR(VLOOKUP(TablaPaíses[[#This Row],[Country]],Population[],2,FALSE),\"\")","v":32232}]
["América del Norte","Islas Caimán",null,{"$f":"IFERROR(VLOOKUP(TablaPaíses[[#This Row],[País]],Nombres[],2,FALSE),IFERROR(VLOOKUP(\"*\"&TablaPaíses[[#This Row],[Country]]&\"*\",Nombres[],2,FALSE),IFERROR(VLOOKUP(TablaPaíses[[#This Row],[Nombre corto]],Nombres[],2,FALSE),IF(TablaPaíses[[#This Row],[Nombre corto]]<>\"\",TablaPaíses[[#This Row],[Nombre corto]],TablaPaíses[[#This Row],[País]]&\"*\"))))","v":"Islas Caimán*"},"Cayman Islands",{"$f":"IFERROR(VLOOKUP(TablaPaíses[[#This Row],[Country]],Population[],2,FALSE),\"\")","v":71349}]
["Europa","Islas del Canal",null,{"$f":"IFERROR(VLOOKUP(TablaPaíses[[#This Row],[País]],Nombres[],2,FALSE),IFERROR(VLOOKUP(\"*\"&TablaPaíses[[#This Row],[Country]]&\"*\",Nombres[],2,FALSE),IFERROR(VLOOKUP(TablaPaíses[[#This Row],[Nombre corto]],Nombres[],2,FALSE),IF(TablaPaíses[[#This Row],[Nombre corto]]<>\"\",TablaPaíses[[#This Row],[Nombre corto]],TablaPaíses[[#This Row],[País]]&\"*\"))))","v":"Islas del Canal*"},"Channel Islands",{"$f":"IFERROR(VLOOKUP(TablaPaíses[[#This Row],[Country]],Population[],2,FALSE),\"\")","v":176514}]
["Oceanía","Islas Cook",null,{"$f":"IFERROR(VLOOKUP(TablaPaíses[[#This Row],[País]],Nombres[],2,FALSE),IFERROR(VLOOKUP(\"*\"&TablaPaíses[[#This Row],[Country]]&\"*\",Nombres[],2,FALSE),IFERROR(VLOOKUP(TablaPaíses[[#This Row],[Nombre corto]],Nombres[],2,FALSE),IF(TablaPaíses[[#This Row],[Nombre corto]]<>\"\",TablaPaíses[[#This Row],[Nombre corto]],TablaPaíses[[#This Row],[País]]&\"*\"))))","v":"Islas Cook*"},"Cook Islands",{"$f":"IFERROR(VLOOKUP(TablaPaíses[[#This Row],[Country]],Population[],2,FALSE),\"\")","v":15469}]
["América del Sur","Curazao",null,{"$f":"IFERROR(VLOOKUP(TablaPaíses[[#This Row],[País]],Nombres[],2,FALSE),IFERROR(VLOOKUP(\"*\"&TablaPaíses[[#This Row],[Country]]&\"*\",Nombres[],2,FALSE),IFERROR(VLOOKUP(TablaPaíses[[#This Row],[Nombre corto]],Nombres[],2,FALSE),IF(TablaPaíses[[#This Row],[Nombre corto]]<>\"\",TablaPaíses[[#This Row],[Nombre corto]],TablaPaíses[[#This Row],[País]]&\"*\"))))","v":"Curazao*"},"Curacao",{"$f":"IFERROR(VLOOKUP(TablaPaíses[[#This Row],[Country]],Population[],2,FALSE),\"\")","v":167440}]
["América del Norte","Dominica",null,{"$f":"IFERROR(VLOOKUP(TablaPaíses[[#This Row],[País]],Nombres[],2,FALSE),IFERROR(VLOOKUP(\"*\"&TablaPaíses[[#This Row],[Country]]&\"*\",Nombres[],2,FALSE),IFERROR(VLOOKUP(TablaPaíses[[#This Row],[Nombre corto]],Nombres[],2,FALSE),IF(TablaPaíses[[#This Row],[Nombre corto]]<>\"\",TablaPaíses[[#This Row],[Nombre corto]],TablaPaíses[[#This Row],[País]]&\"*\"))))","v":"Commonwealth de Dominica"},"Dominica",{"$f":"IFERROR(VLOOKUP(TablaPaíses[[#This Row],[Country]],Population[],2,FALSE),\"\")","v":72498}]
["Europa","Islas Feroe",null,{"$f":"IFERROR(VLOOKUP(TablaPaíses[[#This Row],[País]],Nombres[],2,FALSE),IFERROR(VLOOKUP(\"*\"&TablaPaíses[[#This Row],[Country]]&\"*\",Nombres[],2,FALSE),IFERROR(VLOOKUP(TablaPaíses[[#This Row],[Nombre corto]],Nombres[],2,FALSE),IF(TablaPaíses[[#This Row],[Nombre corto]]<>\"\",TablaPaíses[[#This Row],[Nombre corto]],TablaPaíses[[#This Row],[País]]&\"*\"))))","v":"Islas Feroe*"},"Faroe Islands",{"$f":"IFERROR(VLOOKUP(TablaPaíses[[#This Row],[Country]],Population[],2,FALSE),\"\")","v":49591}]
["Oceanía","Micronesia",null,{"$f":"IFERROR(VLOOKUP(TablaPaíses[[#This Row],[País]],Nombres[],2,FALSE),IFERROR(VLOOKUP(\"*\"&TablaPaíses[[#This Row],[Country]]&\"*\",Nombres[],2,FALSE),IFERROR(VLOOKUP(TablaPaíses[[#This Row],[Nombre corto]],Nombres[],2,FALSE),IF(TablaPaíses[[#This Row],[Nombre corto]]<>\"\",TablaPaíses[[#This Row],[Nombre corto]],TablaPaíses[[#This Row],[País]]&\"*\"))))","v":"Estados Federados de Micronesia"},"Federated States of Micronesia",{"$f":"IFERROR(VLOOKUP(TablaPaíses[[#This Row],[Country]],Population[],2,FALSE),\"\")","v":115142}]
["Oceanía","Polinesia Francesa",null,{"$f":"IFERROR(VLOOKUP(TablaPaíses[[#This Row],[País]],Nombres[],2,FALSE),IFERROR(VLOOKUP(\"*\"&TablaPaíses[[#This Row],[Country]]&\"*\",Nombres[],2,FALSE),IFERROR(VLOOKUP(TablaPaíses[[#This Row],[Nombre corto]],Nombres[],2,FALSE),IF(TablaPaíses[[#This Row],[Nombre corto]]<>\"\",TablaPaíses[[#This Row],[Nombre corto]],TablaPaíses[[#This Row],[País]]&\"*\"))))","v":"Polinesia Francesa*"},"French Polynesia",{"$f":"IFERROR(VLOOKUP(TablaPaíses[[#This Row],[Country]],Population[],2,FALSE),\"\")","v":291927}]
["Europa","Gibraltar",null,{"$f":"IFERROR(VLOOKUP(TablaPaíses[[#This Row],[País]],Nombres[],2,FALSE),IFERROR(VLOOKUP(\"*\"&TablaPaíses[[#This Row],[Country]]&\"*\",Nombres[],2,FALSE),IFERROR(VLOOKUP(TablaPaíses[[#This Row],[Nombre corto]],Nombres[],2,FALSE),IF(TablaPaíses[[#This Row],[Nombre corto]]<>\"\",TablaPaíses[[#This Row],[Nombre corto]],TablaPaíses[[#This Row],[País]]&\"*\"))))","v":"Gibraltar*"},"Gibraltar",{"$f":"IFERROR(VLOOKUP(TablaPaíses[[#This Row],[Country]],Population[],2,FALSE),\"\")","v":34057}]
["América del Sur","Granada",null,{"$f":"IFERROR(VLOOKUP(TablaPaíses[[#This Row],[País]],Nombres[],2,FALSE),IFERROR(VLOOKUP(\"*\"&TablaPaíses[[#This Row],[Country]]&\"*\",Nombres[],2,FALSE),IFERROR(VLOOKUP(TablaPaíses[[#This Row],[Nombre corto]],Nombres[],2,FALSE),IF(TablaPaíses[[#This Row],[Nombre corto]]<>\"\",TablaPaíses[[#This Row],[Nombre corto]],TablaPaíses[[#This Row],[País]]&\"*\"))))","v":"Granada"},"Grenada",{"$f":"IFERROR(VLOOKUP(TablaPaíses[[#This Row],[Country]],Population[],2,FALSE),\"\")","v":114052}]
["América del Norte","Guadalupe",null,{"$f":"IFERROR(VLOOKUP(TablaPaíses[[#This Row],[País]],Nombres[],2,FALSE),IFERROR(VLOOKUP(\"*\"&TablaPaíses[[#This Row],[Country]]&\"*\",Nombres[],2,FALSE),IFERROR(VLOOKUP(TablaPaíses[[#This Row],[Nombre corto]],Nombres[],2,FALSE),IF(TablaPaíses[[#This Row],[Nombre corto]]<>\"\",TablaPaíses[[#This Row],[Nombre corto]],TablaPaíses[[#This Row],[País]]&\"*\"))))","v":"Guadalupe*"},"Guadeloupe",{"$f":"IFERROR(VLOOKUP(TablaPaíses[[#This Row],[Country]],Population[],2,FALSE),\"\")","v":407965}]
["Oceanía","Guam",null,{"$f":"IFERROR(VLOOKUP(TablaPaíses[[#This Row],[País]],Nombres[],2,FALSE),IFERROR(VLOOKUP(\"*\"&TablaPaíses[[#This Row],[Country]]&\"*\",Nombres[],2,FALSE),IFERROR(VLOOKUP(TablaPaíses[[#This Row],[Nombre corto]],Nombres[],2,FALSE),IF(TablaPaíses[[#This Row],[Nombre corto]]<>\"\",TablaPaíses[[#This Row],[Nombre corto]],TablaPaíses[[#This Row],[País]]&\"*\"))))","v":"Guam*"},"Guam",{"$f":"IFERROR(VLOOKUP(TablaPaíses[[#This Row],[Country]],Population[],2,FALSE),\"\")","v":176500}]
["Asia","Hong Kong",null,{"$f":"IFERROR(VLOOKUP(TablaPaíses[[#This Row],[País]],Nombres[],2,FALSE),IFERROR(VLOOKUP(\"*\"&TablaPaíses[[#This Row],[Country]]&\"*\",Nombres[],2,FALSE),IFERROR(VLOOKUP(TablaPaíses[[#This Row],[Nombre corto]],Nombres[],2,FALSE),IF(TablaPaíses[[#This Row],[Nombre corto]]<>\"\",TablaPaíses[[#This Row],[Nombre corto]],TablaPaíses[[#This Row],[País]]&\"*\"))))","v":"Hong Kong*"},"Hong Kong",{"$f":"IFERROR(VLOOKUP(TablaPaíses[[#This Row],[Country]],Population[],2,FALSE),\"\")","v":7709164}]
["Europa","Isla de Man",null,{"$f":"IFERROR(VLOOKUP(TablaPaíses[[#This Row],[País]],Nombres[],2,FALSE),IFERROR(VLOOKUP(\"*\"&TablaPaíses[[#This Row],[Country]]&\"*\",Nombres[],2,FALSE),IFERROR(VLOOKUP(TablaPaíses[[#This Row],[Nombre corto]],Nombres[],2,FALSE),IF(TablaPaíses[[#This Row],[Nombre corto]]<>\"\",TablaPaíses[[#This Row],[Nombre corto]],TablaPaíses[[#This Row],[País]]&\"*\"))))","v":"Isla de Man*"},"Isle of Man",{"$f":"IFERROR(VLOOKUP(TablaPaíses[[#This Row],[Country]],Population[],2,FALSE),\"\")","v":87894}]
["Oceanía","Kiribati",null,{"$f":"IFERROR(VLOOKUP(TablaPaíses[[#This Row],[País]],Nombres[],2,FALSE),IFERROR(VLOOKUP(\"*\"&TablaPaíses[[#This Row],[Country]]&\"*\",Nombres[],2,FALSE),IFERROR(VLOOKUP(TablaPaíses[[#This Row],[Nombre corto]],Nombres[],2,FALSE),IF(TablaPaíses[[#This Row],[Nombre corto]]<>\"\",TablaPaíses[[#This Row],[Nombre corto]],TablaPaíses[[#This Row],[País]]&\"*\"))))","v":"República de Kiribati"},"Kiribati",{"$f":"IFERROR(VLOOKUP(TablaPaíses[[#This Row],[Country]],Population[],2,FALSE),\"\")","v":127147}]
["Europa","Kosovo",null,{"$f":"IFERROR(VLOOKUP(TablaPaíses[[#This Row],[País]],Nombres[],2,FALSE),IFERROR(VLOOKUP(\"*\"&TablaPaíses[[#This Row],[Country]]&\"*\",Nombres[],2,FALSE),IFERROR(VLOOKUP(TablaPaíses[[#This Row],[Nombre corto]],Nombres[],2,FALSE),IF(TablaPaíses[[#This Row],[Nombre corto]]<>\"\",TablaPaíses[[#This Row],[Nombre corto]],TablaPaíses[[#This Row],[País]]&\"*\"))))","v":"Kosovo*"},"Kosovo",{"$f":"IFERROR(VLOOKUP(TablaPaíses[[#This Row],[Country]],Population[],2,FALSE),\"\")","v":1770952}]
["Asia","Macao",null,{"$f":"IFERROR(VLOOKUP(TablaPaíses[[#This Row],[País]],Nombres[],2,FALSE),IFERROR(VLOOKUP(\"*\"&TablaPaíses[[#This Row],[Country]]&\"*\",Nombres[],2,FALSE),IFERROR(VLOOKUP(TablaPaíses[[#This Row],[Nombre corto]],Nombres[],2,FALSE),IF(TablaPaíses[[#This Row],[Nombre corto]]<>\"\",TablaPaíses[[#This Row],[Nombre corto]],TablaPaíses[[#This Row],[País]]&\"*\"))))","v":"Macao*"},"Macau",{"$f":"IFERROR(VLOOKUP(TablaPaíses[[#This Row],[Country]],Population[],2,FALSE),\"\")","v":693670}]
["Oceanía","Islas Marshall",null,{"$f":"IFERROR(VLOOKUP(TablaPaíses[[#This Row],[País]],Nombres[],2,FALSE),IFERROR(VLOOKUP(\"*\"&TablaPaíses[[#This Row],[Country]]&\"*\",Nombres[],2,FALSE),IFERROR(VLOOKUP(TablaPaíses[[#This Row],[Nombre corto]],Nombres[],2,FALSE),IF(TablaPaíses[[#This Row],[Nombre corto]]<>\"\",TablaPaíses[[#This Row],[Nombre corto]],TablaPaíses[[#This Row],[País]]&\"*\"))))","v":"República de las Islas Marshall"},"Marshall Islands",{"$f":"IFERROR(VLOOKUP(TablaPaíses[[#This Row],[Country]],Population[],2,FALSE),\"\")","v":63611}]
["América del Norte","Martinica",null,{"$f":"IFERROR(VLOOKUP(TablaPaíses[[#This Row],[País]],Nombres[],2,FALSE),IFERROR(VLOOKUP(\"*\"&TablaPaíses[[#This Row],[Country]]&\"*\",Nombres[],2,FALSE),IFERROR(VLOOKUP(TablaPaíses[[#This Row],[Nombre corto]],Nombres[],2,FALSE),IF(TablaPaíses[[#This Row],[Nombre corto]]<>\"\",TablaPaíses[[#This Row],[Nombre corto]],TablaPaíses[[#This Row],[País]]&\"*\"))))","v":"Martinica*"},"Martinique",{"$f":"IFERROR(VLOOKUP(TablaPaíses[[#This Row],[Country]],Population[],2,FALSE),\"\")","v":376698}]
["África","Mayotte",null,{"$f":"IFERROR(VLOOKUP(TablaPaíses[[#This Row],[País]],Nombres[],2,FALSE),IFERROR(VLOOKUP(\"*\"&TablaPaíses[[#This Row],[Country]]&\"*\",Nombres[],2,FALSE),IFERROR(VLOOKUP(TablaPaíses[[#This Row],[Nombre corto]],Nombres[],2,FALSE),IF(TablaPaíses[[#This Row],[Nombre corto]]<>\"\",TablaPaíses[[#This Row],[Nombre corto]],TablaPaíses[[#This Row],[País]]&\"*\"))))","v":"Mayotte*"},"Mayotte",{"$f":"IFERROR(VLOOKUP(TablaPaíses[[#This Row],[Country]],Population[],2,FALSE),\"\")","v":299975}]
["América del Norte","Montserrat",null,{"$f":"IFERROR(VLOOKUP(TablaPaíses[[#This Row],[País]],Nombres[],2,FALSE),IFERROR(VLOOKUP(\"*\"&TablaPaíses[[#This Row],[Country]]&\"*\",Nombres[],2,FALSE),IFERROR(VLOOKUP(TablaPaíses[[#This Row],[Nombre corto]],Nombres[],2,FALSE),IF(TablaPaíses[[#This Row],[Nombre corto]]<>\"\",TablaPaíses[[#This Row],[Nombre corto]],TablaPaíses[[#This Row],[País]]&\"*\"))))","v":"Montserrat*"},"Montserrat",{"$f":"IFERROR(VLOOKUP(TablaPaíses[[#This Row],[Country]],Population[],2,FALSE),\"\")","v":5082}]
["Oceanía","Nauru",null,{"$f":"IFERROR(VLOOKUP(TablaPaíses[[#This Row],[País]],Nombres[],2,FALSE),IFERROR(VLOOKUP(\"*\"&TablaPaíses[[#This Row],[Country]]&\"*\",Nombres[],2,FALSE),IFERROR(VLOOKUP(TablaPaíses[[#This Row],[Nombre corto]],Nombres[],2,FALSE),IF(TablaPaíses[[#This Row],[Nombre corto]]<>\"\",TablaPaíses[[#This Row],[Nombre corto]],TablaPaíses[[#This Row],[País]]&\"*\"))))","v":"República de Nauru"},"Nauru",{"$f":"IFERROR(VLOOKUP(TablaPaíses[[#This Row],[Country]],Population[],2,FALSE),\"\")","v":11058}]
["Oceanía","Nueva Caledonia",null,{"$f":"IFERROR(VLOOKUP(TablaPaíses[[#This Row],[País]],Nombres[],2,FALSE),IFERROR(VLOOKUP(\"*\"&TablaPaíses[[#This Row],[Country]]&\"*\",Nombres[],2,FALSE),IFERROR(VLOOKUP(TablaPaíses[[#This Row],[Nombre corto]],Nombres[],2,FALSE),IF(TablaPaíses[[#This Row],[Nombre corto]]<>\"\",TablaPaíses[[#This Row],[Nombre corto]],TablaPaíses[[#This Row],[País]]&\"*\"))))","v":"Nueva Caledonia*"},"New Caledonia",{"$f":"IFERROR(VLOOKUP(TablaPaíses[[#This Row],[Country]],Population[],2,FALSE),\"\")","v":298981}]
["Oceanía","Islas Marianas del Norte",null,{"$f":"IFERROR(VLOOKUP(TablaPaíses[[#This Row],[País]],Nombres[],2,FALSE),IFERROR(VLOOKUP(\"*\"&TablaPaíses[[#This Row],[Country]]&\"*\",Nombres[],2,FALSE),IFERROR(VLOOKUP(TablaPaíses[[#This Row],[Nombre corto]],Nombres[],2,FALSE),IF(TablaPaíses[[#This Row],[Nombre corto]]<>\"\",TablaPaíses[[#This Row],[Nombre corto]],TablaPaíses[[#This Row],[País]]&\"*\"))))","v":"Islas Marianas del Norte*"},"Northern Mariana Islands",{"$f":"IFERROR(VLOOKUP(TablaPaíses[[#This Row],[Country]],Population[],2,FALSE),\"\")","v":48948}]
["Oceanía","Palaos",null,{"$f":"IFERROR(VLOOKUP(TablaPaíses[[#This Row],[País]],Nombres[],2,FALSE),IFERROR(VLOOKUP(\"*\"&TablaPaíses[[#This Row],[Country]]&\"*\",Nombres[],2,FALSE),IFERROR(VLOOKUP(TablaPaíses[[#This Row],[Nombre corto]],Nombres[],2,FALSE),IF(TablaPaíses[[#This Row],[Nombre corto]]<>\"\",TablaPaíses[[#This Row],[Nombre corto]],TablaPaíses[[#This Row],[País]]&\"*\"))))","v":"República de Palaos"},"Palau",{"$f":"IFERROR(VLOOKUP(TablaPaíses[[#This Row],[Country]],Population[],2,FALSE),\"\")","v":18304}]
["América del Norte","Puerto Rico",null,{"$f":"IFERROR(VLOOKUP(TablaPaíses[[#This Row],[País]],Nombres[],2,FALSE),IFERROR(VLOOKUP(\"*\"&TablaPaíses[[#This Row],[Country]]&\"*\",Nombres[],2,FALSE),IFERROR(VLOOKUP(TablaPaíses[[#This Row],[Nombre corto]],Nombres[],2,FALSE),IF(TablaPaíses[[#This Row],[Nombre corto]]<>\"\",TablaPaíses[[#This Row],[Nombre corto]],TablaPaíses[[#This Row],[País]]&\"*\"))))","v":"Puerto Rico*"},"Puerto Rico",{"$f":"IFERROR(VLOOKUP(TablaPaíses[[#This Row],[Country]],Population[],2,FALSE),\"\")","v":2880829}]
["África","Reunión",null,{"$f":"IFERROR(VLOOKUP(TablaPaíses[[#This Row],[País]],Nombres[],2,FALSE),IFERROR(VLOOKUP(\"*\"&TablaPaíses[[#This Row],[Country]]&\"*\",Nombres[],2,FALSE),IFERROR(VLOOKUP(TablaPaíses[[#This Row],[Nombre corto]],Nombres[],2,FALSE),IF(TablaPaíses[[#This Row],[Nombre corto]]<>\"\",TablaPaíses[[#This Row],[Nombre corto]],TablaPaíses[[#This Row],[País]]&\"*\"))))","v":"Reunión*"},"Reunion",{"$f":"IFERROR(VLOOKUP(TablaPaíses[[#This Row],[Country]],Population[],2,FALSE),\"\")","v":917585}]
["África","Santa Elena",null,{"$f":"IFERROR(VLOOKUP(TablaPaíses[[#This Row],[País]],Nombres[],2,FALSE),IFERROR(VLOOKUP(\"*\"&TablaPaíses[[#This Row],[Country]]&\"*\",Nombres[],2,FALSE),IFERROR(VLOOKUP(TablaPaíses[[#This Row],[Nombre corto]],Nombres[],2,FALSE),IF(TablaPaíses[[#This Row],[Nombre corto]]<>\"\",TablaPaíses[[#This Row],[Nombre corto]],TablaPaíses[[#This Row],[País]]&\"*\"))))","v":"Santa Elena*"},"Saint Helena",{"$f":"IFERROR(VLOOKUP(TablaPaíses[[#This Row],[Country]],Population[],2,FALSE),\"\")","v":6156}]
["América del Norte","San Cristóbal y Nieves",null,{"$f":"IFERROR(VLOOKUP(TablaPaíses[[#This Row],[País]],Nombres[],2,FALSE),IFERROR(VLOOKUP(\"*\"&TablaPaíses[[#This Row],[Country]]&\"*\",Nombres[],2,FALSE),IFERROR(VLOOKUP(TablaPaíses[[#This Row],[Nombre corto]],Nombres[],2,FALSE),IF(TablaPaíses[[#This Row],[Nombre corto]]<>\"\",TablaPaíses[[#This Row],[Nombre corto]],TablaPaíses[[#This Row],[País]]&\"*\"))))","v":"San Cristóbal y Nieves"},"Saint Kitts and Nevis",{"$f":"IFERROR(VLOOKUP(TablaPaíses[[#This Row],[Country]],Population[],2,FALSE),\"\")","v":54731}]
["América del Norte","Santa Lucía",null,{"$f":"IFERROR(VLOOKUP(TablaPaíses[[#This Row],[País]],Nombres[],2,FALSE),IFERROR(VLOOKUP(\"*\"&TablaPaíses[[#This Row],[Country]]&\"*\",Nombres[],2,FALSE),IFERROR(VLOOKUP(TablaPaíses[[#This Row],[Nombre corto]],Nombres[],2,FALSE),IF(TablaPaíses[[#This Row],[Nombre corto]]<>\"\",TablaPaíses[[#This Row],[Nombre corto]],TablaPaíses[[#This Row],[País]]&\"*\"))))","v":"Santa Lucía"},"Saint Lucia",{"$f":"IFERROR(VLOOKUP(TablaPaíses[[#This Row],[Country]],Population[],2,FALSE),\"\")","v":189272}]
["América del Norte","San Pedro y Miquelón",null,{"$f":"IFERROR(VLOOKUP(TablaPaíses[[#This Row],[País]],Nombres[],2,FALSE),IFERROR(VLOOKUP(\"*\"&TablaPaíses[[#This Row],[Country]]&\"*\",Nombres[],2,FALSE),IFERROR(VLOOKUP(TablaPaíses[[#This Row],[Nombre corto]],Nombres[],2,FALSE),IF(TablaPaíses[[#This Row],[Nombre corto]]<>\"\",TablaPaíses[[#This Row],[Nombre corto]],TablaPaíses[[#This Row],[País]]&\"*\"))))","v":"San Pedro y Miquelón*"},"Saint Pierre and Miquelon",{"$f":"IFERROR(VLOOKUP(TablaPaíses[[#This Row],[Country]],Population[],2,FALSE),\"\")","v":5816}]
["América del Norte","San Vicente y las Granadinas",null,{"$f":"IFERROR(VLOOKUP(TablaPaíses[[#This Row],[País]],Nombres[],2,FALSE),IFERROR(VLOOKUP(\"*\"&TablaPaíses[[#This Row],[Country]]&\"*\",Nombres[],2,FALSE),IFERROR(VLOOKUP(TablaPaíses[[#This Row],[Nombre corto]],Nombres[],2,FALSE),IF(TablaPaíses[[#This Row],[Nombre corto]]<>\"\",TablaPaíses[[#This Row],[Nombre corto]],TablaPaíses[[#This Row],[País]]&\"*\"))))","v":"San Vicente y las Granadinas"},"Saint Vincent and the Grenadines",{"$f":"IFERROR(VLOOKUP(TablaPaíses[[#This Row],[Country]],Population[],2,FALSE),\"\")","v":110888}]
["Oceanía","Samoa",null,{"$f":"IFERROR(VLOOKUP(TablaPaíses[[#This Row],[País]],Nombres[],2,FALSE),IFERROR(VLOOKUP(\"*\"&TablaPaíses[[#This Row],[Country]]&\"*\",Nombres[],2,FALSE),IFERROR(VLOOKUP(TablaPaíses[[#This Row],[Nombre corto]],Nombres[],2,FALSE),IF(TablaPaíses[[#This Row],[Nombre corto]]<>\"\",TablaPaíses[[#This Row],[Nombre corto]],TablaPaíses[[#This Row],[País]]&\"*\"))))","v":"Estado Independiente de Samoa"},"Samoa",{"$f":"IFERROR(VLOOKUP(TablaPaíses[[#This Row],[Country]],Population[],2,FALSE),\"\")","v":203663}]
["África","Seychelles",null,{"$f":"IFERROR(VLOOKUP(TablaPaíses[[#This Row],[País]],Nombres[],2,FALSE),IFERROR(VLOOKUP(\"*\"&TablaPaíses[[#This Row],[Country]]&\"*\",Nombres[],2,FALSE),IFERROR(VLOOKUP(TablaPaíses[[#This Row],[Nombre corto]],Nombres[],2,FALSE),IF(TablaPaíses[[#This Row],[Nombre corto]]<>\"\",TablaPaíses[[#This Row],[Nombre corto]],TablaPaíses[[#This Row],[País]]&\"*\"))))","v":"República de Seychelles"},"Seychelles",{"$f":"IFERROR(VLOOKUP(TablaPaíses[[#This Row],[Country]],Population[],2,FALSE),\"\")","v":100800}]
["América del Norte","San Martín",null,{"$f":"IFERROR(VLOOKUP(TablaPaíses[[#This Row],[País]],Nombres[],2,FALSE),IFERROR(VLOOKUP(\"*\"&TablaPaíses[[#This Row],[Country]]&\"*\",Nombres[],2,FALSE),IFERROR(VLOOKUP(TablaPaíses[[#This Row],[Nombre corto]],Nombres[],2,FALSE),IF(TablaPaíses[[#This Row],[Nombre corto]]<>\"\",TablaPaíses[[#This Row],[Nombre corto]],TablaPaíses[[#This Row],[País]]&\"*\"))))","v":"San Martín*"},"Sint Maarten",{"$f":"IFERROR(VLOOKUP(TablaPaíses[[#This Row],[Country]],Population[],2,FALSE),\"\")","v":48040}]
["Asia","Taiwán","Taiwán (República de China)",{"$f":"IFERROR(VLOOKUP(TablaPaíses[[#This Row],[País]],Nombres[],2,FALSE),IFERROR(VLOOKUP(\"*\"&TablaPaíses[[#This Row],[Country]]&\"*\",Nombres[],2,FALSE),IFERROR(VLOOKUP(TablaPaíses[[#This Row],[Nombre corto]],Nombres[],2,FALSE),IF(TablaPaíses[[#This Row],[Nombre corto]]<>\"\",TablaPaíses[[#This Row],[Nombre corto]],TablaPaíses[[#This Row],[País]]&\"*\"))))","v":"Taiwán (República de China)"},"Taiwan (Republic of China)",{"$f":"IFERROR(VLOOKUP(TablaPaíses[[#This Row],[Country]],Population[],2,FALSE),\"\")","v":23985925}]
["Oceanía","Tonga",null,{"$f":"IFERROR(VLOOKUP(TablaPaíses[[#This Row],[País]],Nombres[],2,FALSE),IFERROR(VLOOKUP(\"*\"&TablaPaíses[[#This Row],[Country]]&\"*\",Nombres[],2,FALSE),IFERROR(VLOOKUP(TablaPaíses[[#This Row],[Nombre corto]],Nombres[],2,FALSE),IF(TablaPaíses[[#This Row],[Nombre corto]]<>\"\",TablaPaíses[[#This Row],[Nombre corto]],TablaPaíses[[#This Row],[País]]&\"*\"))))","v":"Reino de Tonga"},"Tonga",{"$f":"IFERROR(VLOOKUP(TablaPaíses[[#This Row],[Country]],Population[],2,FALSE),\"\")","v":106841}]
["América del Sur","Trinidad y Tobago",null,{"$f":"IFERROR(VLOOKUP(TablaPaíses[[#This Row],[País]],Nombres[],2,FALSE),IFERROR(VLOOKUP(\"*\"&TablaPaíses[[#This Row],[Country]]&\"*\",Nombres[],2,FALSE),IFERROR(VLOOKUP(TablaPaíses[[#This Row],[Nombre corto]],Nombres[],2,FALSE),IF(TablaPaíses[[#This Row],[Nombre corto]]<>\"\",TablaPaíses[[#This Row],[Nombre corto]],TablaPaíses[[#This Row],[País]]&\"*\"))))","v":"República de Trinidad y Tobago"},"Trinidad and Tobago",{"$f":"IFERROR(VLOOKUP(TablaPaíses[[#This Row],[Country]],Population[],2,FALSE),\"\")","v":1423371}]
["América del Norte","Islas Turcas y Caicos",null,{"$f":"IFERROR(VLOOKUP(TablaPaíses[[#This Row],[País]],Nombres[],2,FALSE),IFERROR(VLOOKUP(\"*\"&TablaPaíses[[#This Row],[Country]]&\"*\",Nombres[],2,FALSE),IFERROR(VLOOKUP(TablaPaíses[[#This Row],[Nombre corto]],Nombres[],2,FALSE),IF(TablaPaíses[[#This Row],[Nombre corto]]<>\"\",TablaPaíses[[#This Row],[Nombre corto]],TablaPaíses[[#This Row],[País]]&\"*\"))))","v":"Islas Turcas y Caicos*"},"Turks and Caicos Islands",{"$f":"IFERROR(VLOOKUP(TablaPaíses[[#This Row],[Country]],Population[],2,FALSE),\"\")","v":43945}]
["Oceanía","Tuvalu",null,{"$f":"IFERROR(VLOOKUP(TablaPaíses[[#This Row],[País]],Nombres[],2,FALSE),IFERROR(VLOOKUP(\"*\"&TablaPaíses[[#This Row],[Country]]&\"*\",Nombres[],2,FALSE),IFERROR(VLOOKUP(TablaPaíses[[#This Row],[Nombre corto]],Nombres[],2,FALSE),IF(TablaPaíses[[#This Row],[Nombre corto]]<>\"\",TablaPaíses[[#This Row],[Nombre corto]],TablaPaíses[[#This Row],[País]]&\"*\"))))","v":"Tuvalu"},"Tuvalu",{"$f":"IFERROR(VLOOKUP(TablaPaíses[[#This Row],[Country]],Population[],2,FALSE),\"\")","v":12047}]
["América del Norte","Islas Vírgenes de Estados Unidos","Islas Vírgenes de los Estados Unidos",{"$f":"IFERROR(VLOOKUP(TablaPaíses[[#This Row],[País]],Nombres[],2,FALSE),IFERROR(VLOOKUP(\"*\"&TablaPaíses[[#This Row],[Country]]&\"*\",Nombres[],2,FALSE),IFERROR(VLOOKUP(TablaPaíses[[#This Row],[Nombre corto]],Nombres[],2,FALSE),IF(TablaPaíses[[#This Row],[Nombre corto]]<>\"\",TablaPaíses[[#This Row],[Nombre corto]],TablaPaíses[[#This Row],[País]]&\"*\"))))","v":"Islas Vírgenes de los Estados Unidos"},"United States Virgin Islands",{"$f":"IFERROR(VLOOKUP(TablaPaíses[[#This Row],[Country]],Population[],2,FALSE),\"\")","v":104431}]
["Oceanía","Islas Wallis y Futuna",null,{"$f":"IFERROR(VLOOKUP(TablaPaíses[[#This Row],[País]],Nombres[],2,FALSE),IFERROR(VLOOKUP(\"*\"&TablaPaíses[[#This Row],[Country]]&\"*\",Nombres[],2,FALSE),IFERROR(VLOOKUP(TablaPaíses[[#This Row],[Nombre corto]],Nombres[],2,FALSE),IF(TablaPaíses[[#This Row],[Nombre corto]]<>\"\",TablaPaíses[[#This Row],[Nombre corto]],TablaPaíses[[#This Row],[País]]&\"*\"))))","v":"Islas Wallis y Futuna*"},"Wallis and Futuna Islands",{"$f":"IFERROR(VLOOKUP(TablaPaíses[[#This Row],[Country]],Population[],2,FALSE),\"\")","v":11498}]
["Total",{"$f":"SUBTOTAL(103,TablaPaíses[País])","v":231},null,null,{"$f":"SUBTOTAL(103,TablaPaíses[Country])","v":231},{"$f":"SUBTOTAL(109,TablaPaíses[Población])","v":8136936614}]

{"sheet":"Nombres","index":5,"n_rows":195,"n_cols":2,"rows_kept":195,"cut":false,"hidden":false,"merged":[]}
["País","Nombre oficial"]
["Afganistán","República Islámica de Afganistán"]
["Albania","República de Albania"]
["Alemania","República Federal de Alemania"]
["Andorra","Principado de Andorra"]
["Angola","República de Angola"]
["Antigua y Barbuda","Antigua y Barbuda"]
["Arabia Saudí","Reino de Arabia Saudí"]
["Argelia","República Argelina Democrática y Popular"]
["Argentina","República Argentina"]
["Armenia","República de Armenia"]
["Australia","Commonwealth de Australia"]
["Austria","República de Austria"]
["Azerbaiyán","República de Azerbaiyán"]
["Bahamas","Commonwealth de las Bahamas"]
["Bahrein","Reino de Bahrein"]
["Bangladesh","República Popular de Bangladesh"]
["Barbados","Barbados"]
["Bielorrusia","República de Belarús"]
["Bélgica","Reino de Bélgica"]
["Belice","Belice"]
["Benin","República de Benín"]
["Bhután","Reino de Bhután"]
["Bolivia","Estado Plurinacional de Bolivia"]
["Bosnia y Herzegovina","Bosnia y Herzegovina"]
["Botswana","República de Botswana"]
["Brasil","República Federativa de Brasil"]
["Brunei Darussalam","Brunei Darussalam"]
["Bulgaria","República de Bulgaria"]
["Burkina Faso","Burkina Faso"]
["Burundi","República de Burundi"]
["Cabo Verde","República de Cabo Verde"]
["Camboya","Reino de Camboya"]
["Camerún","República de Camerún"]
["Canadá","Canadá"]
["Chad","República de Chad"]
["República Checa","República Checa"]
["Chile","República de Chile"]
["China","República Popular China"]
["Chipre","República de Chipre"]
["Colombia","República de Colombia"]
["Comoras","Unión de las Comoras"]
["Congo","República del Congo"]
["República Democrática del Congo","República Democrática del Congo"]
["Corea del Norte","República Popular Democrática de Corea"]
["Corea del Sur","República de Corea"]
["Costa Rica","República de Costa Rica"]
["Costa de Marfil","República de Costa de Marfil"]
["Croacia","República de Croacia"]
["Cuba","República de Cuba"]
["Dinamarca","Reino de Dinamarca"]
["Djibouti","República de Djibouti"]
["Dominica","Commonwealth de Dominica"]
["Ecuador","República del Ecuador"]
["Egipto","República Árabe de Egipto"]
["El Salvador","República de El Salvador"]
["Emiratos Árabes Unidos","Emiratos Árabes Unidos"]
["Eritrea","Estado de Eritrea"]
["Eslovaquia","República Eslovaca"]
["Eslovenia","República de Eslovenia"]
["España","Reino de España"]
["Estados Unidos de América","Estados Unidos de América"]
["Estonia","República de Estonia"]
["Etiopía","República Democrática Federal de Etiopía"]
["Fiji","República de las Islas Fiji"]
["Filipinas","República de Filipinas"]
["Finlandia","República de Finlandia"]
["Francia","República Francesa"]
["Gabón","República Gabonesa"]
["Gambia","República de Gambia"]
["Georgia","Georgia"]
["Ghana","República de Ghana"]
["Granada","Granada"]
["Grecia","República Helénica"]
["Guatemala","República de Guatemala"]
["Guinea","República de Guinea"]
["Guinea-Bissau","República de Guinea-Bissau"]
["Guinea Ecuatorial","República de Guinea Ecuatorial"]
["Guyana","Cooperativa de Guyana"]
["Haití","República de Haití"]
["Honduras","República de Honduras"]
["Hungría","República de Hungría"]
["India","República de la India"]
["Indonesia","República de Indonesia"]
["Irán","República Islámica de Irán"]
["Iraq","República del Iraq"]
["Irlanda","Irlanda"]
["Islandia","República de Islandia"]
["Israel","Estado de Israel"]
["Italia","República Italiana"]
["Jamaica","Jamaica"]
["Japón","Japón"]
["Jordania","Reino Hachemita de Jordania"]
["Kazajstán","República de Kazajstán"]
["Kenia","República de Kenia"]
["Kirguistán","República Kirguisa"]
["Kiribati","República de Kiribati"]
["Kuwait","Estado de Kuwait"]
["Laos","República Democrática Popular de Lao"]
["Lesotho","Reino de Lesotho"]
["Letonia","República de Letonia"]
["Líbano","República Libanesa"]
["Liberia","República de Liberia"]
["Libia","Libia"]
["Liechtenstein","Principado de Liechtenstein"]
["Lituania","República de Lituania"]
["Luxemburgo","Gran Ducado de Luxemburgo"]
["Macedonia del Norte","República de Macedonia del Norte"]
["Madagascar","República de Madagascar"]
["Malasia","Malasia"]
["Malawi","República de Malawi"]
["Maldivas","República de Maldivas"]
["Mali","República de Malí"]
["Malta","República de Malta"]
["Marruecos","Reino de Marruecos"]
["Islas Marshall","República de las Islas Marshall"]
["Mauricio","República de Mauricio"]
["Mauritania","República Islámica de Mauritania"]
["México","Estados Unidos Mexicanos"]
["Micronesia","Estados Federados de Micronesia"]
["Moldavia","República de Moldavia"]
["Mónaco","Principado de Mónaco"]
["Mongolia","Mongolia"]
["Montenegro","Montenegro"]
["Mozambique","República de Mozambique"]
["Myanmar","Unión de Myanmar"]
["Namibia","República de Namibia"]
["Nauru","República de Nauru"]
["Nepal","República Democrática Federal de Nepal"]
["Nicaragua","República de Nicaragua"]
["Níger","República de Niger"]
["Nigeria","República Federal de Nigeria"]
["Noruega","Reino de Noruega"]
["Nueva Zelanda","Nueva Zelanda"]
["Omán","Sultanía de Omán"]
["Países Bajos","Reino de los Países Bajos"]
["Pakistán","República Islámica de Pakistán"]
["Palaos","República de Palaos"]
["Panamá","República de Panamá"]
["Papúa Nueva Guinea","Papúa Nueva Guinea"]
["Paraguay","República del Paraguay"]
["Perú","República del Perú"]
["Polonia","República de Polonia"]
["Portugal","República Portuguesa"]
["Qatar","Estado de Qatar"]
["Reino Unido de Gran Bretaña e Irlanda del Norte","Reino Unido de Gran Bretaña e Irlanda del Norte"]
["República Centroafricana","República Centroafricana"]
["República Dominicana","República Dominicana"]
["Rumania","Rumania"]
["Federación de Rusia","Federación de Rusia"]
["Rwanda","República de Rwanda"]
["San Cristóbal y Nieves","San Cristóbal y Nieves"]
["Islas Salomón","Islas Salomón"]
["Samoa","Estado Independiente de Samoa"]
["San Marino","República de San Marino"]
["Santa Lucía","Santa Lucía"]
["Vaticano","Estado de la Ciudad del Vaticano"]
["Santo Tomé y Príncipe","República Democrática de Santo Tomé y Príncipe"]
["San Vicente y las Granadinas","San Vicente y las Granadinas"]
["Senegal","República de Senegal"]
["Serbia","República de Serbia"]
["Seychelles","República de Seychelles"]
["Sierra Leona","República de Sierra Leona"]
["Singapur","República de Singapur"]
["Siria","República Árabe Siria"]
["Somalia","República Somalí "]
["Sri Lanka","República Socialista Democrática de Sri Lanka"]
["Sudáfrica","República de Sudáfrica"]
["Sudán","República de Sudán"]
["Sudán del Sur","República de Sudán del Sur"]
["Suecia","Reino de Suecia"]
["Suiza","Confederación Suiza"]
["Surinam","República de Surinam"]
["Swazilandia","Reino de Swazilandia"]
["Tailandia","Reino de Tailandia"]
["Tanzania","República Unida de Tanzania"]
["Tayikistán","República de Tayikistán"]
["Timor Oriental","República Democrática de Timor Oriental"]
["Togo","República Togolesa"]
["Tonga","Reino de Tonga"]
["Trinidad y Tobago","República de Trinidad y Tobago"]
["Túnez","República de Túnez"]
["Turkmenistán","Turkmenistán"]
["Turquía","República de Turquía"]
["Tuvalu","Tuvalu"]
["Ucrania","Ucrania"]
["Uganda","República de Uganda"]
["Uruguay","República Oriental del Uruguay"]
["Uzbekistán","República de Uzbekistán"]
["Vanuatu","República de Vanuatu"]
["Venezuela","República Bolivariana de Venezuela"]
["Vietnam","República Socialista de Vietnam"]
["Yemen","República de Yemen"]
["Zambia","República de Zambia"]
["Zimbabwe","República de Zimbabwe"]

{"sheet":"Population","index":6,"n_rows":231,"n_cols":2,"rows_kept":231,"cut":false,"hidden":false,"merged":[]}
["Country","Population"]
["Afghanistan",43214221]
["Albania",2875314]
["Algeria",46790907]
["American Samoa",57905]
["Andorra",78206]
["Angola",36693743]
["Anguilla",16242]
["Antigua and Barbuda",101471]
["Argentina",46833332]
["Armenia",3002557]
["Aruba",108404]
["Australia",26933672]
["Austria",9107427]
["Azerbaijan",10650274]
["Bahamas",413974]
["Bahrain",1788910]
["Bangladesh",171663088]
["Barbados",290905]
["Belarus",9453800]
["Belgium",11866927]
["Belize",429079]
["Benin",13264411]
["Bermuda",63848]
["Bhutan",811962]
["Bolivia",12314743]
["Bosnia and Herzegovina",3274227]
["Botswana",2513633]
["Brazil",219412680]
["British Virgin Islands",32232]
["Brunei Darussalam",460752]
["Bulgaria",6784151]
["Burkina Faso",23070385]
["Burundi",13304846]
["Cambodia",17677593]
["Cameroon",28866472]
["Canada",39114670]
["Cape Verde",579113]
["Cayman Islands",71349]
["Central African Republic",5161442]
["Chad",18371037]
["Channel Islands",176514]
["Chile",19837659]
["China",1465645573]
["Colombia",52573476]
["Comoros",944073]
["Congo",6011610]
["Cook Islands",15469]
["Costa Rica",5296326]
["Cote d'Ivoire",28569696]
["Croatia",4060783]
["Cuba",11393682]
["Curacao",167440]
["Cyprus",1254665]
["Czech Republic",10727922]
["Democratic People's Republic of Korea",26255633]
["Democratic Republic of the Congo",99557681]
["Denmark",5877449]
["Djibouti",1032559]
["Dominica",72498]
["Dominican Republic",11321684]
["Ecuador",18594072]
["Egypt",110255495]
["El Salvador",6543321]
["Equatorial Guinea",1545416]
["Eritrea",3829142]
["Estonia",1310932]
["Ethiopia",125130799]
["Faroe Islands",49591]
["Federated States of Micronesia",115142]
["Fiji",919016]
["Finland",5644803]
["France",66351820]
["French Guiana",327895]
["French Polynesia",291927]
["Gabon",2397815]
["Gambia",2696872]
["Georgia",3807546]
["Germany",83856583]
["Ghana",33710687]
["Gibraltar",34057]
["Greece",10285153]
["Greenland",56825]
["Grenada",114052]
["Guadeloupe",407965]
["Guam",176500]
["Guatemala",19225807]
["Guinea",14370773]
["Guinea-Bissau",2134121]
["Guyana",795764]
["Haiti",11951222]
["Honduras",10399095]
["Hong Kong",7709164]
["Hungary",9552136]
["Iceland",349555]
["India",1441803999]
["Indonesia",285874316]
["Iran",87646303]
["Iraq",45132545]
["Ireland",4969057]
["Isle of Man",87894]
["Israel",9157115]
["Italy",60673139]
["Jamaica",2998245]
["Japan",126086432]
["Jordan",11413809]
["Kazakhstan",19815946]
["Kenya",58877734]
["Kiribati",127147]
["Kosovo",1770952]
["Kuwait",5086649]
["Kyrgyzstan",6900555]
["Laos",7700414]
["Latvia",1810640]
["Lebanon",8565437]
["Lesotho",2235337]
["Liberia",5518648]
["Libya",6835260]
["Liechtenstein",39055]
["Lithuania",2571122]
["Luxembourg",675867]
["Macau",693670]
["Madagascar",30419341]
["Malawi",21230796]
["Malaysia",34096836]
["Maldives",573989]
["Mali",22365412]
["Malta",446463]
["Marshall Islands",63611]
["Martinique",376698]
["Mauritania",5048429]
["Mauritius",1290679]
["Mayotte",299975]
["Mexico",135226177]
["Monaco",38919]
["Mongolia",3477548]
["Montenegro",631036]
["Montserrat",5082]
["Morocco",38682907]
["Mozambique",34306564]
["Myanmar",55978446]
["Namibia",2748780]
["Nauru",11058]
["Nepal",30227160]
["Netherlands",17349846]
["New Caledonia",298981]
["New Zealand",4938228]
["Nicaragua",6889034]
["Niger",27668402]
["Nigeria",225538686]
["North Macedonia",2096019]
["Northern Mariana Islands",48948]
["Norway",5671282]
["Oman",6883637]
["Pakistan",237206546]
["Palau",18304]
["Palestinian Authority",5602506]
["Panama",4560019]
["Papua New Guinea",9621537]
["Paraguay",7464781]
["Peru",34456389]
["Philippines",115708944]
["Poland",37895094]
["Portugal",10034031]
["Puerto Rico",2880829]
["Qatar",3415975]
["Republic of Korea",52219858]
["Republic of Moldova",4026492]
["Reunion",917585]
["Romania",18713233]
["Russian Federation",146136559]
["Rwanda",14029645]
["Saint Helena",6156]
["Saint Kitts and Nevis",54731]
["Saint Lucia",189272]
["Saint Pierre and Miquelon",5816]
["Saint Vincent and the Grenadines",110888]
["Samoa",203663]
["San Marino",35299]
["Sao Tome and Principe",235913]
["Saudi Arabia",37761185]
["Senegal",18603776]
["Serbia",8597624]
["Seychelles",100800]
["Sierra Leone",8598720]
["Singapore",6286216]
["Sint Maarten",48040]
["Slovakia",5473438]
["Slovenia",2090635]
["Solomon Islands",734712]
["Somalia",17163207]
["South Africa",61455217]
["South Sudan",13003435]
["Spain",46370251]
["Sri Lanka",21789428]
["Sudan",47092782]
["Suriname",605587]
["Swaziland",1223682]
["Sweden",10396890]
["Switzerland",9019575]
["Syria",15813766]
["Taiwan (Republic of China)",23985925]
["Tajikistan",10280323]
["Tanzania",66448260]
["Thailand",70742091]
["Timor-Leste",1425512]
["Togo",9064498]
["Tonga",106841]
["Trinidad and Tobago",1423371]
["Tunisia",12279035]
["Turkey",89523086]
["Turkmenistan",6289149]
["Turks and Caicos Islands",43945]
["Tuvalu",12047]
["Uganda",51001127]
["Ukraine",43244699]
["United Arab Emirates",10575549]
["United Kingdom (UK)",69379700]
["United States Virgin Islands",104431]
["United States of America (USA)",339821113]
["Uruguay",3513347]
["Uzbekistan",35203261]
["Vanuatu",331187]
["Venezuela",30065468]
["Vietnam",101197557]
["Wallis and Futuna Islands",11498]
["Western Sahara",642843]
["Yemen",32559426]
["Zambia",20370558]
["Zimbabwe",16062121]
["Total",{"$f":"SUBTOTAL(109,Population[Population])","v":8136936614}]

{"sheet":"Datos","index":7,"n_rows":278,"n_cols":8,"rows_kept":278,"cut":false,"hidden":false,"merged":[]}
["País","Código ISO 3166-1","Superficie (km²)","Capital","Idiomas Oficiales","Monedas","Estatus","Idiomas"]
["Abjasia","ABH",8432,"Sujumi","Abjasio, Ruso","Apsar",null,{"$f":"SUBSTITUTE(SpaceIncaps(SUBSTITUTE(SUBSTITUTE(Datos[[#This Row],[Idiomas Oficiales]],\" \",\"\"),\",\",\"\")),\" \",\", \")","v":"Abjasio, Ruso"}]
["Acrotiri y Dhekelia",null,123,"Episkopí","Inglés","Euro","Bases Soberanas",{"$f":"SUBSTITUTE(SpaceIncaps(SUBSTITUTE(SUBSTITUTE(Datos[[#This Row],[Idiomas Oficiales]],\" \",\"\"),\",\",\"\")),\" \",\", \")","v":"Inglés"}]
["Afganistán","AFG",652230,"Kabul","Pastún Persa darí","Afgani afgano",null,{"$f":"SUBSTITUTE(SpaceIncaps(SUBSTITUTE(SUBSTITUTE(Datos[[#This Row],[Idiomas Oficiales]],\" \",\"\"),\",\",\"\")),\" \",\", \")","v":"Pastún, Persadarí"}]
["Albania","ALB",28748,"Tirana","Albanés","Lek albanés",null,{"$f":"SUBSTITUTE(SpaceIncaps(SUBSTITUTE(SUBSTITUTE(Datos[[#This Row],[Idiomas Oficiales]],\" \",\"\"),\",\",\"\")),\" \",\", \")","v":"Albanés"}]
["Alemania","DEU",357022,"Berlín","Alemán","Euro",null,{"$f":"SUBSTITUTE(SpaceIncaps(SUBSTITUTE(SUBSTITUTE(Datos[[#This Row],[Idiomas Oficiales]],\" \",\"\"),\",\",\"\")),\" \",\", \")","v":"Alemán"}]
["Andorra","AND",468,"Andorra la Vieja","Catalán Francés Español Portugués","Euro​",null,{"$f":"SUBSTITUTE(SpaceIncaps(SUBSTITUTE(SUBSTITUTE(Datos[[#This Row],[Idiomas Oficiales]],\" \",\"\"),\",\",\"\")),\" \",\", \")","v":"Catalán, Francés, Español, Portugués"}]
["Angola","AGO",1246702,"Luanda","Portugués KikongoChokweUmbundu","Kwanza",null,{"$f":"SUBSTITUTE(SpaceIncaps(SUBSTITUTE(SUBSTITUTE(Datos[[#This Row],[Idiomas Oficiales]],\" \",\"\"),\",\",\"\")),\" \",\", \")","v":"Portugués, Kikongo, Chokwe, Umbundu"}]
["Anguila",null,91,"The Valley","Inglés","Dólar del Caribe-Este","Territorio británico de ultramar",{"$f":"SUBSTITUTE(SpaceIncaps(SUBSTITUTE(SUBSTITUTE(Datos[[#This Row],[Idiomas Oficiales]],\" \",\"\"),\",\",\"\")),\" \",\", \")","v":"Inglés"}]
["Antigua y Barbuda","ATG",442,"Saint John","Inglés","Dólar del Caribe-Este",null,{"$f":"SUBSTITUTE(SpaceIncaps(SUBSTITUTE(SUBSTITUTE(Datos[[#This Row],[Idiomas Oficiales]],\" \",\"\"),\",\",\"\")),\" \",\", \")","v":"Inglés"}]
["Arabia Saudita","SAU",2149690,"Riad","Árabe","Riyal saudí",null,{"$f":"SUBSTITUTE(SpaceIncaps(SUBSTITUTE(SUBSTITUTE(Datos[[#This Row],[Idiomas Oficiales]],\" \",\"\"),\",\",\"\")),\" \",\", \")","v":"Árabe"}]
["Argelia","DZA",2381741,"Argel","Árabe FrancésEspañol","Dinar argelino",null,{"$f":"SUBSTITUTE(SpaceIncaps(SUBSTITUTE(SUBSTITUTE(Datos[[#This Row],[Idiomas Oficiales]],\" \",\"\"),\",\",\"\")),\" \",\", \")","v":"Árabe, Francés, Español"}]
["Argentina","ARG",2780400,"Buenos Aires","Español","Peso argentino",null,{"$f":"SUBSTITUTE(SpaceIncaps(SUBSTITUTE(SUBSTITUTE(Datos[[#This Row],[Idiomas Oficiales]],\" \",\"\"),\",\",\"\")),\" \",\", \")","v":"Español"}]
["Armenia","ARM",29800,"Ereván","Armenio","Dram armenio",null,{"$f":"SUBSTITUTE(SpaceIncaps(SUBSTITUTE(SUBSTITUTE(Datos[[#This Row],[Idiomas Oficiales]],\" \",\"\"),\",\",\"\")),\" \",\", \")","v":"Armenio"}]
["Arrecife Kingman",null,null,null,null,null,"Islas Ultramarinas de Estados Unidos",{"$f":"SUBSTITUTE(SpaceIncaps(SUBSTITUTE(SUBSTITUTE(Datos[[#This Row],[Idiomas Oficiales]],\" \",\"\"),\",\",\"\")),\" \",\", \")","v":""}]
["Artsaj","–",11458,"Stepanakert","Armenio","Dram de Nagorno Karabaj",null,{"$f":"SUBSTITUTE(SpaceIncaps(SUBSTITUTE(SUBSTITUTE(Datos[[#This Row],[Idiomas Oficiales]],\" \",\"\"),\",\",\"\")),\" \",\", \")","v":"Armenio"}]
["Aruba",null,180,"Oranjestad","Neerlandés","Florín arubeño","Nación constitutiva de los Países Bajos",{"$f":"SUBSTITUTE(SpaceIncaps(SUBSTITUTE(SUBSTITUTE(Datos[[#This Row],[Idiomas Oficiales]],\" \",\"\"),\",\",\"\")),\" \",\", \")","v":"Neerlandés"}]
["Atolón Johnston",null,null,null,null,null,"Islas Ultramarinas de Estados Unidos",{"$f":"SUBSTITUTE(SpaceIncaps(SUBSTITUTE(SUBSTITUTE(Datos[[#This Row],[Idiomas Oficiales]],\" \",\"\"),\",\",\"\")),\" \",\", \")","v":""}]
["Atolón Palmyra",null,null,null,null,null,"Islas Ultramarinas de Estados Unidos​",{"$f":"SUBSTITUTE(SpaceIncaps(SUBSTITUTE(SUBSTITUTE(Datos[[#This Row],[Idiomas Oficiales]],\" \",\"\"),\",\",\"\")),\" \",\", \")","v":""}]
["Australia","AUS",7741220,"Camberra","Inglés","Dólar australiano ($, AUD)",null,{"$f":"SUBSTITUTE(SpaceIncaps(SUBSTITUTE(SUBSTITUTE(Datos[[#This Row],[Idiomas Oficiales]],\" \",\"\"),\",\",\"\")),\" \",\", \")","v":"Inglés"}]
["Austria","AUT",83871,"Viena","Alemán","Euro",null,{"$f":"SUBSTITUTE(SpaceIncaps(SUBSTITUTE(SUBSTITUTE(Datos[[#This Row],[Idiomas Oficiales]],\" \",\"\"),\",\",\"\")),\" \",\", \")","v":"Alemán"}]
["Azerbaiyán","AZE",86600,"Bakú","Azerí","Manat azerbaiyano",null,{"$f":"SUBSTITUTE(SpaceIncaps(SUBSTITUTE(SUBSTITUTE(Datos[[#This Row],[Idiomas Oficiales]],\" \",\"\"),\",\",\"\")),\" \",\", \")","v":"Azerí"}]
["Azores",null,2332,"Ponta Delgada, Horta y Angra do Heroísmo","Portugués","Euro","Región autónoma de Portugal",{"$f":"SUBSTITUTE(SpaceIncaps(SUBSTITUTE(SUBSTITUTE(Datos[[#This Row],[Idiomas Oficiales]],\" \",\"\"),\",\",\"\")),\" \",\", \")","v":"Portugués"}]
["Azores",null,23333,"Ponta Delgada, Horta, Angra do Heroísmo","Portugués","Euro","Región autónoma de Portugal",{"$f":"SUBSTITUTE(SpaceIncaps(SUBSTITUTE(SUBSTITUTE(Datos[[#This Row],[Idiomas Oficiales]],\" \",\"\"),\",\",\"\")),\" \",\", \")","v":"Portugués"}]
["Bahamas","BHS",13880,"Nasáu","Inglés","Dólar bahameño",null,{"$f":"SUBSTITUTE(SpaceIncaps(SUBSTITUTE(SUBSTITUTE(Datos[[#This Row],[Idiomas Oficiales]],\" \",\"\"),\",\",\"\")),\" \",\", \")","v":"Inglés"}]
["Bangladés","BGD",148460,"Daca","Bengalí","Taka bangladesí",null,{"$f":"SUBSTITUTE(SpaceIncaps(SUBSTITUTE(SUBSTITUTE(Datos[[#This Row],[Idiomas Oficiales]],\" \",\"\"),\",\",\"\")),\" \",\", \")","v":"Bengalí"}]
["Barbados","BRB",430,"Bridgetown","Inglés","Dólar barbadense",null,{"$f":"SUBSTITUTE(SpaceIncaps(SUBSTITUTE(SUBSTITUTE(Datos[[#This Row],[Idiomas Oficiales]],\" \",\"\"),\",\",\"\")),\" \",\", \")","v":"Inglés"}]
["Baréin","BHR",760,"Manama","Árabe","Dinar bareiní",null,{"$f":"SUBSTITUTE(SpaceIncaps(SUBSTITUTE(SUBSTITUTE(Datos[[#This Row],[Idiomas Oficiales]],\" \",\"\"),\",\",\"\")),\" \",\", \")","v":"Árabe"}]
["Belice","BLZ",22966,"Belmopán","Inglés","Dólar beliceño",null,{"$f":"SUBSTITUTE(SpaceIncaps(SUBSTITUTE(SUBSTITUTE(Datos[[#This Row],[Idiomas Oficiales]],\" \",\"\"),\",\",\"\")),\" \",\", \")","v":"Inglés"}]
["Benín","BEN",112622,"Porto Novo","Francés","Franco CFA de África Occidental",null,{"$f":"SUBSTITUTE(SpaceIncaps(SUBSTITUTE(SUBSTITUTE(Datos[[#This Row],[Idiomas Oficiales]],\" \",\"\"),\",\",\"\")),\" \",\", \")","v":"Francés"}]
["Bermudas",null,54,"Hamilton","Inglés","Dólar bermudeño","Territorio británico de ultramar",{"$f":"SUBSTITUTE(SpaceIncaps(SUBSTITUTE(SUBSTITUTE(Datos[[#This Row],[Idiomas Oficiales]],\" \",\"\"),\",\",\"\")),\" \",\", \")","v":"Inglés"}]
["Bielorrusia","BLR",207600,"Minsk","Bielorruso, Ruso","Rublo bielorruso",null,{"$f":"SUBSTITUTE(SpaceIncaps(SUBSTITUTE(SUBSTITUTE(Datos[[#This Row],[Idiomas Oficiales]],\" \",\"\"),\",\",\"\")),\" \",\", \")","v":"Bielorruso, Ruso"}]
["Birmania","MMR",676578,"Naipyidó","Birmano","Kyat birmano",null,{"$f":"SUBSTITUTE(SpaceIncaps(SUBSTITUTE(SUBSTITUTE(Datos[[#This Row],[Idiomas Oficiales]],\" \",\"\"),\",\",\"\")),\" \",\", \")","v":"Birmano"}]
["Bolivia","BOL",1098581,"Sucre","Español","Boliviano",null,{"$f":"SUBSTITUTE(SpaceIncaps(SUBSTITUTE(SUBSTITUTE(Datos[[#This Row],[Idiomas Oficiales]],\" \",\"\"),\",\",\"\")),\" \",\", \")","v":"Español"}]
["Bonaire",null,288,"Kralendijk","Neerlandés Papiamento","Dólar estadounidense","Municipio Especial de los Países Bajos",{"$f":"SUBSTITUTE(SpaceIncaps(SUBSTITUTE(SUBSTITUTE(Datos[[#This Row],[Idiomas Oficiales]],\" \",\"\"),\",\",\"\")),\" \",\", \")","v":"Neerlandés, Papiamento"}]
["Bosnia y Herzegovina","BIH",51197,"Sarajevo","Bosnio, Croata, Serbio","Marco bosnio­herze­govino",null,{"$f":"SUBSTITUTE(SpaceIncaps(SUBSTITUTE(SUBSTITUTE(Datos[[#This Row],[Idiomas Oficiales]],\" \",\"\"),\",\",\"\")),\" \",\", \")","v":"Bosnio, Croata, Serbio"}]
["Botsuana","BWA",581730,"Gaborone","Inglés Setsuana","Pula",null,{"$f":"SUBSTITUTE(SpaceIncaps(SUBSTITUTE(SUBSTITUTE(Datos[[#This Row],[Idiomas Oficiales]],\" \",\"\"),\",\",\"\")),\" \",\", \")","v":"Inglés, Setsuana"}]
["Brasil","BRA",8514877,"Brasilia","Portugués","Real",null,{"$f":"SUBSTITUTE(SpaceIncaps(SUBSTITUTE(SUBSTITUTE(Datos[[#This Row],[Idiomas Oficiales]],\" \",\"\"),\",\",\"\")),\" \",\", \")","v":"Portugués"}]
["Brunéi","BRN",5765,"Bandar Seri Begawan","Malayo","Dólar de Brunéi",null,{"$f":"SUBSTITUTE(SpaceIncaps(SUBSTITUTE(SUBSTITUTE(Datos[[#This Row],[Idiomas Oficiales]],\" \",\"\"),\",\",\"\")),\" \",\", \")","v":"Malayo"}]
["Bulgaria","BGR",110879,"Sofía","Búlgaro","Lev",null,{"$f":"SUBSTITUTE(SpaceIncaps(SUBSTITUTE(SUBSTITUTE(Datos[[#This Row],[Idiomas Oficiales]],\" \",\"\"),\",\",\"\")),\" \",\", \")","v":"Búlgaro"}]
["Burkina Faso","BFA",274200,"Uagadugú","Francés MossiYuláBambara","Franco CFA de África Occidental",null,{"$f":"SUBSTITUTE(SpaceIncaps(SUBSTITUTE(SUBSTITUTE(Datos[[#This Row],[Idiomas Oficiales]],\" \",\"\"),\",\",\"\")),\" \",\", \")","v":"Francés, Mossi, Yulá, Bambara"}]
["Burundi","BDI",27830,"Guitega","Kirundi Francés","Franco burundés",null,{"$f":"SUBSTITUTE(SpaceIncaps(SUBSTITUTE(SUBSTITUTE(Datos[[#This Row],[Idiomas Oficiales]],\" \",\"\"),\",\",\"\")),\" \",\", \")","v":"Kirundi, Francés"}]
["Bután","BTN",38394,"Timbu","Dzongkha","Ngultrum butanés",null,{"$f":"SUBSTITUTE(SpaceIncaps(SUBSTITUTE(SUBSTITUTE(Datos[[#This Row],[Idiomas Oficiales]],\" \",\"\"),\",\",\"\")),\" \",\", \")","v":"Dzongkha"}]
["Bélgica","BEL",30528,"Bruselas","Neerlandés, Francés, Alemán","Euro",null,{"$f":"SUBSTITUTE(SpaceIncaps(SUBSTITUTE(SUBSTITUTE(Datos[[#This Row],[Idiomas Oficiales]],\" \",\"\"),\",\",\"\")),\" \",\", \")","v":"Neerlandés, Francés, Alemán"}]
["Cabo Verde","CPV",4033,"Praia","Portugués","Escudo caboverdiano",null,{"$f":"SUBSTITUTE(SpaceIncaps(SUBSTITUTE(SUBSTITUTE(Datos[[#This Row],[Idiomas Oficiales]],\" \",\"\"),\",\",\"\")),\" \",\", \")","v":"Portugués"}]
["Camboya","KHM",181035,"Nom Pen","Camboyano","Riel camboyano",null,{"$f":"SUBSTITUTE(SpaceIncaps(SUBSTITUTE(SUBSTITUTE(Datos[[#This Row],[Idiomas Oficiales]],\" \",\"\"),\",\",\"\")),\" \",\", \")","v":"Camboyano"}]
["Camerún","CMR",475440,"Yaundé","Francés Inglés","Franco CFA de África Central",null,{"$f":"SUBSTITUTE(SpaceIncaps(SUBSTITUTE(SUBSTITUTE(Datos[[#This Row],[Idiomas Oficiales]],\" \",\"\"),\",\",\"\")),\" \",\", \")","v":"Francés, Inglés"}]
["Canadá","CAN",9984670,"Ottawa","Inglés Francés","Dólar canadiense",null,{"$f":"SUBSTITUTE(SpaceIncaps(SUBSTITUTE(SUBSTITUTE(Datos[[#This Row],[Idiomas Oficiales]],\" \",\"\"),\",\",\"\")),\" \",\", \")","v":"Inglés, Francés"}]
["Canarias",null,7447,"Las Palmas y Santa Cruz","Español","Euro","Comunidad autónoma de España",{"$f":"SUBSTITUTE(SpaceIncaps(SUBSTITUTE(SUBSTITUTE(Datos[[#This Row],[Idiomas Oficiales]],\" \",\"\"),\",\",\"\")),\" \",\", \")","v":"Español"}]
["Catar","QAT",11586,"Doha","Árabe Inglés","Riyal catarí",null,{"$f":"SUBSTITUTE(SpaceIncaps(SUBSTITUTE(SUBSTITUTE(Datos[[#This Row],[Idiomas Oficiales]],\" \",\"\"),\",\",\"\")),\" \",\", \")","v":"Árabe, Inglés"}]
["Ceuta",null,19,"Ceuta","Español","Euro","Ciudad autónoma de España",{"$f":"SUBSTITUTE(SpaceIncaps(SUBSTITUTE(SUBSTITUTE(Datos[[#This Row],[Idiomas Oficiales]],\" \",\"\"),\",\",\"\")),\" \",\", \")","v":"Español"}]
["Chad","TCD",1284000,"Yamena","Francés Árabe","Franco CFA de África Central",null,{"$f":"SUBSTITUTE(SpaceIncaps(SUBSTITUTE(SUBSTITUTE(Datos[[#This Row],[Idiomas Oficiales]],\" \",\"\"),\",\",\"\")),\" \",\", \")","v":"Francés, Árabe"}]
["Chile","CHL",756102,"Santiago de Chile","Español","Peso chileno",null,{"$f":"SUBSTITUTE(SpaceIncaps(SUBSTITUTE(SUBSTITUTE(Datos[[#This Row],[Idiomas Oficiales]],\" \",\"\"),\",\",\"\")),\" \",\", \")","v":"Español"}]
["China","CHN",9596960,"Pekín","Chino, Portugués, Inglés","Renminbi chino",null,{"$f":"SUBSTITUTE(SpaceIncaps(SUBSTITUTE(SUBSTITUTE(Datos[[#This Row],[Idiomas Oficiales]],\" \",\"\"),\",\",\"\")),\" \",\", \")","v":"Chino, Portugués, Inglés"}]
["Chipre","CYP",9251,"Nicosia","Griego, Turco","Euro",null,{"$f":"SUBSTITUTE(SpaceIncaps(SUBSTITUTE(SUBSTITUTE(Datos[[#This Row],[Idiomas Oficiales]],\" \",\"\"),\",\",\"\")),\" \",\", \")","v":"Griego, Turco"}]
["Chipre del Norte","–",3355,"Nicosia Norte","Turco","Lira turca",null,{"$f":"SUBSTITUTE(SpaceIncaps(SUBSTITUTE(SUBSTITUTE(Datos[[#This Row],[Idiomas Oficiales]],\" \",\"\"),\",\",\"\")),\" \",\", \")","v":"Turco"}]
["Ciudad del Vaticano","VAT",0.44,"Ciudad del Vaticano","Italiano Latino Español","Euro​",null,{"$f":"SUBSTITUTE(SpaceIncaps(SUBSTITUTE(SUBSTITUTE(Datos[[#This Row],[Idiomas Oficiales]],\" \",\"\"),\",\",\"\")),\" \",\", \")","v":"Italiano, Latino, Español"}]
["Colombia","COL",1141748,"Bogotá","Español","Peso colombiano",null,{"$f":"SUBSTITUTE(SpaceIncaps(SUBSTITUTE(SUBSTITUTE(Datos[[#This Row],[Idiomas Oficiales]],\" \",\"\"),\",\",\"\")),\" \",\", \")","v":"Español"}]
["Comoras","COM",2235,"Moroni","Árabe FrancésSuajiliComorense","Franco comorano",null,{"$f":"SUBSTITUTE(SpaceIncaps(SUBSTITUTE(SUBSTITUTE(Datos[[#This Row],[Idiomas Oficiales]],\" \",\"\"),\",\",\"\")),\" \",\", \")","v":"Árabe, Francés, Suajili, Comorense"}]
["Corea del Norte","PRK",120538,"Pionyang","Coreano","Won norcoreano",null,{"$f":"SUBSTITUTE(SpaceIncaps(SUBSTITUTE(SUBSTITUTE(Datos[[#This Row],[Idiomas Oficiales]],\" \",\"\"),\",\",\"\")),\" \",\", \")","v":"Coreano"}]
["Corea del Sur","KOR",99720,"Seúl","Coreano","Won surcoreano",null,{"$f":"SUBSTITUTE(SpaceIncaps(SUBSTITUTE(SUBSTITUTE(Datos[[#This Row],[Idiomas Oficiales]],\" \",\"\"),\",\",\"\")),\" \",\", \")","v":"Coreano"}]
["Costa Rica","CRI",51100,"San José","Español","Colón",null,{"$f":"SUBSTITUTE(SpaceIncaps(SUBSTITUTE(SUBSTITUTE(Datos[[#This Row],[Idiomas Oficiales]],\" \",\"\"),\",\",\"\")),\" \",\", \")","v":"Español"}]
["Costa de Marfil","CIV",322463,"Yamusukro","Francés","Franco CFA de África Occidental",null,{"$f":"SUBSTITUTE(SpaceIncaps(SUBSTITUTE(SUBSTITUTE(Datos[[#This Row],[Idiomas Oficiales]],\" \",\"\"),\",\",\"\")),\" \",\", \")","v":"Francés"}]
["Croacia","HRV",56594,"Zagreb","Croata","Euro",null,{"$f":"SUBSTITUTE(SpaceIncaps(SUBSTITUTE(SUBSTITUTE(Datos[[#This Row],[Idiomas Oficiales]],\" \",\"\"),\",\",\"\")),\" \",\", \")","v":"Croata"}]
["Cuba","CUB",110860,"La Habana","Español","Peso cubano",null,{"$f":"SUBSTITUTE(SpaceIncaps(SUBSTITUTE(SUBSTITUTE(Datos[[#This Row],[Idiomas Oficiales]],\" \",\"\"),\",\",\"\")),\" \",\", \")","v":"Español"}]
["Curazao",null,444,"Willemstad","Neerlandés Papiamento","Florín antillano neerlandés","Nación constitutiva de los Países Bajos",{"$f":"SUBSTITUTE(SpaceIncaps(SUBSTITUTE(SUBSTITUTE(Datos[[#This Row],[Idiomas Oficiales]],\" \",\"\"),\",\",\"\")),\" \",\", \")","v":"Neerlandés, Papiamento"}]
["Dinamarca","DNK",43094,"Copenhague","Danés","Corona danesa",null,{"$f":"SUBSTITUTE(SpaceIncaps(SUBSTITUTE(SUBSTITUTE(Datos[[#This Row],[Idiomas Oficiales]],\" \",\"\"),\",\",\"\")),\" \",\", \")","v":"Danés"}]
["Dominica","DMA",751,"Roseau","Inglés","Dólar del Caribe Oriental",null,{"$f":"SUBSTITUTE(SpaceIncaps(SUBSTITUTE(SUBSTITUTE(Datos[[#This Row],[Idiomas Oficiales]],\" \",\"\"),\",\",\"\")),\" \",\", \")","v":"Inglés"}]
["Ecuador","ECU",256370,"Quito","Español","Centavos de dólar de Ecuador",null,{"$f":"SUBSTITUTE(SpaceIncaps(SUBSTITUTE(SUBSTITUTE(Datos[[#This Row],[Idiomas Oficiales]],\" \",\"\"),\",\",\"\")),\" \",\", \")","v":"Español"}]
["Egipto","EGY",1001450,"El Cairo","Árabe Inglés","Libra egipcia",null,{"$f":"SUBSTITUTE(SpaceIncaps(SUBSTITUTE(SUBSTITUTE(Datos[[#This Row],[Idiomas Oficiales]],\" \",\"\"),\",\",\"\")),\" \",\", \")","v":"Árabe, Inglés"}]
["El Salvador","SLV",21041,"San Salvador","Español","Dólar estadounidense",null,{"$f":"SUBSTITUTE(SpaceIncaps(SUBSTITUTE(SUBSTITUTE(Datos[[#This Row],[Idiomas Oficiales]],\" \",\"\"),\",\",\"\")),\" \",\", \")","v":"Español"}]
["Emiratos Árabes Unidos","ARE",83600,"Abu Dabi","Árabe, Inglés","Dírham de los Emiratos Árabes Unidos",null,{"$f":"SUBSTITUTE(SpaceIncaps(SUBSTITUTE(SUBSTITUTE(Datos[[#This Row],[Idiomas Oficiales]],\" \",\"\"),\",\",\"\")),\" \",\", \")","v":"Árabe, Inglés"}]
["Eritrea","ERI",117600,"Asmara","Tigriña Árabe","Nakfa",null,{"$f":"SUBSTITUTE(SpaceIncaps(SUBSTITUTE(SUBSTITUTE(Datos[[#This Row],[Idiomas Oficiales]],\" \",\"\"),\",\",\"\")),\" \",\", \")","v":"Tigriña, Árabe"}]
["Eslovaquia","SVK",49035,"Bratislava","Eslovaco","Euro",null,{"$f":"SUBSTITUTE(SpaceIncaps(SUBSTITUTE(SUBSTITUTE(Datos[[#This Row],[Idiomas Oficiales]],\" \",\"\"),\",\",\"\")),\" \",\", \")","v":"Eslovaco"}]
["Eslovenia","SVN",20273,"Liubliana","Esloveno","Euro",null,{"$f":"SUBSTITUTE(SpaceIncaps(SUBSTITUTE(SUBSTITUTE(Datos[[#This Row],[Idiomas Oficiales]],\" \",\"\"),\",\",\"\")),\" \",\", \")","v":"Esloveno"}]
["España","ESP",505370,"Madrid","Español, Catalán, Valenciano, Gallego, Vasco","Euro",null,{"$f":"SUBSTITUTE(SpaceIncaps(SUBSTITUTE(SUBSTITUTE(Datos[[#This Row],[Idiomas Oficiales]],\" \",\"\"),\",\",\"\")),\" \",\", \")","v":"Español, Catalán, Valenciano, Gallego, Vasco"}]
["Estados Unidos","USA",9371174,"Washington D. C.","Inglés Español","Dólar estadounidense",null,{"$f":"SUBSTITUTE(SpaceIncaps(SUBSTITUTE(SUBSTITUTE(Datos[[#This Row],[Idiomas Oficiales]],\" \",\"\"),\",\",\"\")),\" \",\", \")","v":"Inglés, Español"}]
["Estonia","EST",45228,"Tallin","Estonio","Euro",null,{"$f":"SUBSTITUTE(SpaceIncaps(SUBSTITUTE(SUBSTITUTE(Datos[[#This Row],[Idiomas Oficiales]],\" \",\"\"),\",\",\"\")),\" \",\", \")","v":"Estonio"}]
["Etiopía","ETH",1104300,"Adís Abeba","Amárico","Birr etíope",null,{"$f":"SUBSTITUTE(SpaceIncaps(SUBSTITUTE(SUBSTITUTE(Datos[[#This Row],[Idiomas Oficiales]],\" \",\"\"),\",\",\"\")),\" \",\", \")","v":"Amárico"}]
["Filipinas","PHL",300000,"Manila","Filipino Inglés","Peso filipino",null,{"$f":"SUBSTITUTE(SpaceIncaps(SUBSTITUTE(SUBSTITUTE(Datos[[#This Row],[Idiomas Oficiales]],\" \",\"\"),\",\",\"\")),\" \",\", \")","v":"Filipino, Inglés"}]
["Finlandia","FIN",338145,"Helsinki","Finés, Sueco","Euro",null,{"$f":"SUBSTITUTE(SpaceIncaps(SUBSTITUTE(SUBSTITUTE(Datos[[#This Row],[Idiomas Oficiales]],\" \",\"\"),\",\",\"\")),\" \",\", \")","v":"Finés, Sueco"}]
["Fiyi","FJI",18274,"Suva","Inglés FiyianoHindi Fiyiano","Dólar fiyiano ($, FJD)",null,{"$f":"SUBSTITUTE(SpaceIncaps(SUBSTITUTE(SUBSTITUTE(Datos[[#This Row],[Idiomas Oficiales]],\" \",\"\"),\",\",\"\")),\" \",\", \")","v":"Inglés, Fiyiano, Hindi, Fiyiano"}]
["Francia","FRA",643801,"París","Francés","Euro",null,{"$f":"SUBSTITUTE(SpaceIncaps(SUBSTITUTE(SUBSTITUTE(Datos[[#This Row],[Idiomas Oficiales]],\" \",\"\"),\",\",\"\")),\" \",\", \")","v":"Francés"}]
["Gabón","GAB",267667,"Libreville","Francés","Franco CFA de África Central",null,{"$f":"SUBSTITUTE(SpaceIncaps(SUBSTITUTE(SUBSTITUTE(Datos[[#This Row],[Idiomas Oficiales]],\" \",\"\"),\",\",\"\")),\" \",\", \")","v":"Francés"}]
["Gambia","GMB",11300,"Banjul","Inglés","Dalasi",null,{"$f":"SUBSTITUTE(SpaceIncaps(SUBSTITUTE(SUBSTITUTE(Datos[[#This Row],[Idiomas Oficiales]],\" \",\"\"),\",\",\"\")),\" \",\", \")","v":"Inglés"}]
["Georgia","GEO",69700,"Tiflis","Georgiano","Lari georgiano",null,{"$f":"SUBSTITUTE(SpaceIncaps(SUBSTITUTE(SUBSTITUTE(Datos[[#This Row],[Idiomas Oficiales]],\" \",\"\"),\",\",\"\")),\" \",\", \")","v":"Georgiano"}]
["Ghana","GHA",238533,"Acra","Inglés","Cedi",null,{"$f":"SUBSTITUTE(SpaceIncaps(SUBSTITUTE(SUBSTITUTE(Datos[[#This Row],[Idiomas Oficiales]],\" \",\"\"),\",\",\"\")),\" \",\", \")","v":"Inglés"}]
["Gibraltar",null,7,"Gibraltar","Inglés","Libra gibraltareña","Territorio británico de ultramar",{"$f":"SUBSTITUTE(SpaceIncaps(SUBSTITUTE(SUBSTITUTE(Datos[[#This Row],[Idiomas Oficiales]],\" \",\"\"),\",\",\"\")),\" \",\", \")","v":"Inglés"}]
["Granada","GRD",344,"Saint George","Inglés","Dólar del Caribe-Este",null,{"$f":"SUBSTITUTE(SpaceIncaps(SUBSTITUTE(SUBSTITUTE(Datos[[#This Row],[Idiomas Oficiales]],\" \",\"\"),\",\",\"\")),\" \",\", \")","v":"Inglés"}]
["Grecia","GRC",131957,"Atenas","Griego","Euro",null,{"$f":"SUBSTITUTE(SpaceIncaps(SUBSTITUTE(SUBSTITUTE(Datos[[#This Row],[Idiomas Oficiales]],\" \",\"\"),\",\",\"\")),\" \",\", \")","v":"Griego"}]
["Groenlandia",null,2166086,"Nuuk","Groenlandés","Corona danesa","Región autónoma de Dinamarca",{"$f":"SUBSTITUTE(SpaceIncaps(SUBSTITUTE(SUBSTITUTE(Datos[[#This Row],[Idiomas Oficiales]],\" \",\"\"),\",\",\"\")),\" \",\", \")","v":"Groenlandés"}]
["Guadalupe",null,1706,"Basse-Terre","Francés","Euro","Departamento de ultramar de Francia",{"$f":"SUBSTITUTE(SpaceIncaps(SUBSTITUTE(SUBSTITUTE(Datos[[#This Row],[Idiomas Oficiales]],\" \",\"\"),\",\",\"\")),\" \",\", \")","v":"Francés"}]
["Guam",null,544,"Agaña","Inglés Chamorro","Dólar estadounidense ($, USD)","Territorio no incorporado de los Estados Unidos",{"$f":"SUBSTITUTE(SpaceIncaps(SUBSTITUTE(SUBSTITUTE(Datos[[#This Row],[Idiomas Oficiales]],\" \",\"\"),\",\",\"\")),\" \",\", \")","v":"Inglés, Chamorro"}]
["Guatemala","GTM",108889,"Ciudad de Guatemala","Español","Quetzal (moneda)",null,{"$f":"SUBSTITUTE(SpaceIncaps(SUBSTITUTE(SUBSTITUTE(Datos[[#This Row],[Idiomas Oficiales]],\" \",\"\"),\",\",\"\")),\" \",\", \")","v":"Español"}]
["Guayana Francesa",null,91000,"Cayena","Francés","Euro","Departamento de ultramar de Francia",{"$f":"SUBSTITUTE(SpaceIncaps(SUBSTITUTE(SUBSTITUTE(Datos[[#This Row],[Idiomas Oficiales]],\" \",\"\"),\",\",\"\")),\" \",\", \")","v":"Francés"}]
["Guernsey",null,78,"Saint Peter Port","Inglés","Libra de Guernsey","Dependencia de la Corona británica",{"$f":"SUBSTITUTE(SpaceIncaps(SUBSTITUTE(SUBSTITUTE(Datos[[#This Row],[Idiomas Oficiales]],\" \",\"\"),\",\",\"\")),\" \",\", \")","v":"Inglés"}]
["Guinea","GIN",245857,"Conakri","Francés","Franco guineano",null,{"$f":"SUBSTITUTE(SpaceIncaps(SUBSTITUTE(SUBSTITUTE(Datos[[#This Row],[Idiomas Oficiales]],\" \",\"\"),\",\",\"\")),\" \",\", \")","v":"Francés"}]
["Guinea Ecuatorial","GNQ",28051,"Malabo","Español FrancésPortugués","Franco CFA de África Central",null,{"$f":"SUBSTITUTE(SpaceIncaps(SUBSTITUTE(SUBSTITUTE(Datos[[#This Row],[Idiomas Oficiales]],\" \",\"\"),\",\",\"\")),\" \",\", \")","v":"Español, Francés, Portugués"}]
["Guinea-Bisáu","GNB",36125,"Bisáu","Portugués","Franco CFA de África Occidental",null,{"$f":"SUBSTITUTE(SpaceIncaps(SUBSTITUTE(SUBSTITUTE(Datos[[#This Row],[Idiomas Oficiales]],\" \",\"\"),\",\",\"\")),\" \",\", \")","v":"Portugués"}]
["Guyana","GUY",214969,"Georgetown","Inglés","Dólar guyanés",null,{"$f":"SUBSTITUTE(SpaceIncaps(SUBSTITUTE(SUBSTITUTE(Datos[[#This Row],[Idiomas Oficiales]],\" \",\"\"),\",\",\"\")),\" \",\", \")","v":"Inglés"}]
["Haití","HTI",27750,"Puerto Príncipe","Francés Criollo haitiano","Gourde",null,{"$f":"SUBSTITUTE(SpaceIncaps(SUBSTITUTE(SUBSTITUTE(Datos[[#This Row],[Idiomas Oficiales]],\" \",\"\"),\",\",\"\")),\" \",\", \")","v":"Francés, Criollohaitiano"}]
["Hawái",null,28311,"Honolulu","Inglés Hawaiano","Dólar estadounidense","Estado de los Estados Unidos",{"$f":"SUBSTITUTE(SpaceIncaps(SUBSTITUTE(SUBSTITUTE(Datos[[#This Row],[Idiomas Oficiales]],\" \",\"\"),\",\",\"\")),\" \",\", \")","v":"Inglés, Hawaiano"}]
["Honduras","HND",112492,"Tegucigalpa","Español","Lempira",null,{"$f":"SUBSTITUTE(SpaceIncaps(SUBSTITUTE(SUBSTITUTE(Datos[[#This Row],[Idiomas Oficiales]],\" \",\"\"),\",\",\"\")),\" \",\", \")","v":"Español"}]
["Hungría","HUN",93028,"Budapest","Húngaro","Forinto húngaro",null,{"$f":"SUBSTITUTE(SpaceIncaps(SUBSTITUTE(SUBSTITUTE(Datos[[#This Row],[Idiomas Oficiales]],\" \",\"\"),\",\",\"\")),\" \",\", \")","v":"Húngaro"}]
["India","IND",3287263,"Nueva Delhi","Hindi Inglés Hindi","Rupia india",null,{"$f":"SUBSTITUTE(SpaceIncaps(SUBSTITUTE(SUBSTITUTE(Datos[[#This Row],[Idiomas Oficiales]],\" \",\"\"),\",\",\"\")),\" \",\", \")","v":"Hindi, Inglés, Hindi"}]
["Indonesia","IDN",1904569,"Yakarta","Indonesio","Rupia indonesia",null,{"$f":"SUBSTITUTE(SpaceIncaps(SUBSTITUTE(SUBSTITUTE(Datos[[#This Row],[Idiomas Oficiales]],\" \",\"\"),\",\",\"\")),\" \",\", \")","v":"Indonesio"}]
["Irak","IRQ",438317,"Bagdad","Árabe","Dinar iraquí",null,{"$f":"SUBSTITUTE(SpaceIncaps(SUBSTITUTE(SUBSTITUTE(Datos[[#This Row],[Idiomas Oficiales]],\" \",\"\"),\",\",\"\")),\" \",\", \")","v":"Árabe"}]
["Irlanda","IRL",70273,"Dublín","Irlandés, Inglés","Euro",null,{"$f":"SUBSTITUTE(SpaceIncaps(SUBSTITUTE(SUBSTITUTE(Datos[[#This Row],[Idiomas Oficiales]],\" \",\"\"),\",\",\"\")),\" \",\", \")","v":"Irlandés, Inglés"}]
["Irán","IRN",1648195,"Teherán","Persa","Rial iraní",null,{"$f":"SUBSTITUTE(SpaceIncaps(SUBSTITUTE(SUBSTITUTE(Datos[[#This Row],[Idiomas Oficiales]],\" \",\"\"),\",\",\"\")),\" \",\", \")","v":"Persa"}]
["Isla Baker",null,null,null,null,null,"Islas Ultramarinas de Estados Unidos",{"$f":"SUBSTITUTE(SpaceIncaps(SUBSTITUTE(SUBSTITUTE(Datos[[#This Row],[Idiomas Oficiales]],\" \",\"\"),\",\",\"\")),\" \",\", \")","v":""}]
["Isla Clipperton",null,6,null,null,null,"Posesión de Francia",{"$f":"SUBSTITUTE(SpaceIncaps(SUBSTITUTE(SUBSTITUTE(Datos[[#This Row],[Idiomas Oficiales]],\" \",\"\"),\",\",\"\")),\" \",\", \")","v":""}]
["Isla Howland",null,null,null,null,null,"Islas Ultramarinas de Estados Unidos",{"$f":"SUBSTITUTE(SpaceIncaps(SUBSTITUTE(SUBSTITUTE(Datos[[#This Row],[Idiomas Oficiales]],\" \",\"\"),\",\",\"\")),\" \",\", \")","v":""}]
["Isla Jarvis",null,null,null,null,null,"Islas Ultramarinas de Estados Unidos",{"$f":"SUBSTITUTE(SpaceIncaps(SUBSTITUTE(SUBSTITUTE(Datos[[#This Row],[Idiomas Oficiales]],\" \",\"\"),\",\",\"\")),\" \",\", \")","v":""}]
["Isla Wake",null,null,null,null,null,"Islas Ultramarinas de Estados Unidos",{"$f":"SUBSTITUTE(SpaceIncaps(SUBSTITUTE(SUBSTITUTE(Datos[[#This Row],[Idiomas Oficiales]],\" \",\"\"),\",\",\"\")),\" \",\", \")","v":""}]
["Isla de Man",null,572,"Douglas","Inglés, Manés","Libra manesa","Dependencia de la Corona británica",{"$f":"SUBSTITUTE(SpaceIncaps(SUBSTITUTE(SUBSTITUTE(Datos[[#This Row],[Idiomas Oficiales]],\" \",\"\"),\",\",\"\")),\" \",\", \")","v":"Inglés, Manés"}]
["Isla de Navaza",null,5.4,null,null,null,"Islas Ultramarinas de Estados Unidos​",{"$f":"SUBSTITUTE(SpaceIncaps(SUBSTITUTE(SUBSTITUTE(Datos[[#This Row],[Idiomas Oficiales]],\" \",\"\"),\",\",\"\")),\" \",\", \")","v":""}]
["Isla de Navidad",null,135,"Flying Fish Cove","Inglés","Dólar australiano","Territorio externo de Australia",{"$f":"SUBSTITUTE(SpaceIncaps(SUBSTITUTE(SUBSTITUTE(Datos[[#This Row],[Idiomas Oficiales]],\" \",\"\"),\",\",\"\")),\" \",\", \")","v":"Inglés"}]
["Isla de Pascua",null,163,"Hanga Roa","Español Rapanui","Peso chileno","Comuna/Provincia de Chile",{"$f":"SUBSTITUTE(SpaceIncaps(SUBSTITUTE(SUBSTITUTE(Datos[[#This Row],[Idiomas Oficiales]],\" \",\"\"),\",\",\"\")),\" \",\", \")","v":"Español, Rapanui"}]
["Islandia","ISL",103000,"Reikiavik","Islandés","Corona islandesa",null,{"$f":"SUBSTITUTE(SpaceIncaps(SUBSTITUTE(SUBSTITUTE(Datos[[#This Row],[Idiomas Oficiales]],\" \",\"\"),\",\",\"\")),\" \",\", \")","v":"Islandés"}]
["Islas Caimán",null,264,"George Town","Inglés","Dólar de las Islas Caimán","Territorio británico de ultramar",{"$f":"SUBSTITUTE(SpaceIncaps(SUBSTITUTE(SUBSTITUTE(Datos[[#This Row],[Idiomas Oficiales]],\" \",\"\"),\",\",\"\")),\" \",\", \")","v":"Inglés"}]
["Islas Cocos",null,14,"West Island","Malayo, Inglés","Dólar australiano","Territorio externo de Australia",{"$f":"SUBSTITUTE(SpaceIncaps(SUBSTITUTE(SUBSTITUTE(Datos[[#This Row],[Idiomas Oficiales]],\" \",\"\"),\",\",\"\")),\" \",\", \")","v":"Malayo, Inglés"}]
["Islas Cook","236",9556,null,"Rarotongano Inglés","Dólar neozelandés (NZ$, NZD) Dólar de las Islas Cook ($, CKD)","Estado Libre Asociado a Nueva Zelanda",{"$f":"SUBSTITUTE(SpaceIncaps(SUBSTITUTE(SUBSTITUTE(Datos[[#This Row],[Idiomas Oficiales]],\" \",\"\"),\",\",\"\")),\" \",\", \")","v":"Rarotongano, Inglés"}]
["Islas Feroe",null,1393,"Tórshavn","Feroés, Danés |","Corona feroesa","Región autónoma de Dinamarca",{"$f":"SUBSTITUTE(SpaceIncaps(SUBSTITUTE(SUBSTITUTE(Datos[[#This Row],[Idiomas Oficiales]],\" \",\"\"),\",\",\"\")),\" \",\", \")","v":"Feroés, Danés|"}]
["Islas Georgias y Sandwich",null,3903,"Punta Coronel Zelaya/King Edward Point","Inglés","Libra malvinense","Territorio británico de ultramar​",{"$f":"SUBSTITUTE(SpaceIncaps(SUBSTITUTE(SUBSTITUTE(Datos[[#This Row],[Idiomas Oficiales]],\" \",\"\"),\",\",\"\")),\" \",\", \")","v":"Inglés"}]
["Islas Malvinas",null,12173,"Puerto Argentino/Stanley","Inglés","Libra malvinense","Territorio británico de ultramar​",{"$f":"SUBSTITUTE(SpaceIncaps(SUBSTITUTE(SUBSTITUTE(Datos[[#This Row],[Idiomas Oficiales]],\" \",\"\"),\",\",\"\")),\" \",\", \")","v":"Inglés"}]
["Islas Marianas del Norte","464",53467,null,"Inglés ChamorroCarolinio","Dólar estadounidense ($, USD)","Estado Libre Asociado a los Estados Unidos",{"$f":"SUBSTITUTE(SpaceIncaps(SUBSTITUTE(SUBSTITUTE(Datos[[#This Row],[Idiomas Oficiales]],\" \",\"\"),\",\",\"\")),\" \",\", \")","v":"Inglés, Chamorro, Carolinio"}]
["Islas Marshall","MHL",181,"Majuro","Marshalés Inglés","Dólar estadounidense ($, USD)",null,{"$f":"SUBSTITUTE(SpaceIncaps(SUBSTITUTE(SUBSTITUTE(Datos[[#This Row],[Idiomas Oficiales]],\" \",\"\"),\",\",\"\")),\" \",\", \")","v":"Marshalés, Inglés"}]
["Islas Midway",null,null,null,null,null,"Islas Ultramarinas de Estados Unidos",{"$f":"SUBSTITUTE(SpaceIncaps(SUBSTITUTE(SUBSTITUTE(Datos[[#This Row],[Idiomas Oficiales]],\" \",\"\"),\",\",\"\")),\" \",\", \")","v":""}]
["Islas Pelagias",null,26,"Agrigento","Italiano","Euro","parte de Provincia de Agrigento (Italia)",{"$f":"SUBSTITUTE(SpaceIncaps(SUBSTITUTE(SUBSTITUTE(Datos[[#This Row],[Idiomas Oficiales]],\" \",\"\"),\",\",\"\")),\" \",\", \")","v":"Italiano"}]
["Islas Pitcairn",null,47,"Adamstown","Inglés, Pitcairnés-norfolkense","Dólar neozelandés (NZ$, NZD)","Territorio británico de ultramar",{"$f":"SUBSTITUTE(SpaceIncaps(SUBSTITUTE(SUBSTITUTE(Datos[[#This Row],[Idiomas Oficiales]],\" \",\"\"),\",\",\"\")),\" \",\", \")","v":"Inglés, Pitcairnés-norfolkense"}]
["Islas Salomón","SLB",28896,"Honiara","Inglés","Dólar de las Islas Salomón ($, SBD)",null,{"$f":"SUBSTITUTE(SpaceIncaps(SUBSTITUTE(SUBSTITUTE(Datos[[#This Row],[Idiomas Oficiales]],\" \",\"\"),\",\",\"\")),\" \",\", \")","v":"Inglés"}]
["Islas Turcas y Caicos",null,948,"Cockburn Town","Inglés","Dólar estadounidense","Territorio británico de ultramar",{"$f":"SUBSTITUTE(SpaceIncaps(SUBSTITUTE(SUBSTITUTE(Datos[[#This Row],[Idiomas Oficiales]],\" \",\"\"),\",\",\"\")),\" \",\", \")","v":"Inglés"}]
["Islas Vírgenes Británicas",null,151,"Road Town","Inglés","Dólar estadounidense","Territorio británico de ultramar",{"$f":"SUBSTITUTE(SpaceIncaps(SUBSTITUTE(SUBSTITUTE(Datos[[#This Row],[Idiomas Oficiales]],\" \",\"\"),\",\",\"\")),\" \",\", \")","v":"Inglés"}]
["Islas Vírgenes de Estados Unidos",null,346,"Charlotte Amalie","Inglés","Dólar estadounidense","Territorios no incorporados de los Estados Unidos",{"$f":"SUBSTITUTE(SpaceIncaps(SUBSTITUTE(SUBSTITUTE(Datos[[#This Row],[Idiomas Oficiales]],\" \",\"\"),\",\",\"\")),\" \",\", \")","v":"Inglés"}]
["Israel","ISR",22145,"Jerusalén","Hebreo","Nuevo séquel",null,{"$f":"SUBSTITUTE(SpaceIncaps(SUBSTITUTE(SUBSTITUTE(Datos[[#This Row],[Idiomas Oficiales]],\" \",\"\"),\",\",\"\")),\" \",\", \")","v":"Hebreo"}]
["Italia","ITA",301340,"Roma","Italiano","Euro",null,{"$f":"SUBSTITUTE(SpaceIncaps(SUBSTITUTE(SUBSTITUTE(Datos[[#This Row],[Idiomas Oficiales]],\" \",\"\"),\",\",\"\")),\" \",\", \")","v":"Italiano"}]
["Jamaica","JAM",10991,"Kingston","Inglés","Dólar jamaiquino",null,{"$f":"SUBSTITUTE(SpaceIncaps(SUBSTITUTE(SUBSTITUTE(Datos[[#This Row],[Idiomas Oficiales]],\" \",\"\"),\",\",\"\")),\" \",\", \")","v":"Inglés"}]
["Japón","JPN",377915,"Tokio","Japonés","Yen",null,{"$f":"SUBSTITUTE(SpaceIncaps(SUBSTITUTE(SUBSTITUTE(Datos[[#This Row],[Idiomas Oficiales]],\" \",\"\"),\",\",\"\")),\" \",\", \")","v":"Japonés"}]
["Jersey",null,116,"Saint Helier","Inglés, Francés","Libra de Jersey","Dependencia de la Corona británica",{"$f":"SUBSTITUTE(SpaceIncaps(SUBSTITUTE(SUBSTITUTE(Datos[[#This Row],[Idiomas Oficiales]],\" \",\"\"),\",\",\"\")),\" \",\", \")","v":"Inglés, Francés"}]
["Jordania","JOR",89342,"Amán","Árabe","Dinar jordano",null,{"$f":"SUBSTITUTE(SpaceIncaps(SUBSTITUTE(SUBSTITUTE(Datos[[#This Row],[Idiomas Oficiales]],\" \",\"\"),\",\",\"\")),\" \",\", \")","v":"Árabe"}]
["Kazajistán","KAZ",2724900,"Nur-sultán","Kazajo, Ruso","Tenge kazajo",null,{"$f":"SUBSTITUTE(SpaceIncaps(SUBSTITUTE(SUBSTITUTE(Datos[[#This Row],[Idiomas Oficiales]],\" \",\"\"),\",\",\"\")),\" \",\", \")","v":"Kazajo, Ruso"}]
["Kenia","KEN",580367,"Nairobi","Suajili Inglés","Chelín keniata",null,{"$f":"SUBSTITUTE(SpaceIncaps(SUBSTITUTE(SUBSTITUTE(Datos[[#This Row],[Idiomas Oficiales]],\" \",\"\"),\",\",\"\")),\" \",\", \")","v":"Suajili, Inglés"}]
["Kirguistán","KGZ",199951,"Biskek","Kirguís Ruso","Som kirguís",null,{"$f":"SUBSTITUTE(SpaceIncaps(SUBSTITUTE(SUBSTITUTE(Datos[[#This Row],[Idiomas Oficiales]],\" \",\"\"),\",\",\"\")),\" \",\", \")","v":"Kirguís, Ruso"}]
["Kiribati","KIR",811,"Tarawa","Inglés Gilbertés","Dólar de Kiribati ($, KID) Dólar australiano($, AUD)",null,{"$f":"SUBSTITUTE(SpaceIncaps(SUBSTITUTE(SUBSTITUTE(Datos[[#This Row],[Idiomas Oficiales]],\" \",\"\"),\",\",\"\")),\" \",\", \")","v":"Inglés, Gilbertés"}]
["Kosovo","–",10887,"Pristina","Albanés, Serbio","Euro​",null,{"$f":"SUBSTITUTE(SpaceIncaps(SUBSTITUTE(SUBSTITUTE(Datos[[#This Row],[Idiomas Oficiales]],\" \",\"\"),\",\",\"\")),\" \",\", \")","v":"Albanés, Serbio"}]
["Kuwait","KWT",17818,"Ciudad de Kuwait","Árabe","Dinar kuwaití",null,{"$f":"SUBSTITUTE(SpaceIncaps(SUBSTITUTE(SUBSTITUTE(Datos[[#This Row],[Idiomas Oficiales]],\" \",\"\"),\",\",\"\")),\" \",\", \")","v":"Árabe"}]
["Laos","LAO",236800,"Vientián","Lao","Kip laosiano",null,{"$f":"SUBSTITUTE(SpaceIncaps(SUBSTITUTE(SUBSTITUTE(Datos[[#This Row],[Idiomas Oficiales]],\" \",\"\"),\",\",\"\")),\" \",\", \")","v":"Lao"}]
["Lesoto","LSO",30355,"Maseru","Sesotho Inglés","Loti",null,{"$f":"SUBSTITUTE(SpaceIncaps(SUBSTITUTE(SUBSTITUTE(Datos[[#This Row],[Idiomas Oficiales]],\" \",\"\"),\",\",\"\")),\" \",\", \")","v":"Sesotho, Inglés"}]
["Letonia","LVA",64589,"Riga","Letón","Euro",null,{"$f":"SUBSTITUTE(SpaceIncaps(SUBSTITUTE(SUBSTITUTE(Datos[[#This Row],[Idiomas Oficiales]],\" \",\"\"),\",\",\"\")),\" \",\", \")","v":"Letón"}]
["Liberia","LBR",111369,"Monrovia","Inglés","Dólar liberiano",null,{"$f":"SUBSTITUTE(SpaceIncaps(SUBSTITUTE(SUBSTITUTE(Datos[[#This Row],[Idiomas Oficiales]],\" \",\"\"),\",\",\"\")),\" \",\", \")","v":"Inglés"}]
["Libia","LBY",1759540,"Trípoli","Árabe ItalianoEspañol","Dinar libio",null,{"$f":"SUBSTITUTE(SpaceIncaps(SUBSTITUTE(SUBSTITUTE(Datos[[#This Row],[Idiomas Oficiales]],\" \",\"\"),\",\",\"\")),\" \",\", \")","v":"Árabe, Italiano, Español"}]
["Liechtenstein","LIE",160,"Vaduz","Alemán","Franco suizo",null,{"$f":"SUBSTITUTE(SpaceIncaps(SUBSTITUTE(SUBSTITUTE(Datos[[#This Row],[Idiomas Oficiales]],\" \",\"\"),\",\",\"\")),\" \",\", \")","v":"Alemán"}]
["Lituania","LTU",64589,"Vilna","Lituano","Euro",null,{"$f":"SUBSTITUTE(SpaceIncaps(SUBSTITUTE(SUBSTITUTE(Datos[[#This Row],[Idiomas Oficiales]],\" \",\"\"),\",\",\"\")),\" \",\", \")","v":"Lituano"}]
["Luxemburgo","LUX",2586,"Luxemburgo","Luxemburgués, Francés, Alemán","Euro",null,{"$f":"SUBSTITUTE(SpaceIncaps(SUBSTITUTE(SUBSTITUTE(Datos[[#This Row],[Idiomas Oficiales]],\" \",\"\"),\",\",\"\")),\" \",\", \")","v":"Luxemburgués, Francés, Alemán"}]
["Líbano","LBN",14400,"Beirut","Árabe","Libra libanesa",null,{"$f":"SUBSTITUTE(SpaceIncaps(SUBSTITUTE(SUBSTITUTE(Datos[[#This Row],[Idiomas Oficiales]],\" \",\"\"),\",\",\"\")),\" \",\", \")","v":"Árabe"}]
["Macedonia del Norte","MKD",25713,"Skopie","Macedonio","Denar macedonio",null,{"$f":"SUBSTITUTE(SpaceIncaps(SUBSTITUTE(SUBSTITUTE(Datos[[#This Row],[Idiomas Oficiales]],\" \",\"\"),\",\",\"\")),\" \",\", \")","v":"Macedonio"}]
["Madagascar","MDG",587041,"Antananarivo","Malgache FrancésInglés","Ariary malgache",null,{"$f":"SUBSTITUTE(SpaceIncaps(SUBSTITUTE(SUBSTITUTE(Datos[[#This Row],[Idiomas Oficiales]],\" \",\"\"),\",\",\"\")),\" \",\", \")","v":"Malgache, Francés, Inglés"}]
["Madeira",null,801,"Funchal","Portugués","Euro","Región autónoma de Portugal",{"$f":"SUBSTITUTE(SpaceIncaps(SUBSTITUTE(SUBSTITUTE(Datos[[#This Row],[Idiomas Oficiales]],\" \",\"\"),\",\",\"\")),\" \",\", \")","v":"Portugués"}]
["Malasia","MYS",329847,"Kuala Lumpur","Malayo","Ringgit",null,{"$f":"SUBSTITUTE(SpaceIncaps(SUBSTITUTE(SUBSTITUTE(Datos[[#This Row],[Idiomas Oficiales]],\" \",\"\"),\",\",\"\")),\" \",\", \")","v":"Malayo"}]
["Malaui","MWI",118484,"Lilongüe","Inglés Chichewa","Kwacha malauí",null,{"$f":"SUBSTITUTE(SpaceIncaps(SUBSTITUTE(SUBSTITUTE(Datos[[#This Row],[Idiomas Oficiales]],\" \",\"\"),\",\",\"\")),\" \",\", \")","v":"Inglés, Chichewa"}]
["Maldivas","MDV",298,"Malé","Maldivo","Rupia de Maldivas",null,{"$f":"SUBSTITUTE(SpaceIncaps(SUBSTITUTE(SUBSTITUTE(Datos[[#This Row],[Idiomas Oficiales]],\" \",\"\"),\",\",\"\")),\" \",\", \")","v":"Maldivo"}]
["Malta","MLT",316,"La Valeta","Maltés, Inglés","Euro",null,{"$f":"SUBSTITUTE(SpaceIncaps(SUBSTITUTE(SUBSTITUTE(Datos[[#This Row],[Idiomas Oficiales]],\" \",\"\"),\",\",\"\")),\" \",\", \")","v":"Maltés, Inglés"}]
["Malí","MLI",1240192,"Bamako","Francés Bambara","Franco CFA de África Occidental",null,{"$f":"SUBSTITUTE(SpaceIncaps(SUBSTITUTE(SUBSTITUTE(Datos[[#This Row],[Idiomas Oficiales]],\" \",\"\"),\",\",\"\")),\" \",\", \")","v":"Francés, Bambara"}]
["Marruecos","MAR",446550,"Rabat","Árabe EspañolFrancés","Dirham marroquí",null,{"$f":"SUBSTITUTE(SpaceIncaps(SUBSTITUTE(SUBSTITUTE(Datos[[#This Row],[Idiomas Oficiales]],\" \",\"\"),\",\",\"\")),\" \",\", \")","v":"Árabe, Español, Francés"}]
["Martinica",null,1100,"Fort-de-France","Francés","Euro","Departamento de ultramar de Francia",{"$f":"SUBSTITUTE(SpaceIncaps(SUBSTITUTE(SUBSTITUTE(Datos[[#This Row],[Idiomas Oficiales]],\" \",\"\"),\",\",\"\")),\" \",\", \")","v":"Francés"}]
["Mauricio","MUS",2040,"Port Louis","Inglés FrancésMauriciano","Rupia de Mauricio",null,{"$f":"SUBSTITUTE(SpaceIncaps(SUBSTITUTE(SUBSTITUTE(Datos[[#This Row],[Idiomas Oficiales]],\" \",\"\"),\",\",\"\")),\" \",\", \")","v":"Inglés, Francés, Mauriciano"}]
["Mauritania","MRT",1030700,"Nuakchot","Árabe Francés","Ouguiya",null,{"$f":"SUBSTITUTE(SpaceIncaps(SUBSTITUTE(SUBSTITUTE(Datos[[#This Row],[Idiomas Oficiales]],\" \",\"\"),\",\",\"\")),\" \",\", \")","v":"Árabe, Francés"}]
["Mayotte",null,374,"Mamoudzou","Francés","Euro","Departamento de ultramar de Francia",{"$f":"SUBSTITUTE(SpaceIncaps(SUBSTITUTE(SUBSTITUTE(Datos[[#This Row],[Idiomas Oficiales]],\" \",\"\"),\",\",\"\")),\" \",\", \")","v":"Francés"}]
["Melilla",null,12,"Melilla","Español","Euro","Ciudad autónoma de España",{"$f":"SUBSTITUTE(SpaceIncaps(SUBSTITUTE(SUBSTITUTE(Datos[[#This Row],[Idiomas Oficiales]],\" \",\"\"),\",\",\"\")),\" \",\", \")","v":"Español"}]
["Micronesia","FSM",702,"Palikir","Inglés","Dólar estadounidense ($, USD)",null,{"$f":"SUBSTITUTE(SpaceIncaps(SUBSTITUTE(SUBSTITUTE(Datos[[#This Row],[Idiomas Oficiales]],\" \",\"\"),\",\",\"\")),\" \",\", \")","v":"Inglés"}]
["Moldavia","MDA",33851,"Chisináu","Rumano","Leu moldavo",null,{"$f":"SUBSTITUTE(SpaceIncaps(SUBSTITUTE(SUBSTITUTE(Datos[[#This Row],[Idiomas Oficiales]],\" \",\"\"),\",\",\"\")),\" \",\", \")","v":"Rumano"}]
["Molucas",null,74505,"Ambon","Indonesio","Rupia indonesia","Provincia de la República de Indonesia",{"$f":"SUBSTITUTE(SpaceIncaps(SUBSTITUTE(SUBSTITUTE(Datos[[#This Row],[Idiomas Oficiales]],\" \",\"\"),\",\",\"\")),\" \",\", \")","v":"Indonesio"}]
["Mongolia","MNG",1564116,"Ulán Bator","Mongol","Tugrik mongol",null,{"$f":"SUBSTITUTE(SpaceIncaps(SUBSTITUTE(SUBSTITUTE(Datos[[#This Row],[Idiomas Oficiales]],\" \",\"\"),\",\",\"\")),\" \",\", \")","v":"Mongol"}]
["Montenegro","MNE",13812,"Podgorica","Montenegrino","Euro​",null,{"$f":"SUBSTITUTE(SpaceIncaps(SUBSTITUTE(SUBSTITUTE(Datos[[#This Row],[Idiomas Oficiales]],\" \",\"\"),\",\",\"\")),\" \",\", \")","v":"Montenegrino"}]
["Montserrat",null,102,"Plymouth (de iure) \r\nBrades (de facto)","Inglés","Dólar del Caribe Oriental","Territorio británico de ultramar",{"$f":"SUBSTITUTE(SpaceIncaps(SUBSTITUTE(SUBSTITUTE(Datos[[#This Row],[Idiomas Oficiales]],\" \",\"\"),\",\",\"\")),\" \",\", \")","v":"Inglés"}]
["Mozambique","MOZ",799380,"Maputo","Portugués","Metical mozambiqueño",null,{"$f":"SUBSTITUTE(SpaceIncaps(SUBSTITUTE(SUBSTITUTE(Datos[[#This Row],[Idiomas Oficiales]],\" \",\"\"),\",\",\"\")),\" \",\", \")","v":"Portugués"}]
["México","MEX",1964375,"Ciudad de México","Español","Peso mexicano",null,{"$f":"SUBSTITUTE(SpaceIncaps(SUBSTITUTE(SUBSTITUTE(Datos[[#This Row],[Idiomas Oficiales]],\" \",\"\"),\",\",\"\")),\" \",\", \")","v":"Español"}]
["Mónaco","MCO",2,"Mónaco","Francés Italiano","Euro​",null,{"$f":"SUBSTITUTE(SpaceIncaps(SUBSTITUTE(SUBSTITUTE(Datos[[#This Row],[Idiomas Oficiales]],\" \",\"\"),\",\",\"\")),\" \",\", \")","v":"Francés, Italiano"}]
["Namibia","NAM",824292,"Windhoek","Inglés AlemánAfrikáans","Dólar namibio",null,{"$f":"SUBSTITUTE(SpaceIncaps(SUBSTITUTE(SUBSTITUTE(Datos[[#This Row],[Idiomas Oficiales]],\" \",\"\"),\",\",\"\")),\" \",\", \")","v":"Inglés, Alemán, Afrikáans"}]
["Nauru","NRU",21,"Yaren (de facto)","Inglés Nauruano","Dólar australiano (($, AUD)",null,{"$f":"SUBSTITUTE(SpaceIncaps(SUBSTITUTE(SUBSTITUTE(Datos[[#This Row],[Idiomas Oficiales]],\" \",\"\"),\",\",\"\")),\" \",\", \")","v":"Inglés, Nauruano"}]
["Nepal","NPL",147181,"Katmandú","Nepalí","Rupia nepalí",null,{"$f":"SUBSTITUTE(SpaceIncaps(SUBSTITUTE(SUBSTITUTE(Datos[[#This Row],[Idiomas Oficiales]],\" \",\"\"),\",\",\"\")),\" \",\", \")","v":"Nepalí"}]
["Nicaragua","NIC",130370,"Managua","Español","Córdoba",null,{"$f":"SUBSTITUTE(SpaceIncaps(SUBSTITUTE(SUBSTITUTE(Datos[[#This Row],[Idiomas Oficiales]],\" \",\"\"),\",\",\"\")),\" \",\", \")","v":"Español"}]
["Nigeria","NGA",923768,"Abuya","Inglés YorubaHausaIgbo","Naira",null,{"$f":"SUBSTITUTE(SpaceIncaps(SUBSTITUTE(SUBSTITUTE(Datos[[#This Row],[Idiomas Oficiales]],\" \",\"\"),\",\",\"\")),\" \",\", \")","v":"Inglés, Yoruba, Hausa, Igbo"}]
["Niue","260",1190,null,"Inglés Niuano","Dólar neozelandés (NZ$, NZD)","Estado Libre Asociado a Nueva Zelanda",{"$f":"SUBSTITUTE(SpaceIncaps(SUBSTITUTE(SUBSTITUTE(Datos[[#This Row],[Idiomas Oficiales]],\" \",\"\"),\",\",\"\")),\" \",\", \")","v":"Inglés, Niuano"}]
["Noruega","NOR",323802,"Oslo","Noruego","Corona noruega",null,{"$f":"SUBSTITUTE(SpaceIncaps(SUBSTITUTE(SUBSTITUTE(Datos[[#This Row],[Idiomas Oficiales]],\" \",\"\"),\",\",\"\")),\" \",\", \")","v":"Noruego"}]
["Nueva Caledonia",null,18575,"Numea","Francés Canaco","Franco CFP (F, XPF)","Colectividad sui generis de Francia​",{"$f":"SUBSTITUTE(SpaceIncaps(SUBSTITUTE(SUBSTITUTE(Datos[[#This Row],[Idiomas Oficiales]],\" \",\"\"),\",\",\"\")),\" \",\", \")","v":"Francés, Canaco"}]
["Nueva Zelanda","NZL",268838,"Wellington","Inglés Maorí","dólar neozelandés ($, NZD)",null,{"$f":"SUBSTITUTE(SpaceIncaps(SUBSTITUTE(SUBSTITUTE(Datos[[#This Row],[Idiomas Oficiales]],\" \",\"\"),\",\",\"\")),\" \",\", \")","v":"Inglés, Maorí"}]
["Níger","NER",1267000,"Niamey","Francés","Franco CFA de África Occidental",null,{"$f":"SUBSTITUTE(SpaceIncaps(SUBSTITUTE(SUBSTITUTE(Datos[[#This Row],[Idiomas Oficiales]],\" \",\"\"),\",\",\"\")),\" \",\", \")","v":"Francés"}]
["Omán","OMN",309500,"Mascate","Árabe","Rial omaní",null,{"$f":"SUBSTITUTE(SpaceIncaps(SUBSTITUTE(SUBSTITUTE(Datos[[#This Row],[Idiomas Oficiales]],\" \",\"\"),\",\",\"\")),\" \",\", \")","v":"Árabe"}]
["Osetia del Sur","RSO",3900,"Tsjinvali","Osetio, Ruso","Rublo ruso",null,{"$f":"SUBSTITUTE(SpaceIncaps(SUBSTITUTE(SUBSTITUTE(Datos[[#This Row],[Idiomas Oficiales]],\" \",\"\"),\",\",\"\")),\" \",\", \")","v":"Osetio, Ruso"}]
["Pakistán","PAK",796095,"Islamabad","Urdu, Inglés","Rupia pakistaní",null,{"$f":"SUBSTITUTE(SpaceIncaps(SUBSTITUTE(SUBSTITUTE(Datos[[#This Row],[Idiomas Oficiales]],\" \",\"\"),\",\",\"\")),\" \",\", \")","v":"Urdu, Inglés"}]
["Palaos","PLW",459,"Ngerulmud","Inglés PalauanoJaponésAngaurTobianoSonsorol","Dólar estadounidense ($, USD)",null,{"$f":"SUBSTITUTE(SpaceIncaps(SUBSTITUTE(SUBSTITUTE(Datos[[#This Row],[Idiomas Oficiales]],\" \",\"\"),\",\",\"\")),\" \",\", \")","v":"Inglés, Palauano, Japonés, Angaur, Tobiano, Sonsorol"}]
["Palestina","PSE",6220,"Ramala","Árabe","Nuevo séquel",null,{"$f":"SUBSTITUTE(SpaceIncaps(SUBSTITUTE(SUBSTITUTE(Datos[[#This Row],[Idiomas Oficiales]],\" \",\"\"),\",\",\"\")),\" \",\", \")","v":"Árabe"}]
["Panamá","PAN",75420,"Ciudad de Panamá","Español","Balboa",null,{"$f":"SUBSTITUTE(SpaceIncaps(SUBSTITUTE(SUBSTITUTE(Datos[[#This Row],[Idiomas Oficiales]],\" \",\"\"),\",\",\"\")),\" \",\", \")","v":"Español"}]
["Pantelaria",null,83,"Trapani","Italiano","Euro","parte de Provincia de Trapani (Italia)",{"$f":"SUBSTITUTE(SpaceIncaps(SUBSTITUTE(SUBSTITUTE(Datos[[#This Row],[Idiomas Oficiales]],\" \",\"\"),\",\",\"\")),\" \",\", \")","v":"Italiano"}]
["Papúa",null,319036,"Jayapura","Indonesio","Rupia indonesia","Provincia de la República de Indonesia",{"$f":"SUBSTITUTE(SpaceIncaps(SUBSTITUTE(SUBSTITUTE(Datos[[#This Row],[Idiomas Oficiales]],\" \",\"\"),\",\",\"\")),\" \",\", \")","v":"Indonesio"}]
["Papúa Nueva Guinea","PNG",462840,"Puerto Moresby","Inglés Tok pisinHiri motu","Kina (PKG, PGK)",null,{"$f":"SUBSTITUTE(SpaceIncaps(SUBSTITUTE(SUBSTITUTE(Datos[[#This Row],[Idiomas Oficiales]],\" \",\"\"),\",\",\"\")),\" \",\", \")","v":"Inglés, Tokpisin, Hirimotu"}]
["Papúa Occidental",null,140375,"Manokwari","Indonesio","Rupia indonesia","Provincia de la República de Indonesia",{"$f":"SUBSTITUTE(SpaceIncaps(SUBSTITUTE(SUBSTITUTE(Datos[[#This Row],[Idiomas Oficiales]],\" \",\"\"),\",\",\"\")),\" \",\", \")","v":"Indonesio"}]
["Paraguay","PRY",406752,"Asunción","Español Guaraní","Guaraní",null,{"$f":"SUBSTITUTE(SpaceIncaps(SUBSTITUTE(SUBSTITUTE(Datos[[#This Row],[Idiomas Oficiales]],\" \",\"\"),\",\",\"\")),\" \",\", \")","v":"Español, Guaraní"}]
["Países Bajos","NLD",41543,"Ámsterdam","Neerlandés","Euro",null,{"$f":"SUBSTITUTE(SpaceIncaps(SUBSTITUTE(SUBSTITUTE(Datos[[#This Row],[Idiomas Oficiales]],\" \",\"\"),\",\",\"\")),\" \",\", \")","v":"Neerlandés"}]
["Perú","PER",1285216,"Lima","Español","Sol",null,{"$f":"SUBSTITUTE(SpaceIncaps(SUBSTITUTE(SUBSTITUTE(Datos[[#This Row],[Idiomas Oficiales]],\" \",\"\"),\",\",\"\")),\" \",\", \")","v":"Español"}]
["Plazas de Soberanía",null,59,"–","Español","Euro","Plazas de Soberanía",{"$f":"SUBSTITUTE(SpaceIncaps(SUBSTITUTE(SUBSTITUTE(Datos[[#This Row],[Idiomas Oficiales]],\" \",\"\"),\",\",\"\")),\" \",\", \")","v":"Español"}]
["Plazas de soberanía",null,0.59,null,"Español","Euro (€,EUR)","Plazas de soberanía (Reino de España)",{"$f":"SUBSTITUTE(SpaceIncaps(SUBSTITUTE(SUBSTITUTE(Datos[[#This Row],[Idiomas Oficiales]],\" \",\"\"),\",\",\"\")),\" \",\", \")","v":"Español"}]
["Polinesia Francesa",null,4167,"Papeete","Francés Tahitiano","Franco CFP (F, XPF)","Colectividad de ultramar de Francia​",{"$f":"SUBSTITUTE(SpaceIncaps(SUBSTITUTE(SUBSTITUTE(Datos[[#This Row],[Idiomas Oficiales]],\" \",\"\"),\",\",\"\")),\" \",\", \")","v":"Francés, Tahitiano"}]
["Polonia","POL",312685,"Varsovia","Polaco","Złoty",null,{"$f":"SUBSTITUTE(SpaceIncaps(SUBSTITUTE(SUBSTITUTE(Datos[[#This Row],[Idiomas Oficiales]],\" \",\"\"),\",\",\"\")),\" \",\", \")","v":"Polaco"}]
["Portugal","PRT",92090,"Lisboa","Portugués","Euro",null,{"$f":"SUBSTITUTE(SpaceIncaps(SUBSTITUTE(SUBSTITUTE(Datos[[#This Row],[Idiomas Oficiales]],\" \",\"\"),\",\",\"\")),\" \",\", \")","v":"Portugués"}]
["Puerto Rico","PRI",9104,"San Juan","Español Inglés","Dólar estadounidense",null,{"$f":"SUBSTITUTE(SpaceIncaps(SUBSTITUTE(SUBSTITUTE(Datos[[#This Row],[Idiomas Oficiales]],\" \",\"\"),\",\",\"\")),\" \",\", \")","v":"Español, Inglés"}]
["Reino Unido","GBR",243610,"Londres","Inglés Galés Escocés Norirlandés","Libra esterlina",null,{"$f":"SUBSTITUTE(SpaceIncaps(SUBSTITUTE(SUBSTITUTE(Datos[[#This Row],[Idiomas Oficiales]],\" \",\"\"),\",\",\"\")),\" \",\", \")","v":"Inglés, Galés, Escocés, Norirlandés"}]
["República Centroafricana","CAF",622984,"Bangui","Sango Francés","Franco CFA de África Central",null,{"$f":"SUBSTITUTE(SpaceIncaps(SUBSTITUTE(SUBSTITUTE(Datos[[#This Row],[Idiomas Oficiales]],\" \",\"\"),\",\",\"\")),\" \",\", \")","v":"Sango, Francés"}]
["República Checa","CZE",78867,"Praga","Checo","Corona checa",null,{"$f":"SUBSTITUTE(SpaceIncaps(SUBSTITUTE(SUBSTITUTE(Datos[[#This Row],[Idiomas Oficiales]],\" \",\"\"),\",\",\"\")),\" \",\", \")","v":"Checo"}]
["República Democrática del Congo","COD",2344858,"Kinsasa","Francés KikongoLingalaSuajiliChiluba","Franco congoleño",null,{"$f":"SUBSTITUTE(SpaceIncaps(SUBSTITUTE(SUBSTITUTE(Datos[[#This Row],[Idiomas Oficiales]],\" \",\"\"),\",\",\"\")),\" \",\", \")","v":"Francés, Kikongo, Lingala, Suajili, Chiluba"}]
["República Dominicana","DOM",48670,"Santo Domingo","Español","Peso dominicano",null,{"$f":"SUBSTITUTE(SpaceIncaps(SUBSTITUTE(SUBSTITUTE(Datos[[#This Row],[Idiomas Oficiales]],\" \",\"\"),\",\",\"\")),\" \",\", \")","v":"Español"}]
["República del Congo","COG",342000,"Brazzaville","Francés Lingala","Franco CFA de África Central",null,{"$f":"SUBSTITUTE(SpaceIncaps(SUBSTITUTE(SUBSTITUTE(Datos[[#This Row],[Idiomas Oficiales]],\" \",\"\"),\",\",\"\")),\" \",\", \")","v":"Francés, Lingala"}]
["Reunión",null,2512,"Saint-Denis","Francés","Euro","Departamento de ultramar de Francia",{"$f":"SUBSTITUTE(SpaceIncaps(SUBSTITUTE(SUBSTITUTE(Datos[[#This Row],[Idiomas Oficiales]],\" \",\"\"),\",\",\"\")),\" \",\", \")","v":"Francés"}]
["Ruanda","RWA",26338,"Kigali","Kiñaruanda FrancésInglés","Franco ruandés",null,{"$f":"SUBSTITUTE(SpaceIncaps(SUBSTITUTE(SUBSTITUTE(Datos[[#This Row],[Idiomas Oficiales]],\" \",\"\"),\",\",\"\")),\" \",\", \")","v":"Kiñaruanda, Francés, Inglés"}]
["Rumanía","ROU",238391,"Bucarest","Rumano","Leu rumano",null,{"$f":"SUBSTITUTE(SpaceIncaps(SUBSTITUTE(SUBSTITUTE(Datos[[#This Row],[Idiomas Oficiales]],\" \",\"\"),\",\",\"\")),\" \",\", \")","v":"Rumano"}]
["Rusia","RUS",17098242,"Moscú","Ruso","Rublo ruso",null,{"$f":"SUBSTITUTE(SpaceIncaps(SUBSTITUTE(SUBSTITUTE(Datos[[#This Row],[Idiomas Oficiales]],\" \",\"\"),\",\",\"\")),\" \",\", \")","v":"Ruso"}]
["Saba",null,13,"The Bottom","Neerlandés Papiamento","Dólar estadounidense","Municipio Especial de los Países Bajos",{"$f":"SUBSTITUTE(SpaceIncaps(SUBSTITUTE(SUBSTITUTE(Datos[[#This Row],[Idiomas Oficiales]],\" \",\"\"),\",\",\"\")),\" \",\", \")","v":"Neerlandés, Papiamento"}]
["Samoa","WSM",2831,"Apia","Samoano Inglés","Tala (WS$, WST)",null,{"$f":"SUBSTITUTE(SpaceIncaps(SUBSTITUTE(SUBSTITUTE(Datos[[#This Row],[Idiomas Oficiales]],\" \",\"\"),\",\",\"\")),\" \",\", \")","v":"Samoano, Inglés"}]
["Samoa Americana",null,199,"Pago Pago","Inglés, Samoano","Dólar estadounidense ($, USD)","Territorio no incorporado de los Estados Unidos",{"$f":"SUBSTITUTE(SpaceIncaps(SUBSTITUTE(SUBSTITUTE(Datos[[#This Row],[Idiomas Oficiales]],\" \",\"\"),\",\",\"\")),\" \",\", \")","v":"Inglés, Samoano"}]
["San Bartolomé",null,25,"Gustavia","Francés","Euro","Colectividad de ultramar de Francia",{"$f":"SUBSTITUTE(SpaceIncaps(SUBSTITUTE(SUBSTITUTE(Datos[[#This Row],[Idiomas Oficiales]],\" \",\"\"),\",\",\"\")),\" \",\", \")","v":"Francés"}]
["San Cristóbal y Nieves","KNA",261,"Basseterre","Inglés","Dólar del Caribe Oriental",null,{"$f":"SUBSTITUTE(SpaceIncaps(SUBSTITUTE(SUBSTITUTE(Datos[[#This Row],[Idiomas Oficiales]],\" \",\"\"),\",\",\"\")),\" \",\", \")","v":"Inglés"}]
["San Eustaquio",null,21,"Oranjestad","Neerlandés Inglés","Dólar estadounidense","Municipio Especial de los Países Bajos",{"$f":"SUBSTITUTE(SpaceIncaps(SUBSTITUTE(SUBSTITUTE(Datos[[#This Row],[Idiomas Oficiales]],\" \",\"\"),\",\",\"\")),\" \",\", \")","v":"Neerlandés, Inglés"}]
["San Marino","SMR",61,"Ciudad de San Marino","Italiano Español","Euro​",null,{"$f":"SUBSTITUTE(SpaceIncaps(SUBSTITUTE(SUBSTITUTE(Datos[[#This Row],[Idiomas Oficiales]],\" \",\"\"),\",\",\"\")),\" \",\", \")","v":"Italiano, Español"}]
["San Martín",null,53,"Marigot","Francés","Euro","Colectividad de ultramar de Francia",{"$f":"SUBSTITUTE(SpaceIncaps(SUBSTITUTE(SUBSTITUTE(Datos[[#This Row],[Idiomas Oficiales]],\" \",\"\"),\",\",\"\")),\" \",\", \")","v":"Francés"}]
["San Martín",null,34,"Philipsburg","Neerlandés","Florín antillano neerlandés","Nación constitutiva de los Países Bajos",{"$f":"SUBSTITUTE(SpaceIncaps(SUBSTITUTE(SUBSTITUTE(Datos[[#This Row],[Idiomas Oficiales]],\" \",\"\"),\",\",\"\")),\" \",\", \")","v":"Neerlandés"}]
["San Pedro y Miquelón",null,242,"San Pedro (San Pedro y Miquelón)","Francés","Euro","Colectividad de ultramar de Francia",{"$f":"SUBSTITUTE(SpaceIncaps(SUBSTITUTE(SUBSTITUTE(Datos[[#This Row],[Idiomas Oficiales]],\" \",\"\"),\",\",\"\")),\" \",\", \")","v":"Francés"}]
["San Vicente y las Granadinas","VCT",389,"Kingstown","Inglés","Dólar del Caribe Oriental",null,{"$f":"SUBSTITUTE(SpaceIncaps(SUBSTITUTE(SUBSTITUTE(Datos[[#This Row],[Idiomas Oficiales]],\" \",\"\"),\",\",\"\")),\" \",\", \")","v":"Inglés"}]
["Santa Elena",null,420,"Jamestown","Inglés","Libra de Santa Elena","Territorio británico de ultramar",{"$f":"SUBSTITUTE(SpaceIncaps(SUBSTITUTE(SUBSTITUTE(Datos[[#This Row],[Idiomas Oficiales]],\" \",\"\"),\",\",\"\")),\" \",\", \")","v":"Inglés"}]
["Santa Lucía","LCA",616,"Castries","Inglés","Dólar del Caribe Oriental",null,{"$f":"SUBSTITUTE(SpaceIncaps(SUBSTITUTE(SUBSTITUTE(Datos[[#This Row],[Idiomas Oficiales]],\" \",\"\"),\",\",\"\")),\" \",\", \")","v":"Inglés"}]
["Santo Tomé y Príncipe","STP",964,"Santo Tomé","Portugués","Dobra santotomense",null,{"$f":"SUBSTITUTE(SpaceIncaps(SUBSTITUTE(SUBSTITUTE(Datos[[#This Row],[Idiomas Oficiales]],\" \",\"\"),\",\",\"\")),\" \",\", \")","v":"Portugués"}]
["Senegal","SEN",196722,"Dakar","Francés Wolof","Franco CFA de África Occidental",null,{"$f":"SUBSTITUTE(SpaceIncaps(SUBSTITUTE(SUBSTITUTE(Datos[[#This Row],[Idiomas Oficiales]],\" \",\"\"),\",\",\"\")),\" \",\", \")","v":"Francés, Wolof"}]
["Serbia","SRB",77474,"Belgrado","Serbio","Dinar serbio",null,{"$f":"SUBSTITUTE(SpaceIncaps(SUBSTITUTE(SUBSTITUTE(Datos[[#This Row],[Idiomas Oficiales]],\" \",\"\"),\",\",\"\")),\" \",\", \")","v":"Serbio"}]
["Seychelles","SYC",455,"Victoria","Criollo seychellense FrancésInglés","Rupia seychelenses",null,{"$f":"SUBSTITUTE(SpaceIncaps(SUBSTITUTE(SUBSTITUTE(Datos[[#This Row],[Idiomas Oficiales]],\" \",\"\"),\",\",\"\")),\" \",\", \")","v":"Criolloseychellense, Francés, Inglés"}]
["Sierra Leona","SLE",71740,"Freetown","Inglés","Leone",null,{"$f":"SUBSTITUTE(SpaceIncaps(SUBSTITUTE(SUBSTITUTE(Datos[[#This Row],[Idiomas Oficiales]],\" \",\"\"),\",\",\"\")),\" \",\", \")","v":"Inglés"}]
["Singapur","SGP",697,"Ciudad de Singapur","Inglés","Dólar de Singapur",null,{"$f":"SUBSTITUTE(SpaceIncaps(SUBSTITUTE(SUBSTITUTE(Datos[[#This Row],[Idiomas Oficiales]],\" \",\"\"),\",\",\"\")),\" \",\", \")","v":"Inglés"}]
["Siria","SYR",185180,"Damasco","Árabe","Libra siria",null,{"$f":"SUBSTITUTE(SpaceIncaps(SUBSTITUTE(SUBSTITUTE(Datos[[#This Row],[Idiomas Oficiales]],\" \",\"\"),\",\",\"\")),\" \",\", \")","v":"Árabe"}]
["Socotra",null,3796,"Hadiboh","Árabe","Rial yemení","Gobernación de Yemen",{"$f":"SUBSTITUTE(SpaceIncaps(SUBSTITUTE(SUBSTITUTE(Datos[[#This Row],[Idiomas Oficiales]],\" \",\"\"),\",\",\"\")),\" \",\", \")","v":"Árabe"}]
["Somalia","SOM",637657,"Mogadiscio","Somalí Árabe","Chelín somalí",null,{"$f":"SUBSTITUTE(SpaceIncaps(SUBSTITUTE(SUBSTITUTE(Datos[[#This Row],[Idiomas Oficiales]],\" \",\"\"),\",\",\"\")),\" \",\", \")","v":"Somalí, Árabe"}]
["Somalilandia","SOM",137600,"Hargeisa","Somalí Árabe","Chelín somalilandés",null,{"$f":"SUBSTITUTE(SpaceIncaps(SUBSTITUTE(SUBSTITUTE(Datos[[#This Row],[Idiomas Oficiales]],\" \",\"\"),\",\",\"\")),\" \",\", \")","v":"Somalí, Árabe"}]
["Sri Lanka","LKA",65610,"Sri Jayawardenapura Kotte","Cingalés, Tamil","Rupia de Sri Lanka",null,{"$f":"SUBSTITUTE(SpaceIncaps(SUBSTITUTE(SUBSTITUTE(Datos[[#This Row],[Idiomas Oficiales]],\" \",\"\"),\",\",\"\")),\" \",\", \")","v":"Cingalés, Tamil"}]
["Suazilandia","SWZ",17364,"Mbabane","Suazi Inglés","Lilangeni",null,{"$f":"SUBSTITUTE(SpaceIncaps(SUBSTITUTE(SUBSTITUTE(Datos[[#This Row],[Idiomas Oficiales]],\" \",\"\"),\",\",\"\")),\" \",\", \")","v":"Suazi, Inglés"}]
["Sudáfrica","ZAF",1219090,"Pretoria, Ciudad del Cabo, Bloemfontein","Afrikáans InglésSesothoXhosaZulú","Rand sudafricano",null,{"$f":"SUBSTITUTE(SpaceIncaps(SUBSTITUTE(SUBSTITUTE(Datos[[#This Row],[Idiomas Oficiales]],\" \",\"\"),\",\",\"\")),\" \",\", \")","v":"Afrikáans, Inglés, Sesotho, Xhosa, Zulú"}]
["Sudán","SDN",1861484,"Jartum","Árabe Inglés","Libra sudanesa",null,{"$f":"SUBSTITUTE(SpaceIncaps(SUBSTITUTE(SUBSTITUTE(Datos[[#This Row],[Idiomas Oficiales]],\" \",\"\"),\",\",\"\")),\" \",\", \")","v":"Árabe, Inglés"}]
["Sudán del Sur","SSD",644329,"Yuba","Inglés","Libra sursudanesa",null,{"$f":"SUBSTITUTE(SpaceIncaps(SUBSTITUTE(SUBSTITUTE(Datos[[#This Row],[Idiomas Oficiales]],\" \",\"\"),\",\",\"\")),\" \",\", \")","v":"Inglés"}]
["Suecia","SWE",450295,"Estocolmo","Sueco","Corona sueca",null,{"$f":"SUBSTITUTE(SpaceIncaps(SUBSTITUTE(SUBSTITUTE(Datos[[#This Row],[Idiomas Oficiales]],\" \",\"\"),\",\",\"\")),\" \",\", \")","v":"Sueco"}]
["Suiza","CHE",41277,"Berna","Alemán, Francés, Italiano, Romanche","Franco suizo",null,{"$f":"SUBSTITUTE(SpaceIncaps(SUBSTITUTE(SUBSTITUTE(Datos[[#This Row],[Idiomas Oficiales]],\" \",\"\"),\",\",\"\")),\" \",\", \")","v":"Alemán, Francés, Italiano, Romanche"}]
["Surinam","SUR",163820,"Paramaribo","Neerlandés","Dólar surinamés",null,{"$f":"SUBSTITUTE(SpaceIncaps(SUBSTITUTE(SUBSTITUTE(Datos[[#This Row],[Idiomas Oficiales]],\" \",\"\"),\",\",\"\")),\" \",\", \")","v":"Neerlandés"}]
["Sáhara Occidental","ESH",266000,"El Aaiún (oficialmente), Bir Lehlu (temporal)","Árabe Español","Peseta saharaui",null,{"$f":"SUBSTITUTE(SpaceIncaps(SUBSTITUTE(SUBSTITUTE(Datos[[#This Row],[Idiomas Oficiales]],\" \",\"\"),\",\",\"\")),\" \",\", \")","v":"Árabe, Español"}]
["Tailandia","THA",513120,"Bangkok","Tailandés","Baht tailandés",null,{"$f":"SUBSTITUTE(SpaceIncaps(SUBSTITUTE(SUBSTITUTE(Datos[[#This Row],[Idiomas Oficiales]],\" \",\"\"),\",\",\"\")),\" \",\", \")","v":"Tailandés"}]
["Taiwán","TWN",35980,"Taipéi​","Chino","Nuevo dólar taiwanés",null,{"$f":"SUBSTITUTE(SpaceIncaps(SUBSTITUTE(SUBSTITUTE(Datos[[#This Row],[Idiomas Oficiales]],\" \",\"\"),\",\",\"\")),\" \",\", \")","v":"Chino"}]
["Tanzania","TZA",947300,"Dodoma","Suajili Inglés","Chelín tanzano",null,{"$f":"SUBSTITUTE(SpaceIncaps(SUBSTITUTE(SUBSTITUTE(Datos[[#This Row],[Idiomas Oficiales]],\" \",\"\"),\",\",\"\")),\" \",\", \")","v":"Suajili, Inglés"}]
["Tayikistán","TJK",144100,"Dusambé","Tayiko","Somoni tayiko",null,{"$f":"SUBSTITUTE(SpaceIncaps(SUBSTITUTE(SUBSTITUTE(Datos[[#This Row],[Idiomas Oficiales]],\" \",\"\"),\",\",\"\")),\" \",\", \")","v":"Tayiko"}]
["Territorio Británico del Índico",null,60,null,"Inglés","Dólar estadounidense","Territorio británico de ultramar",{"$f":"SUBSTITUTE(SpaceIncaps(SUBSTITUTE(SUBSTITUTE(Datos[[#This Row],[Idiomas Oficiales]],\" \",\"\"),\",\",\"\")),\" \",\", \")","v":"Inglés"}]
["Tierras Australes Francesas",null,7829,"Saint-Pierre","Francés",null,"Territorio de ultramar de Francia",{"$f":"SUBSTITUTE(SpaceIncaps(SUBSTITUTE(SUBSTITUTE(Datos[[#This Row],[Idiomas Oficiales]],\" \",\"\"),\",\",\"\")),\" \",\", \")","v":"Francés"}]
["Timor Oriental","TLS",14874,"Dili","Portugués, Tetun","Centavos de dólar de Timor Oriental",null,{"$f":"SUBSTITUTE(SpaceIncaps(SUBSTITUTE(SUBSTITUTE(Datos[[#This Row],[Idiomas Oficiales]],\" \",\"\"),\",\",\"\")),\" \",\", \")","v":"Portugués, Tetun"}]
["Togo","TGO",56785,"Lomé","Francés","Franco CFA de África Occidental",null,{"$f":"SUBSTITUTE(SpaceIncaps(SUBSTITUTE(SUBSTITUTE(Datos[[#This Row],[Idiomas Oficiales]],\" \",\"\"),\",\",\"\")),\" \",\", \")","v":"Francés"}]
["Tokelau",null,12,"Atafu","Inglés, Tokelauano","Dólar neozelandés (NZ$, NZD)","Territorio dependiente de Nueva Zelanda",{"$f":"SUBSTITUTE(SpaceIncaps(SUBSTITUTE(SUBSTITUTE(Datos[[#This Row],[Idiomas Oficiales]],\" \",\"\"),\",\",\"\")),\" \",\", \")","v":"Inglés, Tokelauano"}]
["Tonga","TON",747,"Nukualofa","Tongano Inglés","Pa'anga (T$, TOP)",null,{"$f":"SUBSTITUTE(SpaceIncaps(SUBSTITUTE(SUBSTITUTE(Datos[[#This Row],[Idiomas Oficiales]],\" \",\"\"),\",\",\"\")),\" \",\", \")","v":"Tongano, Inglés"}]
["Transnistria","–",4163,"Tiráspol","Ruso, Moldavo, Ucraniano","Rublo transnistrio",null,{"$f":"SUBSTITUTE(SpaceIncaps(SUBSTITUTE(SUBSTITUTE(Datos[[#This Row],[Idiomas Oficiales]],\" \",\"\"),\",\",\"\")),\" \",\", \")","v":"Ruso, Moldavo, Ucraniano"}]
["Trinidad y Tobago","TTO",5128,"Puerto España","Inglés Español","Dólar trinitense",null,{"$f":"SUBSTITUTE(SpaceIncaps(SUBSTITUTE(SUBSTITUTE(Datos[[#This Row],[Idiomas Oficiales]],\" \",\"\"),\",\",\"\")),\" \",\", \")","v":"Inglés, Español"}]
["Turkmenistán","TJK",488100,"Asjabad","Turcomano","Manat turcomano",null,{"$f":"SUBSTITUTE(SpaceIncaps(SUBSTITUTE(SUBSTITUTE(Datos[[#This Row],[Idiomas Oficiales]],\" \",\"\"),\",\",\"\")),\" \",\", \")","v":"Turcomano"}]
["Turquía","TUR",783562,"Ankara","Turco","Lira turca",null,{"$f":"SUBSTITUTE(SpaceIncaps(SUBSTITUTE(SUBSTITUTE(Datos[[#This Row],[Idiomas Oficiales]],\" \",\"\"),\",\",\"\")),\" \",\", \")","v":"Turco"}]
["Tuvalu","TUV",26,"Funafuti","Tuvaluano Inglés","Dólar tuvaluano ($)[2]​ dólar australiano($, AUD)",null,{"$f":"SUBSTITUTE(SpaceIncaps(SUBSTITUTE(SUBSTITUTE(Datos[[#This Row],[Idiomas Oficiales]],\" \",\"\"),\",\",\"\")),\" \",\", \")","v":"Tuvaluano, Inglés"}]
["Túnez","TUN",163610,"Ciudad de Túnez","Árabe Francés","Dinar tunecino",null,{"$f":"SUBSTITUTE(SpaceIncaps(SUBSTITUTE(SUBSTITUTE(Datos[[#This Row],[Idiomas Oficiales]],\" \",\"\"),\",\",\"\")),\" \",\", \")","v":"Árabe, Francés"}]
["Ucrania","UKR",603550,"Kiev","Ucraniano","Grivna",null,{"$f":"SUBSTITUTE(SpaceIncaps(SUBSTITUTE(SUBSTITUTE(Datos[[#This Row],[Idiomas Oficiales]],\" \",\"\"),\",\",\"\")),\" \",\", \")","v":"Ucraniano"}]
["Uganda","UGA",241038,"Kampala","Inglés Suajili","Chelín ugandés",null,{"$f":"SUBSTITUTE(SpaceIncaps(SUBSTITUTE(SUBSTITUTE(Datos[[#This Row],[Idiomas Oficiales]],\" \",\"\"),\",\",\"\")),\" \",\", \")","v":"Inglés, Suajili"}]
["Uruguay","URY",176215,"Montevideo","Español","Peso uruguayo",null,{"$f":"SUBSTITUTE(SpaceIncaps(SUBSTITUTE(SUBSTITUTE(Datos[[#This Row],[Idiomas Oficiales]],\" \",\"\"),\",\",\"\")),\" \",\", \")","v":"Español"}]
["Uzbekistán","UZB",447400,"Taskent","Uzbeko","Som uzbeko",null,{"$f":"SUBSTITUTE(SpaceIncaps(SUBSTITUTE(SUBSTITUTE(Datos[[#This Row],[Idiomas Oficiales]],\" \",\"\"),\",\",\"\")),\" \",\", \")","v":"Uzbeko"}]
["Vanuatu","VUT",12189,"Port Vila","Bislama FrancésInglés","Vatu (Vt, VUV)",null,{"$f":"SUBSTITUTE(SpaceIncaps(SUBSTITUTE(SUBSTITUTE(Datos[[#This Row],[Idiomas Oficiales]],\" \",\"\"),\",\",\"\")),\" \",\", \")","v":"Bislama, Francés, Inglés"}]
["Venezuela","VEN",916445,"Caracas","Español","Bolívar",null,{"$f":"SUBSTITUTE(SpaceIncaps(SUBSTITUTE(SUBSTITUTE(Datos[[#This Row],[Idiomas Oficiales]],\" \",\"\"),\",\",\"\")),\" \",\", \")","v":"Español"}]
["Vietnam","VNM",331210,"Hanói","Vietnamita","Đồng vietnamita",null,{"$f":"SUBSTITUTE(SpaceIncaps(SUBSTITUTE(SUBSTITUTE(Datos[[#This Row],[Idiomas Oficiales]],\" \",\"\"),\",\",\"\")),\" \",\", \")","v":"Vietnamita"}]
["Wallis y Futuna",null,142,"Mata-Utu","Francés Walisiano","Franco CFP (F, XPF)","Colectividad de ultramar de Francia​",{"$f":"SUBSTITUTE(SpaceIncaps(SUBSTITUTE(SUBSTITUTE(Datos[[#This Row],[Idiomas Oficiales]],\" \",\"\"),\",\",\"\")),\" \",\", \")","v":"Francés, Walisiano"}]
["Yemen","YEM",527968,"Saná","Árabe","Rial yemení",null,{"$f":"SUBSTITUTE(SpaceIncaps(SUBSTITUTE(SUBSTITUTE(Datos[[#This Row],[Idiomas Oficiales]],\" \",\"\"),\",\",\"\")),\" \",\", \")","v":"Árabe"}]
["Yibuti","DJI",23200,"Ciudad de Yibuti","Árabe Francés","Franco yibutiano",null,{"$f":"SUBSTITUTE(SpaceIncaps(SUBSTITUTE(SUBSTITUTE(Datos[[#This Row],[Idiomas Oficiales]],\" \",\"\"),\",\",\"\")),\" \",\", \")","v":"Árabe, Francés"}]
["Zambia","ZMB",752618,"Lusaka","Inglés","Kwacha zambiano",null,{"$f":"SUBSTITUTE(SpaceIncaps(SUBSTITUTE(SUBSTITUTE(Datos[[#This Row],[Idiomas Oficiales]],\" \",\"\"),\",\",\"\")),\" \",\", \")","v":"Inglés"}]
["Zimbabue","ZWE",390757,"Harare","Inglés, Shona","Dólar zimbabuense",null,{"$f":"SUBSTITUTE(SpaceIncaps(SUBSTITUTE(SUBSTITUTE(Datos[[#This Row],[Idiomas Oficiales]],\" \",\"\"),\",\",\"\")),\" \",\", \")","v":"Inglés, Shona"}]
["Åland",null,13517,"Mariehamn","Sueco","Euro","Región autónoma de Finlandia",{"$f":"SUBSTITUTE(SpaceIncaps(SUBSTITUTE(SUBSTITUTE(Datos[[#This Row],[Idiomas Oficiales]],\" \",\"\"),\",\",\"\")),\" \",\", \")","v":"Sueco"}]