{"text_format":"1","workbook":"xlsx","n_sheets":8,"sheets":["Mapa","Información","Fronteras","Banderas","Países","Nombres","Population","Datos"],"not_rendered":{"charts":0,"images":252,"macros":1,"external_links":0,"defined_names":27,"comments":0,"pivot_tables":0},"unopened":[],"bounds":{"document_bytes":16777216,"sheet_cells":100000,"rows_first":2000,"rows_last":500,"rows_between":2000,"halvings":0,"cell_chars":16384,"cell_head_chars":4096},"cells_cut":0,"cells_raw":0,"read":"whole","date_system":"1900"}

{"sheet":"Mapa","index":0,"n_rows":23,"n_cols":2,"rows_kept":23,"cut":false,"hidden":false,"merged":[]}
[]
[]
[]
[]
[]
[]
[]
[]
[]
[]
{"$rows_left_out":14}
{"sheet":"Información","index":1,"n_rows":20,"n_cols":11,"rows_kept":20,"cut":false,"hidden":false,"merged":[[8,1,9,6],[10,1,11,6],[12,1,13,6],[1,1,2,6],[3,1,4,6],[5,1,5,6],[6,1,6,6],[7,1,7,6]]}
[null,null,null,null,null,null,null,"Y"]
[null,{"$f":"IF(ISNUMBER(miPaís),\nHYPERLINK(\"https://es.wikipedia.org/wiki/\" & IF(miSelección=\"\",\"Anexo:Países\",LEFT(miSelección,IFERROR(FIND(\" - \",miSelección)-1,LEN(miSelección)))),IF(miSelección=\"\",\"Seleccionar algún país\",miSelección&\"\")),\nHYPERLINK(\"https://es.wikipedia.org/wiki/\" & IF(miPaís=\"\",\"Anexo:Países\",LEFT(miPaís,IFERROR(FIND(\" - \",miPaís)-1,LEN(miPaís)))),IF(miPaís=\"\",\"Seleccionar algún país\",miPaís&\"\")))","v":"Seleccionar algún país"},null,null,null,null,null,1,null,"Blog:","Puntero al mapa de África | #ExcelPedroWave"]
[null,null,null,null,null,null,null,2,null,"YouTube:","Excel Pedro Wave"]
[null,{"$f":"IF(miSelección=\"\",\"\",IFERROR(INDEX(TablaPaíses[Nombre oficial],miFilaPaíses),\"\"))","v":""},null,null,null,null,null,3,null,"Copyright:","Creative Commons 3.0"]
[null,null,null,null,null,null,null,4,null,"Población:","Countries by population (countrymeters.info)"]
[null,{"$f":"IF(miSelección=\"\",\"\",IFERROR(\"Capital: \"&INDEX(Datos[Capital],miFilaDatos)&\"\",\"\"))","v":""},null,null,null,null,null,5,null,"Wikipedia:","Anexo:Países - Wikipedia"]
[null,{"$f":"IF(miSelección=\"\",\"\",IFERROR(INDEX(TablaPaíses[Población],miFilaPaíses),\"\"))","v":""},null,null,null,null,null,6]
[null,{"$f":"IF(miSelección=\"\",\"\",IFERROR(INDEX(Datos[Superficie (km²)],miFilaDatos),\"\"))","v":""},null,null,null,null,null,7,null,"URL:","https://es.wikipedia.org/wiki/Riyal saudí"]
[null,{"$f":"IF(miSelección=\"\",\"\",IFERROR(\"Idiomas: \" & INDEX(Datos[Idiomas],miFilaDatos),\"\"))","v":""},null,null,null,null,null,8]
[null,null,null,null,null,null,null,9]
{"$rows_left_out":11}
{"sheet":"Fronteras","index":2,"n_rows":245,"n_cols":9,"rows_kept":245,"cut":false,"hidden":false,"merged":[]}
["Frontera","X","Y","Ancho","Alto","Centro X","Centro Y","Distancia","Fila"]
["Puerto Rico",216.86236572265625,155.72488403320313,3.3807086944580078,1.4342520236968994,{"$f":"TablaFronteras[[#This Row],[X]]+TablaFronteras[[#This Row],[Ancho]]/2","v":218.55272006988525},{"$f":"TablaFronteras[[#This Row],[Y]]+TablaFronteras[[#This Row],[Alto]]/2","v":156.44201004505157},{"$f":"IF(AND(TablaFronteras[[#This Row],[Fila]]<>\"\",TablaFronteras[[#This Row],[X]]<miX,miX<TablaFronteras[[#This Row],[X]]+TablaFronteras[[#This Row],[Ancho]],TablaFronteras[[#This Row],[Y]]<miY,miY<TablaFronteras[[#This Row],[Y]]+TablaFronteras[[#This Row],[Alto]]),SQRT((TablaFronteras[[#This Row],[Centro X]]-miX)^2+(TablaFronteras[[#This Row],[Centro Y]]-miY)^2),\"\")","v":""},{"$f":"IF(TablaFronteras[[#This Row],[Frontera]]=\"\",\"\",IFERROR(MATCH(RIGHT(TablaFronteras[[#This Row],[Frontera]],LEN(TablaFronteras[[#This Row],[Frontera]])-IFERROR(FIND(\" - \",TablaFronteras[[#This Row],[Frontera]])+2,0)),Datos[País],0),\"\"))","v":206}]
["Jamaica",194.09747314453125,155.79063415527344,2.9575591087341309,1.8966141939163208,{"$f":"TablaFronteras[[#This Row],[X]]+TablaFronteras[[#This Row],[Ancho]]/2","v":195.57625269889832},{"$f":"TablaFronteras[[#This Row],[Y]]+TablaFronteras[[#This Row],[Alto]]/2","v":156.7389412522316},{"$f":"IF(AND(TablaFronteras[[#This Row],[Fila]]<>\"\",TablaFronteras[[#This Row],[X]]<miX,miX<TablaFronteras[[#This Row],[X]]+TablaFronteras[[#This Row],[Ancho]],TablaFronteras[[#This Row],[Y]]<miY,miY<TablaFronteras[[#This Row],[Y]]+TablaFronteras[[#This Row],[Alto]]),SQRT((TablaFronteras[[#This Row],[Centro X]]-miX)^2+(TablaFronteras[[#This Row],[Centro Y]]-miY)^2),\"\")","v":""},{"$f":"IF(TablaFronteras[[#This Row],[Frontera]]=\"\",\"\",IFERROR(MATCH(RIGHT(TablaFronteras[[#This Row],[Frontera]],LEN(TablaFronteras[[#This Row],[Frontera]])-IFERROR(FIND(\" - \",TablaFronteras[[#This Row],[Frontera]])+2,0)),Datos[País],0),\"\"))","v":136}]
["Tierras Australes Francesas",481.12686157226563,317.83441162109375,3.7777953147888184,2.4828345775604248,{"$f":"TablaFronteras[[#This Row],[X]]+TablaFronteras[[#This Row],[Ancho]]/2","v":483.01575922966003},{"$f":"TablaFronteras[[#This Row],[Y]]+TablaFronteras[[#This Row],[Alto]]/2","v":319.07582890987396},{"$f":"IF(AND(TablaFronteras[[#This Row],[Fila]]<>\"\",TablaFronteras[[#This Row],[X]]<miX,miX<TablaFronteras[[#This Row],[X]]+TablaFronteras[[#This Row],[Ancho]],TablaFronteras[[#This Row],[Y]]<miY,miY<TablaFronteras[[#This Row],[Y]]+TablaFronteras[[#This Row],[Alto]]),SQRT((TablaFronteras[[#This Row],[Centro X]]-miX)^2+(TablaFronteras[[#This Row],[Centro Y]]-miY)^2),\"\")","v":""},{"$f":"IF(TablaFronteras[[#This Row],[Frontera]]=\"\",\"\",IFERROR(MATCH(RIGHT(TablaFronteras[[#This Row],[Frontera]],LEN(TablaFronteras[[#This Row],[Frontera]])-IFERROR(FIND(\" - \",TablaFronteras[[#This Row],[Frontera]])+2,0)),Datos[País],0),\"\"))","v":254}]
["República Democrática del Congo",379.25393676757813,187.63275146484375,40.270393371582031,45.514724731445313,{"$f":"TablaFronteras[[#This Row],[X]]+TablaFronteras[[#This Row],[Ancho]]/2","v":399.38913345336914},{"$f":"TablaFronteras[[#This Row],[Y]]+TablaFronteras[[#This Row],[Alto]]/2","v":210.39011383056641},{"$f":"IF(AND(TablaFronteras[[#This Row],[Fila]]<>\"\",TablaFronteras[[#This Row],[X]]<miX,miX<TablaFronteras[[#This Row],[X]]+TablaFronteras[[#This Row],[Ancho]],TablaFronteras[[#This Row],[Y]]<miY,miY<TablaFronteras[[#This Row],[Y]]+TablaFronteras[[#This Row],[Alto]]),SQRT((TablaFronteras[[#This Row],[Centro X]]-miX)^2+(TablaFronteras[[#This Row],[Centro Y]]-miY)^2),\"\")","v":""},{"$f":"IF(TablaFronteras[[#This Row],[Frontera]]=\"\",\"\",IFERROR(MATCH(RIGHT(TablaFronteras[[#This Row],[Frontera]],LEN(TablaFronteras[[#This Row],[Frontera]])-IFERROR(FIND(\" - \",TablaFronteras[[#This Row],[Frontera]])+2,0)),Datos[País],0),\"\"))","v":210}]
["República del Congo",376.98291015625,191.55361938476563,16.19354248046875,21.199132919311523,{"$f":"TablaFronteras[[#This Row],[X]]+TablaFronteras[[#This Row],[Ancho]]/2","v":385.07968139648438},{"$f":"TablaFronteras[[#This Row],[Y]]+TablaFronteras[[#This Row],[Alto]]/2","v":202.15318584442139},{"$f":"IF(AND(TablaFronteras[[#This Row],[Fila]]<>\"\",TablaFronteras[[#This Row],[X]]<miX,miX<TablaFronteras[[#This Row],[X]]+TablaFronteras[[#This Row],[Ancho]],TablaFronteras[[#This Row],[Y]]<miY,miY<TablaFronteras[[#This Row],[Y]]+TablaFronteras[[#This Row],[Alto]]),SQRT((TablaFronteras[[#This Row],[Centro X]]-miX)^2+(TablaFronteras[[#This Row],[Centro Y]]-miY)^2),\"\")","v":""},{"$f":"IF(TablaFronteras[[#This Row],[Frontera]]=\"\",\"\",IFERROR(MATCH(RIGHT(TablaFronteras[[#This Row],[Frontera]],LEN(TablaFronteras[[#This Row],[Frontera]])-IFERROR(FIND(\" - \",TablaFronteras[[#This Row],[Frontera]])+2,0)),Datos[País],0),\"\"))","v":212}]
["Senegal",318.58865356445313,160.14189147949219,11.973149299621582,10.630393981933594,{"$f":"TablaFronteras[[#This Row],[X]]+TablaFronteras[[#This Row],[Ancho]]/2","v":324.57522821426392},{"$f":"TablaFronteras[[#This Row],[Y]]+TablaFronteras[[#This Row],[Alto]]/2","v":165.45708847045898},{"$f":"IF(AND(TablaFronteras[[#This Row],[Fila]]<>\"\",TablaFronteras[[#This Row],[X]]<miX,miX<TablaFronteras[[#This Row],[X]]+TablaFronteras[[#This Row],[Ancho]],TablaFronteras[[#This Row],[Y]]<miY,miY<TablaFronteras[[#This Row],[Y]]+TablaFronteras[[#This Row],[Alto]]),SQRT((TablaFronteras[[#This Row],[Centro X]]-miX)^2+(TablaFronteras[[#This Row],[Centro Y]]-miY)^2),\"\")","v":""},{"$f":"IF(TablaFronteras[[#This Row],[Frontera]]=\"\",\"\",IFERROR(MATCH(RIGHT(TablaFronteras[[#This Row],[Frontera]],LEN(TablaFronteras[[#This Row],[Frontera]])-IFERROR(FIND(\" - \",TablaFronteras[[#This Row],[Frontera]])+2,0)),Datos[País],0),\"\"))","v":231}]
["Albania",392.8946533203125,97.579292297363281,3.4942519664764404,7.0337009429931641,{"$f":"TablaFronteras[[#This Row],[X]]+TablaFronteras[[#This Row],[Ancho]]/2","v":394.64177930355072},{"$f":"TablaFronteras[[#This Row],[Y]]+TablaFronteras[[#This Row],[Alto]]/2","v":101.09614276885986},{"$f":"IF(AND(TablaFronteras[[#This Row],[Fila]]<>\"\",TablaFronteras[[#This Row],[X]]<miX,miX<TablaFronteras[[#This Row],[X]]+TablaFronteras[[#This Row],[Ancho]],TablaFronteras[[#This Row],[Y]]<miY,miY<TablaFronteras[[#This Row],[Y]]+TablaFronteras[[#This Row],[Alto]]),SQRT((TablaFronteras[[#This Row],[Centro X]]-miX)^2+(TablaFronteras[[#This Row],[Centro Y]]-miY)^2),\"\")","v":""},{"$f":"IF(TablaFronteras[[#This Row],[Frontera]]=\"\",\"\",IFERROR(MATCH(RIGHT(TablaFronteras[[#This Row],[Frontera]],LEN(TablaFronteras[[#This Row],[Frontera]])-IFERROR(FIND(\" - \",TablaFronteras[[#This Row],[Frontera]])+2,0)),Datos[País],0),\"\"))","v":4}]
["Bulgaria",397.05166625976563,93.865745544433594,12.942598342895508,6.9964566230773926,{"$f":"TablaFronteras[[#This Row],[X]]+TablaFronteras[[#This Row],[Ancho]]/2","v":403.52296543121338},{"$f":"TablaFronteras[[#This Row],[Y]]+TablaFronteras[[#This Row],[Alto]]/2","v":97.36397385597229},{"$f":"IF(AND(TablaFronteras[[#This Row],[Fila]]<>\"\",TablaFronteras[[#This Row],[X]]<miX,miX<TablaFronteras[[#This Row],[X]]+TablaFronteras[[#This Row],[Ancho]],TablaFronteras[[#This Row],[Y]]<miY,miY<TablaFronteras[[#This Row],[Y]]+TablaFronteras[[#This Row],[Alto]]),SQRT((TablaFronteras[[#This Row],[Centro X]]-miX)^2+(TablaFronteras[[#This Row],[Centro Y]]-miY)^2),\"\")","v":""},{"$f":"IF(TablaFronteras[[#This Row],[Frontera]]=\"\",\"\",IFERROR(MATCH(RIGHT(TablaFronteras[[#This Row],[Frontera]],LEN(TablaFronteras[[#This Row],[Frontera]])-IFERROR(FIND(\" - \",TablaFronteras[[#This Row],[Frontera]])+2,0)),Datos[País],0),\"\"))","v":39}]
["Noruega",348.111328125,16.852361679077148,58.001968383789063,45.125747680664063,{"$f":"TablaFronteras[[#This Row],[X]]+TablaFronteras[[#This Row],[Ancho]]/2","v":377.11231231689453},{"$f":"TablaFronteras[[#This Row],[Y]]+TablaFronteras[[#This Row],[Alto]]/2","v":39.41523551940918},{"$f":"IF(AND(TablaFronteras[[#This Row],[Fila]]<>\"\",TablaFronteras[[#This Row],[X]]<miX,miX<TablaFronteras[[#This Row],[X]]+TablaFronteras[[#This Row],[Ancho]],TablaFronteras[[#This Row],[Y]]<miY,miY<TablaFronteras[[#This Row],[Y]]+TablaFronteras[[#This Row],[Alto]]),SQRT((TablaFronteras[[#This Row],[Centro X]]-miX)^2+(TablaFronteras[[#This Row],[Centro Y]]-miY)^2),\"\")","v":""},{"$f":"IF(TablaFronteras[[#This Row],[Frontera]]=\"\",\"\",IFERROR(MATCH(RIGHT(TablaFronteras[[#This Row],[Frontera]],LEN(TablaFronteras[[#This Row],[Frontera]])-IFERROR(FIND(\" - \",TablaFronteras[[#This Row],[Frontera]])+2,0)),Datos[País],0),\"\"))","v":184}]
{"$rows_left_out":236}
{"sheet":"Banderas","index":3,"n_rows":251,"n_cols":6,"rows_kept":251,"cut":false,"hidden":false,"merged":[]}
["Continente","País","Código","Bandera"]
["Asia","Afganistán","af",null,null,{"$f":"MATCH(TablaBanderas[[#This Row],[País]],Fronteras!$A:$A,0)","v":111}]
["Europa","Albania","al",null,null,{"$f":"MATCH(TablaBanderas[[#This Row],[País]],Fronteras!$A:$A,0)","v":8}]
["Europa","Alemania","de",null,null,{"$f":"MATCH(TablaBanderas[[#This Row],[País]],Fronteras!$A:$A,0)","v":32}]
["Europa","Andorra","ad",null,null,{"$f":"MATCH(TablaBanderas[[#This Row],[País]],Fronteras!$A:$A,0)","v":198}]
["África","Angola","ao",null,null,{"$f":"MATCH(TablaBanderas[[#This Row],[País]],Fronteras!$A:$A,0)","v":92}]
["América del Norte","Anguila","ai",null,null,{"$f":"MATCH(TablaBanderas[[#This Row],[País]],Fronteras!$A:$A,0)","v":216}]
["Antártida","Antártida","aq",null,null,{"$f":"MATCH(TablaBanderas[[#This Row],[País]],Fronteras!$A:$A,0)","v":{"$error":"#N/A"}}]
["América del Norte","Antigua y Barbuda","ag",null,null,{"$f":"MATCH(TablaBanderas[[#This Row],[País]],Fronteras!$A:$A,0)","v":164}]
["Asia","Arabia Saudita","sa",null,null,{"$f":"MATCH(TablaBanderas[[#This Row],[País]],Fronteras!$A:$A,0)","v":133}]
{"$rows_left_out":242}
{"sheet":"Países","index":4,"n_rows":233,"n_cols":6,"rows_kept":233,"cut":false,"hidden":false,"merged":[]}
["Continente","País","Nombre corto","Nombre oficial","Country","Población"]
["Asia","Afganistán",null,{"$f":"IFERROR(VLOOKUP(TablaPaíses[[#This Row],[País]],Nombres[],2,FALSE),IFERROR(VLOOKUP(\"*\"&TablaPaíses[[#This Row],[Country]]&\"*\",Nombres[],2,FALSE),IFERROR(VLOOKUP(TablaPaíses[[#This Row],[Nombre corto]],Nombres[],2,FALSE),IF(TablaPaíses[[#This Row],[Nombre corto]]<>\"\",TablaPaíses[[#This Row],[Nombre corto]],TablaPaíses[[#This Row],[País]]&\"*\"))))","v":"República Islámica de Afganistán"},"Afghanistan",{"$f":"IFERROR(VLOOKUP(TablaPaíses[[#This Row],[Country]],Population[],2,FALSE),\"\")","v":43214221}]
["Europa","Albania",null,{"$f":"IFERROR(VLOOKUP(TablaPaíses[[#This Row],[País]],Nombres[],2,FALSE),IFERROR(VLOOKUP(\"*\"&TablaPaíses[[#This Row],[Country]]&\"*\",Nombres[],2,FALSE),IFERROR(VLOOKUP(TablaPaíses[[#This Row],[Nombre corto]],Nombres[],2,FALSE),IF(TablaPaíses[[#This Row],[Nombre corto]]<>\"\",TablaPaíses[[#This Row],[Nombre corto]],TablaPaíses[[#This Row],[País]]&\"*\"))))","v":"República de Albania"},"Albania",{"$f":"IFERROR(VLOOKUP(TablaPaíses[[#This Row],[Country]],Population[],2,FALSE),\"\")","v":2875314}]
["Europa","Alemania",null,{"$f":"IFERROR(VLOOKUP(TablaPaíses[[#This Row],[País]],Nombres[],2,FALSE),IFERROR(VLOOKUP(\"*\"&TablaPaíses[[#This Row],[Country]]&\"*\",Nombres[],2,FALSE),IFERROR(VLOOKUP(TablaPaíses[[#This Row],[Nombre corto]],Nombres[],2,FALSE),IF(TablaPaíses[[#This Row],[Nombre corto]]<>\"\",TablaPaíses[[#This Row],[Nombre corto]],TablaPaíses[[#This Row],[País]]&\"*\"))))","v":"República Federal de Alemania"},"Germany",{"$f":"IFERROR(VLOOKUP(TablaPaíses[[#This Row],[Country]],Population[],2,FALSE),\"\")","v":83856583}]
["África","Argelia",null,{"$f":"IFERROR(VLOOKUP(TablaPaíses[[#This Row],[País]],Nombres[],2,FALSE),IFERROR(VLOOKUP(\"*\"&TablaPaíses[[#This Row],[Country]]&\"*\",Nombres[],2,FALSE),IFERROR(VLOOKUP(TablaPaíses[[#This Row],[Nombre corto]],Nombres[],2,FALSE),IF(TablaPaíses[[#This Row],[Nombre corto]]<>\"\",TablaPaíses[[#This Row],[Nombre corto]],TablaPaíses[[#This Row],[País]]&\"*\"))))","v":"República Argelina Democrática y Popular"},"Algeria",{"$f":"IFERROR(VLOOKUP(TablaPaíses[[#This Row],[Country]],Population[],2,FALSE),\"\")","v":46790907}]
["Europa","Andorra",null,{"$f":"IFERROR(VLOOKUP(TablaPaíses[[#This Row],[País]],Nombres[],2,FALSE),IFERROR(VLOOKUP(\"*\"&TablaPaíses[[#This Row],[Country]]&\"*\",Nombres[],2,FALSE),IFERROR(VLOOKUP(TablaPaíses[[#This Row],[Nombre corto]],Nombres[],2,FALSE),IF(TablaPaíses[[#This Row],[Nombre corto]]<>\"\",TablaPaíses[[#This Row],[Nombre corto]],TablaPaíses[[#This Row],[País]]&\"*\"))))","v":"Principado de Andorra"},"Andorra",{"$f":"IFERROR(VLOOKUP(TablaPaíses[[#This Row],[Country]],Population[],2,FALSE),\"\")","v":78206}]
["África","Angola",null,{"$f":"IFERROR(VLOOKUP(TablaPaíses[[#This Row],[País]],Nombres[],2,FALSE),IFERROR(VLOOKUP(\"*\"&TablaPaíses[[#This Row],[Country]]&\"*\",Nombres[],2,FALSE),IFERROR(VLOOKUP(TablaPaíses[[#This Row],[Nombre corto]],Nombres[],2,FALSE),IF(TablaPaíses[[#This Row],[Nombre corto]]<>\"\",TablaPaíses[[#This Row],[Nombre corto]],TablaPaíses[[#This Row],[País]]&\"*\"))))","v":"República de Angola"},"Angola",{"$f":"IFERROR(VLOOKUP(TablaPaíses[[#This Row],[Country]],Population[],2,FALSE),\"\")","v":36693743}]
["Asia","Arabia Saudita","Arabia Saudí",{"$f":"IFERROR(VLOOKUP(TablaPaíses[[#This Row],[País]],Nombres[],2,FALSE),IFERROR(VLOOKUP(\"*\"&TablaPaíses[[#This Row],[Country]]&\"*\",Nombres[],2,FALSE),IFERROR(VLOOKUP(TablaPaíses[[#This Row],[Nombre corto]],Nombres[],2,FALSE),IF(TablaPaíses[[#This Row],[Nombre corto]]<>\"\",TablaPaíses[[#This Row],[Nombre corto]],TablaPaíses[[#This Row],[País]]&\"*\"))))","v":"Reino de Arabia Saudí"},"Saudi Arabia",{"$f":"IFERROR(VLOOKUP(TablaPaíses[[#This Row],[Country]],Population[],2,FALSE),\"\")","v":37761185}]
["América del Sur","Argentina",null,{"$f":"IFERROR(VLOOKUP(TablaPaíses[[#This Row],[País]],Nombres[],2,FALSE),IFERROR(VLOOKUP(\"*\"&TablaPaíses[[#This Row],[Country]]&\"*\",Nombres[],2,FALSE),IFERROR(VLOOKUP(TablaPaíses[[#This Row],[Nombre corto]],Nombres[],2,FALSE),IF(TablaPaíses[[#This Row],[Nombre corto]]<>\"\",TablaPaíses[[#This Row],[Nombre corto]],TablaPaíses[[#This Row],[País]]&\"*\"))))","v":"República Argentina"},"Argentina",{"$f":"IFERROR(VLOOKUP(TablaPaíses[[#This Row],[Country]],Population[],2,FALSE),\"\")","v":46833332}]
["Asia","Armenia",null,{"$f":"IFERROR(VLOOKUP(TablaPaíses[[#This Row],[País]],Nombres[],2,FALSE),IFERROR(VLOOKUP(\"*\"&TablaPaíses[[#This Row],[Country]]&\"*\",Nombres[],2,FALSE),IFERROR(VLOOKUP(TablaPaíses[[#This Row],[Nombre corto]],Nombres[],2,FALSE),IF(TablaPaíses[[#This Row],[Nombre corto]]<>\"\",TablaPaíses[[#This Row],[Nombre corto]],TablaPaíses[[#This Row],[País]]&\"*\"))))","v":"República de Armenia"},"Armenia",{"$f":"IFERROR(VLOOKUP(TablaPaíses[[#This Row],[Country]],Population[],2,FALSE),\"\")","v":3002557}]
{"$rows_left_out":224}
{"sheet":"Nombres","index":5,"n_rows":195,"n_cols":2,"rows_kept":195,"cut":false,"hidden":false,"merged":[]}
["País","Nombre oficial"]
["Afganistán","República Islámica de Afganistán"]
["Albania","República de Albania"]
["Alemania","República Federal de Alemania"]
["Andorra","Principado de Andorra"]
["Angola","República de Angola"]
["Antigua y Barbuda","Antigua y Barbuda"]
["Arabia Saudí","Reino de Arabia Saudí"]
["Argelia","República Argelina Democrática y Popular"]
["Argentina","República Argentina"]
{"$rows_left_out":186}
{"sheet":"Population","index":6,"n_rows":231,"n_cols":2,"rows_kept":231,"cut":false,"hidden":false,"merged":[]}
["Country","Population"]
["Afghanistan",43214221]
["Albania",2875314]
["Algeria",46790907]
["American Samoa",57905]
["Andorra",78206]
["Angola",36693743]
["Anguilla",16242]
["Antigua and Barbuda",101471]
["Argentina",46833332]
{"$rows_left_out":222}
{"sheet":"Datos","index":7,"n_rows":278,"n_cols":8,"rows_kept":278,"cut":false,"hidden":false,"merged":[]}
["País","Código ISO 3166-1","Superficie (km²)","Capital","Idiomas Oficiales","Monedas","Estatus","Idiomas"]
["Abjasia","ABH",8432,"Sujumi","Abjasio, Ruso","Apsar",null,{"$f":"SUBSTITUTE(SpaceIncaps(SUBSTITUTE(SUBSTITUTE(Datos[[#This Row],[Idiomas Oficiales]],\" \",\"\"),\",\",\"\")),\" \",\", \")","v":"Abjasio, Ruso"}]
["Acrotiri y Dhekelia",null,123,"Episkopí","Inglés","Euro","Bases Soberanas",{"$f":"SUBSTITUTE(SpaceIncaps(SUBSTITUTE(SUBSTITUTE(Datos[[#This Row],[Idiomas Oficiales]],\" \",\"\"),\",\",\"\")),\" \",\", \")","v":"Inglés"}]
["Afganistán","AFG",652230,"Kabul","Pastún Persa darí","Afgani afgano",null,{"$f":"SUBSTITUTE(SpaceIncaps(SUBSTITUTE(SUBSTITUTE(Datos[[#This Row],[Idiomas Oficiales]],\" \",\"\"),\",\",\"\")),\" \",\", \")","v":"Pastún, Persadarí"}]
["Albania","ALB",28748,"Tirana","Albanés","Lek albanés",null,{"$f":"SUBSTITUTE(SpaceIncaps(SUBSTITUTE(SUBSTITUTE(Datos[[#This Row],[Idiomas Oficiales]],\" \",\"\"),\",\",\"\")),\" \",\", \")","v":"Albanés"}]
["Alemania","DEU",357022,"Berlín","Alemán","Euro",null,{"$f":"SUBSTITUTE(SpaceIncaps(SUBSTITUTE(SUBSTITUTE(Datos[[#This Row],[Idiomas Oficiales]],\" \",\"\"),\",\",\"\")),\" \",\", \")","v":"Alemán"}]
["Andorra","AND",468,"Andorra la Vieja","Catalán Francés Español Portugués","Euro​",null,{"$f":"SUBSTITUTE(SpaceIncaps(SUBSTITUTE(SUBSTITUTE(Datos[[#This Row],[Idiomas Oficiales]],\" \",\"\"),\",\",\"\")),\" \",\", \")","v":"Catalán, Francés, Español, Portugués"}]
["Angola","AGO",1246702,"Luanda","Portugués KikongoChokweUmbundu","Kwanza",null,{"$f":"SUBSTITUTE(SpaceIncaps(SUBSTITUTE(SUBSTITUTE(Datos[[#This Row],[Idiomas Oficiales]],\" \",\"\"),\",\",\"\")),\" \",\", \")","v":"Portugués, Kikongo, Chokwe, Umbundu"}]
["Anguila",null,91,"The Valley","Inglés","Dólar del Caribe-Este","Territorio británico de ultramar",{"$f":"SUBSTITUTE(SpaceIncaps(SUBSTITUTE(SUBSTITUTE(Datos[[#This Row],[Idiomas Oficiales]],\" \",\"\"),\",\",\"\")),\" \",\", \")","v":"Inglés"}]
["Antigua y Barbuda","ATG",442,"Saint John","Inglés","Dólar del Caribe-Este",null,{"$f":"SUBSTITUTE(SpaceIncaps(SUBSTITUTE(SUBSTITUTE(Datos[[#This Row],[Idiomas Oficiales]],\" \",\"\"),\",\",\"\")),\" \",\", \")","v":"Inglés"}]
{"$rows_left_out":268}