{"text_format":"1","workbook":"xlsx","n_sheets":14,"sheets":["Calc","ANSI","Idiomas","Cod","Teclado","Teclas0","Teclas1","Teclas2","Teclas3","Teclas4","Teclas5","Teclas6","Teclas7","Teclas8"],"not_rendered":{"charts":0,"images":1,"macros":1,"external_links":0,"defined_names":35,"comments":0,"pivot_tables":0},"unopened":[],"bounds":{"document_bytes":16777216,"sheet_cells":100000,"rows_first":2000,"rows_last":500,"rows_between":2000,"halvings":0,"cell_chars":16384,"cell_head_chars":4096},"cells_cut":0,"cells_raw":0,"read":"whole","date_system":"1900"}

{"sheet":"Calc","index":0,"n_rows":103,"n_cols":104,"rows_kept":103,"cut":false,"hidden":false,"merged":[[32,5,32,15],[40,5,40,15],[12,5,12,15],[14,5,14,15],[23,5,23,15],[13,5,13,15],[39,5,39,15],[38,5,38,15],[46,77,46,88],[48,77,48,88],[14,40,14,54],[15,5,15,15],[16,5,16,15],[17,5,17,15],[25,5,25,15],[18,5,18,15],[19,5,19,15],[20,5,20,15],[21,5,21,15],[22,5,22,15],[29,5,29,15],[24,5,24,15],[31,5,31,15],[47,77,47,88],[12,42,12,49],[12,58,12,73],[47,64,47,70],[33,5,33,15],[26,5,26,15],[34,5,34,15],[41,5,41,15],[35,5,35,15],[27,5,27,15],[28,5,28,15],[30,5,30,15],[42,5,42,15],[43,5,43,15],[44,5,44,15],[36,5,36,15],[37,5,37,15]]}
[null,null,null,null,null,null,null,null,null,null,null,null,null,null,null,null,null,null,null,null,0,null,null,null,null,null,null,null,null,null,null,null,null,null,null,null,null,null,null,null,null,null,null,null,null,null,null,null,null,null,null,null,null,null,null,null,null,null,null,null,null,null,null,null,null,null,null,null,null,null,null,null,null,null,null,null,null,null,null,null,null,null,null,null,null,null,null,null,null,null,null,null,null,null,null,null,null,null,null,null,null," "]
[null,null,null,null,null,null,null,null,null,null,null,null,null,null,null,null,null,null,null,null,null,null,null,null,null,null,null,null,null,null,null,null,null,null,null,null,null,null,null,null,null,null,null,null,null,null,null,null,null,null,null,null,null,null,null,null,null,null,null,null,null,null,null,null,null,null,null,null,null,null,null,null,null,null,null,null,null,null,null,null,null,null,null,null,null,null,null,null,null,null,null,null,null,null,null,null,null,null,null,null,"TeclaGP"," "]
[null,null,null,null,null,null,null,null,null,null,null,null,null,null,null,null,null,null,null,null,null,null,null,null,null,null,null,null,null,null,null,null,null,null,null,null,null,null,null,null,null,null,null,null,null,null,null,null,null,null,null,null,null,null,null,null,null,null,null,null,null,null,null,null,null,null,null,null,null,null,null,null,null,null,null,null,null,null,null,null,null,null,null,null,null,null,null,null,null,null,null,null,null,null,null,null,null,null,null,null,"TeclaRP"," "]
[null,null,null,null,{"$f":"VLOOKUP(CODE(E11),segmentos,2,FALSE)","v":0},null,null,null,null,null,{"$f":"VLOOKUP(CODE(K11),segmentos,2,FALSE)","v":0},null,null,null,null,null,{"$f":"VLOOKUP(CODE(Q11),segmentos,2,FALSE)","v":0},null,null,null,null,null,{"$f":"VLOOKUP(CODE(W11),segmentos,2,FALSE)","v":0},null,null,null,null,null,{"$f":"VLOOKUP(CODE(AC11),segmentos,2,FALSE)","v":0},null,null,null,null,null,{"$f":"VLOOKUP(CODE(AI11),segmentos,2,FALSE)","v":0},null,null,null,null,null,{"$f":"VLOOKUP(CODE(AO11),segmentos,2,FALSE)","v":0},null,null,null,null,null,{"$f":"VLOOKUP(CODE(AU11),segmentos,2,FALSE)","v":0},null,null,null,null,null,{"$f":"VLOOKUP(CODE(BA11),segmentos,2,FALSE)","v":0},null,null,null,null,null,{"$f":"VLOOKUP(CODE(BG11),segmentos,2,FALSE)","v":0},null,null,null,null,null,{"$f":"VLOOKUP(CODE(BM11),segmentos,2,FALSE)","v":0},null,null,null,null,null,{"$f":"VLOOKUP(CODE(BS11),segmentos,2,FALSE)","v":0},null,null,null,null,null,{"$f":"VLOOKUP(CODE(BY11),segmentos,2,FALSE)","v":0},null,null,null,null,null,{"$f":"VLOOKUP(CODE(CE11),segmentos,2,FALSE)","v":0},null,null,null,null,null,{"$f":"VLOOKUP(CODE(CK11),segmentos,2,FALSE)","v":0},null,null,null,null,null,{"$f":"VLOOKUP(CODE(CQ11),segmentos,2,FALSE)","v":1},null,null,null,null,null,"Teclaes"," "]
[null,null,null,{"$f":"VLOOKUP(CODE(E11),segmentos,7,FALSE)","v":0},null,{"$f":"VLOOKUP(CODE(E11),segmentos,3,FALSE)","v":0},null,null,null,{"$f":"VLOOKUP(CODE(K11),segmentos,7,FALSE)","v":0},null,{"$f":"VLOOKUP(CODE(K11),segmentos,3,FALSE)","v":0},null,null,null,{"$f":"VLOOKUP(CODE(Q11),segmentos,7,FALSE)","v":0},null,{"$f":"VLOOKUP(CODE(Q11),segmentos,3,FALSE)","v":0},null,null,null,{"$f":"VLOOKUP(CODE(W11),segmentos,7,FALSE)","v":0},null,{"$f":"VLOOKUP(CODE(W11),segmentos,3,FALSE)","v":0},null,null,null,{"$f":"VLOOKUP(CODE(AC11),segmentos,7,FALSE)","v":0},null,{"$f":"VLOOKUP(CODE(AC11),segmentos,3,FALSE)","v":0},null,null,null,{"$f":"VLOOKUP(CODE(AI11),segmentos,7,FALSE)","v":0},null,{"$f":"VLOOKUP(CODE(AI11),segmentos,3,FALSE)","v":0},null,null,null,{"$f":"VLOOKUP(CODE(AO11),segmentos,7,FALSE)","v":0},null,{"$f":"VLOOKUP(CODE(AO11),segmentos,3,FALSE)","v":0},null,null,null,{"$f":"VLOOKUP(CODE(AU11),segmentos,7,FALSE)","v":0},null,{"$f":"VLOOKUP(CODE(AU11),segmentos,3,FALSE)","v":0},null,null,null,{"$f":"VLOOKUP(CODE(BA11),segmentos,7,FALSE)","v":0},null,{"$f":"VLOOKUP(CODE(BA11),segmentos,3,FALSE)","v":0},null,null,null,{"$f":"VLOOKUP(CODE(BG11),segmentos,7,FALSE)","v":0},null,{"$f":"VLOOKUP(CODE(BG11),segmentos,3,FALSE)","v":0},null,null,null,{"$f":"VLOOKUP(CODE(BM11),segmentos,7,FALSE)","v":0},null,{"$f":"VLOOKUP(CODE(BM11),segmentos,3,FALSE)","v":0},null,null,null,{"$f":"VLOOKUP(CODE(BS11),segmentos,7,FALSE)","v":0},null,{"$f":"VLOOKUP(CODE(BS11),segmentos,3,FALSE)","v":0},null,null,null,{"$f":"VLOOKUP(CODE(BY11),segmentos,7,FALSE)","v":0},null,{"$f":"VLOOKUP(CODE(BY11),segmentos,3,FALSE)","v":0},null,null,null,{"$f":"VLOOKUP(CODE(CE11),segmentos,7,FALSE)","v":0},null,{"$f":"VLOOKUP(CODE(CE11),segmentos,3,FALSE)","v":0},null,null,null,{"$f":"VLOOKUP(CODE(CK11),segmentos,7,FALSE)","v":0},null,{"$f":"VLOOKUP(CODE(CK11),segmentos,3,FALSE)","v":0},null,null,null,{"$f":"VLOOKUP(CODE(CQ11),segmentos,7,FALSE)","v":1},null,{"$f":"VLOOKUP(CODE(CQ11),segmentos,3,FALSE)","v":1},null,null,null,null,"Tecla<-"," "]
[null,null,null,null,{"$f":"VLOOKUP(CODE(E11),segmentos,8,FALSE)","v":0},null,null,{"$f":"IF(H11=\":\",1,0)","v":0},null,null,{"$f":"VLOOKUP(CODE(K11),segmentos,8,FALSE)","v":0},null,null,{"$f":"IF(N11=\":\",1,0)","v":0},null,null,{"$f":"VLOOKUP(CODE(Q11),segmentos,8,FALSE)","v":0},null,null,{"$f":"IF(T11=\":\",1,0)","v":0},null,null,{"$f":"VLOOKUP(CODE(W11),segmentos,8,FALSE)","v":0},null,null,{"$f":"IF(Z11=\":\",1,0)","v":0},null,null,{"$f":"VLOOKUP(CODE(AC11),segmentos,8,FALSE)","v":0},null,null,{"$f":"IF(AF11=\":\",1,0)","v":0},null,null,{"$f":"VLOOKUP(CODE(AI11),segmentos,8,FALSE)","v":0},null,null,{"$f":"IF(AL11=\":\",1,0)","v":0},null,null,{"$f":"VLOOKUP(CODE(AO11),segmentos,8,FALSE)","v":0},null,null,{"$f":"IF(AR11=\":\",1,0)","v":0},null,null,{"$f":"VLOOKUP(CODE(AU11),segmentos,8,FALSE)","v":0},null,null,{"$f":"IF(AX11=\":\",1,0)","v":0},null,null,{"$f":"VLOOKUP(CODE(BA11),segmentos,8,FALSE)","v":0},null,null,{"$f":"IF(BD11=\":\",1,0)","v":0},null,null,{"$f":"VLOOKUP(CODE(BG11),segmentos,8,FALSE)","v":0},null,null,{"$f":"IF(BJ11=\":\",1,0)","v":0},null,null,{"$f":"VLOOKUP(CODE(BM11),segmentos,8,FALSE)","v":0},null,null,{"$f":"IF(BP11=\":\",1,0)","v":0},null,null,{"$f":"VLOOKUP(CODE(BS11),segmentos,8,FALSE)","v":0},null,null,{"$f":"IF(BV11=\":\",1,0)","v":0},null,null,{"$f":"VLOOKUP(CODE(BY11),segmentos,8,FALSE)","v":0},null,null,{"$f":"IF(CB11=\":\",1,0)","v":0},null,null,{"$f":"VLOOKUP(CODE(CE11),segmentos,8,FALSE)","v":0},null,null,{"$f":"IF(CH11=\":\",1,0)","v":0},null,null,{"$f":"VLOOKUP(CODE(CK11),segmentos,8,FALSE)","v":0},null,null,{"$f":"IF(CN11=\":\",1,0)","v":0},null,null,{"$f":"VLOOKUP(CODE(CQ11),segmentos,8,FALSE)","v":0},null,null,{"$f":"IF(CT11=\":\",1,0)","v":0},null,null,"Tecla->"," "]
[null,null,null,{"$f":"VLOOKUP(CODE(E11),segmentos,6,FALSE)","v":0},null,{"$f":"VLOOKUP(CODE(E11),segmentos,4,FALSE)","v":0},null,null,null,{"$f":"VLOOKUP(CODE(K11),segmentos,6,FALSE)","v":0},null,{"$f":"VLOOKUP(CODE(K11),segmentos,4,FALSE)","v":0},null,null,null,{"$f":"VLOOKUP(CODE(Q11),segmentos,6,FALSE)","v":0},null,{"$f":"VLOOKUP(CODE(Q11),segmentos,4,FALSE)","v":0},null,null,null,{"$f":"VLOOKUP(CODE(W11),segmentos,6,FALSE)","v":0},null,{"$f":"VLOOKUP(CODE(W11),segmentos,4,FALSE)","v":0},null,null,null,{"$f":"VLOOKUP(CODE(AC11),segmentos,6,FALSE)","v":0},null,{"$f":"VLOOKUP(CODE(AC11),segmentos,4,FALSE)","v":0},null,null,null,{"$f":"VLOOKUP(CODE(AI11),segmentos,6,FALSE)","v":0},null,{"$f":"VLOOKUP(CODE(AI11),segmentos,4,FALSE)","v":0},null,null,null,{"$f":"VLOOKUP(CODE(AO11),segmentos,6,FALSE)","v":0},null,{"$f":"VLOOKUP(CODE(AO11),segmentos,4,FALSE)","v":0},null,null,null,{"$f":"VLOOKUP(CODE(AU11),segmentos,6,FALSE)","v":0},null,{"$f":"VLOOKUP(CODE(AU11),segmentos,4,FALSE)","v":0},null,null,null,{"$f":"VLOOKUP(CODE(BA11),segmentos,6,FALSE)","v":0},null,{"$f":"VLOOKUP(CODE(BA11),segmentos,4,FALSE)","v":0},null,null,null,{"$f":"VLOOKUP(CODE(BG11),segmentos,6,FALSE)","v":0},null,{"$f":"VLOOKUP(CODE(BG11),segmentos,4,FALSE)","v":0},null,null,null,{"$f":"VLOOKUP(CODE(BM11),segmentos,6,FALSE)","v":0},null,{"$f":"VLOOKUP(CODE(BM11),segmentos,4,FALSE)","v":0},null,null,null,{"$f":"VLOOKUP(CODE(BS11),segmentos,6,FALSE)","v":0},null,{"$f":"VLOOKUP(CODE(BS11),segmentos,4,FALSE)","v":0},null,null,null,{"$f":"VLOOKUP(CODE(BY11),segmentos,6,FALSE)","v":0},null,{"$f":"VLOOKUP(CODE(BY11),segmentos,4,FALSE)","v":0},null,null,null,{"$f":"VLOOKUP(CODE(CE11),segmentos,6,FALSE)","v":0},null,{"$f":"VLOOKUP(CODE(CE11),segmentos,4,FALSE)","v":0},null,null,null,{"$f":"VLOOKUP(CODE(CK11),segmentos,6,FALSE)","v":0},null,{"$f":"VLOOKUP(CODE(CK11),segmentos,4,FALSE)","v":0},null,null,null,{"$f":"VLOOKUP(CODE(CQ11),segmentos,6,FALSE)","v":1},null,{"$f":"VLOOKUP(CODE(CQ11),segmentos,4,FALSE)","v":1},null,null,null,null,"Teclav>"," ",null,{"$f":"IF(IFERROR(FIND(\":\",miRegDisplay),0)>0,miRegDisplay,\"\")","v":""}]
[null,null,null,null,{"$f":"VLOOKUP(CODE(E11),segmentos,5,FALSE)","v":0},null,null,{"$f":"IF(H11<>\"\",1,0)","v":0},null,null,{"$f":"VLOOKUP(CODE(K11),segmentos,5,FALSE)","v":0},null,null,{"$f":"IF(N11<>\"\",1,0)","v":0},null,null,{"$f":"VLOOKUP(CODE(Q11),segmentos,5,FALSE)","v":0},null,null,{"$f":"IF(T11<>\"\",1,0)","v":0},null,null,{"$f":"VLOOKUP(CODE(W11),segmentos,5,FALSE)","v":0},null,null,{"$f":"IF(Z11<>\"\",1,0)","v":0},null,null,{"$f":"VLOOKUP(CODE(AC11),segmentos,5,FALSE)","v":0},null,null,{"$f":"IF(AF11<>\"\",1,0)","v":0},null,null,{"$f":"VLOOKUP(CODE(AI11),segmentos,5,FALSE)","v":0},null,null,{"$f":"IF(AL11<>\"\",1,0)","v":0},null,null,{"$f":"VLOOKUP(CODE(AO11),segmentos,5,FALSE)","v":0},null,null,{"$f":"IF(AR11<>\"\",1,0)","v":0},null,null,{"$f":"VLOOKUP(CODE(AU11),segmentos,5,FALSE)","v":0},null,null,{"$f":"IF(AX11<>\"\",1,0)","v":0},null,null,{"$f":"VLOOKUP(CODE(BA11),segmentos,5,FALSE)","v":0},null,null,{"$f":"IF(BD11<>\"\",1,0)","v":0},null,null,{"$f":"VLOOKUP(CODE(BG11),segmentos,5,FALSE)","v":0},null,null,{"$f":"IF(BJ11<>\"\",1,0)","v":0},null,null,{"$f":"VLOOKUP(CODE(BM11),segmentos,5,FALSE)","v":0},null,null,{"$f":"IF(BP11<>\"\",1,0)","v":0},null,null,{"$f":"VLOOKUP(CODE(BS11),segmentos,5,FALSE)","v":0},null,null,{"$f":"IF(BV11<>\"\",1,0)","v":0},null,null,{"$f":"VLOOKUP(CODE(BY11),segmentos,5,FALSE)","v":0},null,null,{"$f":"IF(CB11<>\"\",1,0)","v":0},null,null,{"$f":"VLOOKUP(CODE(CE11),segmentos,5,FALSE)","v":0},null,null,{"$f":"IF(CH11<>\"\",1,0)","v":0},null,null,{"$f":"VLOOKUP(CODE(CK11),segmentos,5,FALSE)","v":0},null,null,{"$f":"IF(CN11<>\"\",1,0)","v":0},null,null,{"$f":"VLOOKUP(CODE(CQ11),segmentos,5,FALSE)","v":1},null,null,{"$f":"IF(CT11<>\"\",1,0)","v":1},null,null,"Teclao>"," "]
[null,null,null,null,null,null,null,null,null,null,null,null,null,null,null,null,null,null,null,null,null,null,null,null,null,null,null,null,null,null,null,null,null,null,null,null,null,null,null,null,null,null,null,null,null,null,null,null,null,null,null,null,null,null,null,null,null,null,null,null,null,null,null,null,null,null,null,null,null,null,null,null,null,null,null,null,null,null,null,null,null,null,null,null,null,null,null,null,null,null,null,null,null,null,null,null,null,null,null,null,"Tecla^>"," "]
[null,null,null,null,null,null,null,null,null,null,null,null,null,null,null,null,null,null,null,null,null,null,null,null,null,null,null,null,null,null,null,null,null,null,null,null,null,null,null,null,null,null,null,null,null,null,null,null,null,null,null,null,null,null,null,null,null,null,null,null,null,null,null,null,null,null,null,null,null,null,null,null,null,null,null,null,null,null,null,null,null,null,null,null,null,null,null,null,null,null,null,null,null,null,null,null,null,null,null,null,"TeclaTR"," "]
{"$rows_left_out":94}
{"sheet":"ANSI","index":1,"n_rows":101,"n_cols":12,"rows_kept":101,"cut":false,"hidden":false,"merged":[]}
[0,{"$f":"CHAR(A1+32)","v":" "}," ",null,{"$f":"CODE(B1)","v":32},0,0,0,0,0,0,0]
[1,"!"," ",null,33,0,0,0,0,0,0,0]
[2,"\""," ",null,34,0,1,0,0,0,1,0]
[3,"#"," ",null,35,0,0,0,0,0,0,0]
[4,"$"," ",null,36,0,0,0,0,0,0,0]
[5,"%"," ",null,37,0,0,0,0,0,0,0]
[6,"&"," ",null,38,0,0,0,0,0,0,0]
[7,"'"," ",null,39,0,0,0,0,0,0,0]
[8,"("," ",null,40,0,0,0,0,0,0,0]
[9,")"," ",null,41,0,0,0,0,0,0,0]
{"$rows_left_out":92}
{"sheet":"Idiomas","index":2,"n_rows":107,"n_cols":6,"rows_kept":107,"cut":false,"hidden":false,"merged":[]}
["English","Español","Français","Italiano","Deutsch","Português"]
["Language:","Idioma:","Langue:","Lingua:","Sprache:","Idioma:"]
["Floating:","Flotante:","Flottant:","Floating:","Floating:","Flutuante:"]
["Keyboard:","Teclado:","Clavier:","Tastiera:","Tastatur:","Teclado:"]
["Tooltips:","Tooltips:","Les info-bulles:","Tooltips:","Tooltips:","Tooltips:"]
["Touch calculator","Calculadora táctil","Calculateur touch","Touch Calculator","Touch-Rechner","Toque Calculadora"]
["My first calculator","Mi primera calculadora","Ma première calculatrice","La mia prima calcolatrice","Mein erster Rechner","Minha primeira calculadora"]
["Microsoft calculator","Calculadora Microsoft","Calculateur de Microsoft","Microsoft Calculator","Microsoft Calculator","Microsoft Calculator"]
["Phone calculator","Calculadora Celular","Calculateur de téléphone","Mobile Calculator","Mobile Rechner","Mobile Calculadora"]
["Mini-Calculator","Mini-Calculadora","Mini-calculatrice","Mini-Calcolatrice","Mini-Rechner","Mini Calculadora-"]
{"$rows_left_out":98}
{"sheet":"Cod","index":3,"n_rows":220,"n_cols":6,"rows_kept":220,"cut":false,"hidden":false,"merged":[]}
["Código","Código Marcación","Idioma","País"]
[840,1,1,"United States",null,"https://en.wikipedia.org/wiki/List_of_official_languages_by_state"]
[124,1,1,"Canada",null,"https://en.wikipedia.org/wiki/List_of_country_calling_codes"]
[643,7,1,"Russian Federation",null,"https://en.wikipedia.org/wiki/ISO_3166-1_numeric"]
[818,20,1,"Egypt"]
[710,27,1,"South Africa"]
[300,30,1,"Greece"]
[528,31,1,"Netherlands"]
[56,32,3,"Belgium"]
[250,33,3,"France"]
{"$rows_left_out":211}
{"sheet":"Teclado","index":4,"n_rows":127,"n_cols":9,"rows_kept":127,"cut":false,"hidden":false,"merged":[]}
["Nombre","Botón","Tecla","Código","Procedimiento","Operación (Tecla equivalente)",null,"Teclado","Número"]
["Tecla%","%","SHIFT+%","+{%}","TK_Porcentaje",{"$f":"VLOOKUP(Idiomas!$A$11,Trans,miNumIdioma,FALSE)","v":"Porcentaje (%)"},null,{"$f":"IFERROR(I2&\" - \"&INDIRECT(\"Teclas\"&I2&\"!$A$1\"),\"\")","v":"0 - Calculadora táctil"},0]
["Teclax","*","*","{106}","NK_Multiplicar",{"$f":"VLOOKUP(Idiomas!$A$12,Trans,miNumIdioma,FALSE)","v":"Multiplicación (*)"},null,{"$f":"IFERROR(I3&\" - \"&INDIRECT(\"Teclas\"&I3&\"!$A$1\"),\"\")","v":"1 - Mi primera calculadora"},1]
["Teclax","*","*","*","TK_Multiplicar",{"$f":"VLOOKUP(Idiomas!$A$12,Trans,miNumIdioma,FALSE)","v":"Multiplicación (*)"},null,{"$f":"IFERROR(I4&\" - \"&INDIRECT(\"Teclas\"&I4&\"!$A$1\"),\"\")","v":"2 - Calculadora Microsoft"},2]
["Tecla+","+","+","{107}","NK_Sumar",{"$f":"VLOOKUP(Idiomas!$A$13,Trans,miNumIdioma,FALSE)","v":"Suma (+)"},null,{"$f":"IFERROR(I5&\" - \"&INDIRECT(\"Teclas\"&I5&\"!$A$1\"),\"\")","v":"3 - Calculadora Celular"},3]
["Tecla+","+","+","{+}","TK_Sumar",{"$f":"VLOOKUP(Idiomas!$A$13,Trans,miNumIdioma,FALSE)","v":"Suma (+)"},null,{"$f":"IFERROR(I6&\" - \"&INDIRECT(\"Teclas\"&I6&\"!$A$1\"),\"\")","v":"4 - Mini-Calculadora"},4]
["Teclan","+/-","F9","{F9}","TK_F9",{"$f":"VLOOKUP(Idiomas!$A$14,Trans,miNumIdioma,FALSE)","v":"Cambia signo (F9)"},null,{"$f":"IFERROR(I7&\" - \"&INDIRECT(\"Teclas\"&I7&\"!$A$1\"),\"\")","v":"5 - Calculadora Beta"},5]
["Tecla-","-","-","{109}","NK_Restar",{"$f":"VLOOKUP(Idiomas!$A$15,Trans,miNumIdioma,FALSE)","v":"Resta (-)"},null,{"$f":"IFERROR(I8&\" - \"&INDIRECT(\"Teclas\"&I8&\"!$A$1\"),\"\")","v":"6 - Calculadora Completa"},6]
["Tecla-","-","-","-","TK_Restar",{"$f":"VLOOKUP(Idiomas!$A$15,Trans,miNumIdioma,FALSE)","v":"Resta (-)"},null,{"$f":"IFERROR(I9&\" - \"&INDIRECT(\"Teclas\"&I9&\"!$A$1\"),\"\")","v":"7 - Calculadora sin teclas"},7]
["Tecla.",".",".","{110}","NK_Punto",{"$f":"VLOOKUP(Idiomas!$A$16,Trans,miNumIdioma,FALSE)","v":"Punto decimal (. o ,)"},null,{"$f":"IFERROR(I10&\" - \"&INDIRECT(\"Teclas\"&I10&\"!$A$1\"),\"\")","v":"8 - Calculadora básica"},8]
{"$rows_left_out":118}
{"sheet":"Teclas0","index":5,"n_rows":15,"n_cols":11,"rows_kept":15,"cut":false,"hidden":false,"merged":[]}
[{"$f":"VLOOKUP(Idiomas!$A$6,Trans,miNumIdioma,FALSE)","v":"Calculadora táctil"},"Text","Font","Color","Size","Style","Top","Left","Width","Height","Visible"]
["TeclaGP","=","Webdings",0,11,"Regular",112,831,68,20,1]
["TeclaRP",4,"Webdings",0,11,"Regular",112,756,68,20,1]
["Teclaes",{"$f":"VLOOKUP(Idiomas!$A$73,Trans,miNumIdioma,FALSE)","v":"Ayuda 1 de 9:\nBienvenido a la calculadora táctil\ncon teclas flotantes personalizables\n(Presiona esta tecla o la barra espaciadora)"},"Arial",13395456,24,"Bold",200,306,550,170,1]
["Tecla<-","Å","Wingdings 3",0,28,"Bold",439,156,68,68,1]
["Tecla->","Æ","Wingdings 3",0,24,"Bold",139,156,68,68,1]
["Teclav>","È","Wingdings 3",0,28,"Bold",364,156,68,68,1]
["Teclao>","®","Arial",0,24,"Bold",289,156,68,68,1]
["Tecla^>","Ç","Wingdings 3",0,28,"Regular",214,156,68,68,1]
["TeclaTR","8","Wingdings",0,11,"Regular",514,156,68,20,1]
{"$rows_left_out":6}
{"sheet":"Teclas1","index":6,"n_rows":62,"n_cols":11,"rows_kept":62,"cut":false,"hidden":false,"merged":[]}
[{"$f":"VLOOKUP(Idiomas!$A$7,Trans,miNumIdioma,FALSE)","v":"Mi primera calculadora"},"Text","Font","Color","Size","Style","Top","Left","Width","Height","Visible"]
["TeclaCA","CA","Arial",255,24,"Bold",139,531,68,68,1]
["Tecla/","÷","Arial",255,36,"Bold",139,606,68,68,1]
["Teclax","×","Arial",255,36,"Bold",139,681,68,68,1]
["Tecla-","-","Arial",255,36,"Bold",139,756,68,68,1]
["Tecla.",",","Arial",12611584,28,"Bold",439,681,68,68,1]
["Tecla3","3","Arial",12611584,28,"Bold",364,681,68,68,1]
["Tecla2","2","Arial",12611584,28,"Bold",364,606,68,68,1]
["Tecla1","1","Arial",12611584,28,"Bold",364,531,68,68,1]
["Tecla6","6","Arial",12611584,28,"Bold",289,681,68,68,1]
{"$rows_left_out":53}
{"sheet":"Teclas2","index":7,"n_rows":63,"n_cols":11,"rows_kept":63,"cut":false,"hidden":false,"merged":[]}
[{"$f":"VLOOKUP(Idiomas!$A$8,Trans,miNumIdioma,FALSE)","v":"Calculadora Microsoft"},"Text","Font","Color","Size","Style","Top","Left","Width","Height","Visible"]
["TeclaCA","C","Arial",255,24,"Bold",139,784,116,68,1]
["Tecla/","/","Arial",255,36,"Bold",214,756,68,68,1]
["Teclax","x","Arial",255,36,"Bold",289,756,68,68,1]
["Tecla-","-","Arial",255,36,"Bold",364,756,68,68,1]
["Tecla.",".","Arial",12611584,28,"Bold",439,681,68,68,1]
["Tecla3",3,"Arial",12611584,28,"Bold",364,681,68,68,1]
["Tecla2",2,"Arial",12611584,28,"Bold",364,606,68,68,1]
["Tecla1",1,"Arial",12611584,28,"Bold",364,531,68,68,1]
["Tecla6",6,"Arial",12611584,28,"Bold",289,681,68,68,1]
{"$rows_left_out":54}
{"sheet":"Teclas3","index":8,"n_rows":63,"n_cols":11,"rows_kept":63,"cut":false,"hidden":false,"merged":[]}
[{"$f":"VLOOKUP(Idiomas!$A$9,Trans,miNumIdioma,FALSE)","v":"Calculadora Celular"},"Text","Font","Color","Size","Style","Top","Left","Width","Height","Visible"]
["TeclaCA","AC","Arial",255,24,"Bold",139,782,116,68,1]
["Tecla/","÷","Arial",255,36,"Bold",439,756,68,68,1]
["Teclax","x","Arial",255,36,"Bold",364,756,68,68,1]
["Tecla-","-","Arial",255,36,"Bold",289,756,68,68,1]
["Tecla.",".","Arial",12611584,28,"Bold",439,531,68,68,1]
["Tecla3",3,"Arial",12611584,28,"Bold",214,681,68,68,1]
["Tecla2",2,"Arial",12611584,28,"Bold",214,606,68,68,1]
["Tecla1",1,"Arial",12611584,28,"Bold",214,531,68,68,1]
["Tecla6",6,"Arial",12611584,28,"Bold",289,681,68,68,1]
{"$rows_left_out":54}
{"sheet":"Teclas4","index":9,"n_rows":27,"n_cols":11,"rows_kept":27,"cut":false,"hidden":false,"merged":[]}
[{"$f":"VLOOKUP(Idiomas!$A$10,Trans,miNumIdioma,FALSE)","v":"Mini-Calculadora"},"Text","Font","Color","Size","Style","Top","Left","Width","Height","Visible"]
["TeclaCA","Borra todo","Arial",255,18,"Bold",141,756,141,68,1]
["Tecla/","÷\n\nDivide","Arial",255,16,"Bold",439,716,102,102,1]
["Teclax","x\n\nMultiplica","Arial",255,16,"Bold",321,716,102,102,1]
["Tecla-","_\n\nResta","Arial",255,16,"Bold",439,596,102,102,1]
["Tecla.",".","Arial",12611584,28,"Bold",230,631,68,68,1]
["Tecla3",3,"Arial",12611584,28,"Bold",358,476,102,102,1]
["Tecla2",2,"Arial",12611584,28,"Bold",358,361,102,102,1]
["Tecla1",1,"Arial",12611584,28,"Bold",358,251,102,102,1]
["Tecla6",6,"Arial",12611584,28,"Bold",243,476,102,102,1]
{"$rows_left_out":18}
{"sheet":"Teclas5","index":10,"n_rows":73,"n_cols":11,"rows_kept":73,"cut":false,"hidden":false,"merged":[]}
[{"$f":"VLOOKUP(Idiomas!$A$82,Trans,miNumIdioma,FALSE)","v":"Calculadora Beta"},"Text","Font","Color","Size","Style","Top","Left","Width","Height","Visible"]
["TeclaCA","AC","Arial",255,24,"Bold",139,831,68,68,1]
["Tecla/","÷","Arial",255,36,"Bold",139,756.00006103515625,68,68,1]
["Teclax","x","Arial",255,36,"Bold",214,756.00006103515625,68,68,1]
["Tecla-","-","Arial",255,36,"Bold",289,756.00006103515625,68,68,1]
["Tecla.",".","Arial",12611584,28,"Bold",364,681,68,68,1]
["Tecla3",3,"Arial",12611584,28,"Bold",289,681,68,68,1]
["Tecla2",2,"Arial",12611584,28,"Bold",289,606,68,68,1]
["Tecla1",1,"Arial",12611584,28,"Bold",289,531,68,68,1]
["Tecla6",6,"Arial",12611584,28,"Bold",214,681,68,68,1]
{"$rows_left_out":64}
{"sheet":"Teclas6","index":11,"n_rows":73,"n_cols":11,"rows_kept":73,"cut":false,"hidden":false,"merged":[]}
[{"$f":"VLOOKUP(Idiomas!$A$101,Trans,miNumIdioma,FALSE)","v":"Calculadora Completa"},"Text","Font","Color","Size","Style","Top","Left","Width","Height","Visible"]
["TeclaCA","AC","Arial",255,24,"Bold",139,831,68,68,1]
["Tecla/","÷","Arial",255,36,"Bold",139,756,68,68,1]
["Teclax","x","Arial",255,36,"Bold",214,756,68,68,1]
["Tecla-","-","Arial",255,36,"Bold",290,756,68,68,1]
["Tecla.",".","Arial",12611584,28,"Bold",366,681,68,68,1]
["Tecla3",3,"Arial",12611584,28,"Bold",290,681,68,68,1]
["Tecla2",2,"Arial",12611584,28,"Bold",290,606,68,68,1]
["Tecla1",1,"Arial",12611584,28,"Bold",290,531,68,68,1]
["Tecla6",6,"Arial",12611584,28,"Bold",214,681,68,68,1]
{"$rows_left_out":64}
{"sheet":"Teclas7","index":12,"n_rows":73,"n_cols":11,"rows_kept":73,"cut":false,"hidden":false,"merged":[]}
[{"$f":"VLOOKUP(Idiomas!$A$103,Trans,miNumIdioma,FALSE)","v":"Calculadora sin teclas"},"Text","Font","Color","Size","Style","Top","Left","Width","Height","Visible"]
["TeclaCA","AC","Arial",255,24,"Bold",139,831,68,68,0]
["Tecla/","÷","Arial",255,36,"Bold",139,756,68,68,0]
["Teclax","x","Arial",255,36,"Bold",214,756,68,68,0]
["Tecla-","-","Arial",255,36,"Bold",290,756,68,68,0]
["Tecla.",".","Arial",12611584,28,"Bold",366,681,68,68,0]
["Tecla3",3,"Arial",12611584,28,"Bold",290,681,68,68,0]
["Tecla2",2,"Arial",12611584,28,"Bold",290,606,68,68,0]
["Tecla1",1,"Arial",12611584,28,"Bold",290,531,68,68,0]
["Tecla6",6,"Arial",12611584,28,"Bold",214,681,68,68,0]
{"$rows_left_out":64}
{"sheet":"Teclas8","index":13,"n_rows":45,"n_cols":11,"rows_kept":45,"cut":false,"hidden":false,"merged":[]}
[{"$f":"VLOOKUP(Idiomas!$A$107,Trans,miNumIdioma,FALSE)","v":"Calculadora básica"},"Text","Font","Color","Size","Style","Top","Left","Width","Height","Visible"]
["TeclaCA","C","Arial",255,24,"Bold",139,784,116,68,1]
["Tecla/","/","Arial",255,36,"Bold",214,756,68,68,1]
["Teclax","x","Arial",255,36,"Bold",289,756,68,68,1]
["Tecla-","-","Arial",255,36,"Bold",364,756,68,68,1]
["Tecla.",".","Arial",12611584,28,"Bold",439,606,68,68,1]
["Tecla3",3,"Arial",12611584,28,"Bold",364,681,68,68,1]
["Tecla2",2,"Arial",12611584,28,"Bold",364,606,68,68,1]
["Tecla1",1,"Arial",12611584,28,"Bold",364,531,68,68,1]
["Tecla6",6,"Arial",12611584,28,"Bold",289,681,68,68,1]
{"$rows_left_out":35}