{"text_format":"1","workbook":"xlsx","n_sheets":10,"sheets":["DASHBOARD","MENU","MALL","M1","M2","M3","M4","M5","MAP","RACES"],"not_rendered":{"charts":4,"images":26,"macros":1,"external_links":0,"defined_names":20,"comments":0,"pivot_tables":0},"unopened":[],"bounds":{"document_bytes":16777216,"sheet_cells":100000,"rows_first":2000,"rows_last":500,"rows_between":2000,"halvings":0,"cell_chars":16384,"cell_head_chars":4096},"cells_cut":0,"cells_raw":0,"read":"whole","date_system":"1900"}

{"sheet":"DASHBOARD","index":0,"n_rows":41,"n_cols":21,"rows_kept":41,"cut":false,"hidden":false,"merged":[[38,3,38,9],[40,3,40,11],[36,3,36,5],[37,3,37,8],[39,3,39,9]]}
[]
[null,null,null,null,null,null,null,null,null,null,"FORMULA1 3D MENU",null,"Speed:",4]
[null,"TEAMS",null,null,null,null,null,null,null,null,null,null,null,null,null,null,null,null,null,null,"DRIVERS"]
[]
[]
[]
[]
[]
[]
[]
[]
[]
[]
[]
[]
[]
[]
[null,"COUNTRIES",null,null,null,null,null,"MAP",null,null,null,null,null,null,null,null,null,null,null,null,"RACES"]
[]
[]
[]
[]
[]
[]
[]
[]
[]
[]
[]
[]
[]
[]
[]
[]
[]
[]
[null,null,"AUTHOR:","#ExcelPedroWave"]
[null,null,"BLOG:","Formula1 3D Menu Excel | #ExcelPedroWave"]
[null,null,"COPYRIGHT:","Creative Commons — Atribución-NoComercial-CompartirIgual 3.0 No portada"]
[null,null,"IMAGES:","Commons:Reusing content outside Wikimedia - Wikimedia Commons"]
[null,null,"IDEA:","3D menu for dashboard analysis with data visualization in Excel (exceltable.com)"]

{"sheet":"MENU","index":1,"n_rows":26,"n_cols":16,"rows_kept":26,"cut":false,"hidden":false,"merged":[]}
[null,"Data Menu","Width","Height","Keys","Opt Pos","P1","P2","P3","P4","P5","L1","L2","L3","L4","L5"]
["Pos Start",220,81,29.6,51,5,145,75,365,290,220,30,14,7,22,8]
["Pos End",145,96,36.4,52,75,145,75,365,290,220,66,50,43,58,44]
["My driver",1,110,39,53,145,145,435,365,290,220,102,86,79,94,80]
["New",1,96,36.4,54,220,505,435,365,290,220,138,122,115,130,116]
["Driver1",{"$f":"\"1-Carlos \"&CHAR(10)&\"Sainz\"","v":"1-Carlos \nSainz"},81,29.6,55,290,505,435,365,650,580]
["Driver2",{"$f":"\"2-Fernando \"&CHAR(10)&\"Alonso\"","v":"2-Fernando \nAlonso"},96,36.4,751]
["Driver3",{"$f":"\"3-Charles \"&CHAR(10)&\"Leclerc\"","v":"3-Charles \nLeclerc"},110,39,752]
["Driver4",{"$f":"\"4-Max \"&CHAR(10)&\"Verstappen\"","v":"4-Max \nVerstappen"},96,36.4,753]
["Driver5",{"$f":"\"5-Sergio \"&CHAR(10)&\"Pérez\"","v":"5-Sergio \nPérez"},81,29.6,754]
["Old",1,81,29.6,755]
[null,null,110,39,1451]
[null,null,96,36.4,1452]
[null,null,81,29.6,1453]
[null,null,81,29.6,1454]
[null,null,96,36.4,1455]
[null,null,96,36.4,2201]
[null,null,81,29.6,2202]
[null,null,81,29.6,2203]
[null,null,96,36.4,2204]
[null,null,110,39,2205]
[null,null,81,29.6,2901]
[null,null,81,29.6,2902]
[null,null,96,36.4,2903]
[null,null,110,39,2904]
[null,null,96,36.4,2905]

{"sheet":"MALL","index":2,"n_rows":19,"n_cols":5,"rows_kept":19,"cut":false,"hidden":false,"merged":[]}
[]
[{"$f":"MID(MENU!$B$6,3,50)","v":"Carlos \nSainz"},{"$f":"MID(MENU!$B$7,3,50)","v":"Fernando \nAlonso"},{"$f":"MID(MENU!$B$8,3,50)","v":"Charles \nLeclerc"},{"$f":"MID(MENU!$B$9,3,50)","v":"Max \nVerstappen"},{"$f":"MID(MENU!$B$10,3,50)","v":"Sergio \nPérez"}]
[55,14,16,1,11]
["Ferrari","Alpine","Ferrari","Red Bull","Red Bull"]
["Spain","Spain","Monaco","Netherlands","Mexico"]
["1994-09-01","1981-07-29","1997-10-16","1997-09-30","1990-01-26"]
[]
[null,null,"Scuderia Ferrari"]
[null,null,"Maranello, Italy"]
[null,null,{"$f":"$A$3 & \" \" & $A$2","v":"55 Carlos \nSainz"}]
[null,null,{"$f":"$C$3 & \" \" & $C$2","v":"16 Charles \nLeclerc"}]
[null,null,"Oracle Red Bull Racing"]
[null,null,"Milton Keynes, United Kingdom"]
[null,null,{"$f":"$D$3 & \" \" & $D$2","v":"1 Max \nVerstappen"}]
[null,null,{"$f":"$E$3 & \" \" & $E$2","v":"11 Sergio \nPérez"}]
[null,null,"BWT Alpine F1 Team"]
[null,null,"Enstone, United Kingdom"]
[null,null,{"$f":"$B$3 & \" \" & $B$2","v":"14 Fernando \nAlonso"}]
[null,null,"31 Esteban Ocon"]

{"sheet":"M1","index":3,"n_rows":18,"n_cols":5,"rows_kept":18,"cut":false,"hidden":false,"merged":[]}
[null,null,null,null,{"$f":"MALL!$A$3 & \" \" & MALL!$A$2","v":"55 Carlos \nSainz"}]
[]
[]
[null,null,null,{"$f":"MALL!$A$4","v":"Ferrari"}]
[null,null,null,{"$f":"MALL!$A$5","v":"Spain"}]
[null,null,null,{"$f":"MALL!$A$6","v":"1994-09-01"}]
[]
[]
[null,null,{"$f":"MALL!C8","v":"Scuderia Ferrari"}]
[null,null,{"$f":"MALL!C9","v":"Maranello, Italy"}]
[]
[]
[]
[]
[]
[]
[null,{"$f":"MALL!$A$3","v":55},null,{"$f":"MALL!$C$3","v":16}]
[null,{"$f":"MALL!$A$2","v":"Carlos \nSainz"},null,{"$f":"MALL!$C$2","v":"Charles \nLeclerc"}]

{"sheet":"M2","index":4,"n_rows":18,"n_cols":5,"rows_kept":18,"cut":false,"hidden":false,"merged":[]}
[null,null,null,null,{"$f":"MALL!$B$3 & \" \" & MALL!$B$2","v":"14 Fernando \nAlonso"}]
[]
[]
[null,null,null,{"$f":"MALL!$B$4","v":"Alpine"}]
[null,null,null,{"$f":"MALL!$B$5","v":"Spain"}]
[null,null,null,{"$f":"MALL!$B$6","v":"1981-07-29"}]
[]
[]
[null,null,{"$f":"MALL!C16","v":"BWT Alpine F1 Team"}]
[null,null,{"$f":"MALL!C17","v":"Enstone, United Kingdom"}]
[]
[]
[]
[]
[]
[]
[null,{"$f":"MALL!$B$3","v":14},null,31]
[null,{"$f":"MALL!$B$2","v":"Fernando \nAlonso"},null,"Esteban Ocon"]

{"sheet":"M3","index":5,"n_rows":18,"n_cols":5,"rows_kept":18,"cut":false,"hidden":false,"merged":[]}
[null,null,null,null,{"$f":"MALL!$C$3 & \" \" & MALL!$C$2","v":"16 Charles \nLeclerc"}]
[]
[]
[null,null,null,{"$f":"MALL!$C$4","v":"Ferrari"}]
[null,null,null,{"$f":"MALL!$C$5","v":"Monaco"}]
[null,null,null,{"$f":"MALL!$C$6","v":"1997-10-16"}]
[]
[]
[null,null,{"$f":"MALL!C8","v":"Scuderia Ferrari"}]
[null,null,{"$f":"MALL!C9","v":"Maranello, Italy"}]
[]
[]
[]
[]
[]
[]
[null,{"$f":"MALL!$A$3","v":55},null,{"$f":"MALL!$C$3","v":16}]
[null,{"$f":"MALL!$A$2","v":"Carlos \nSainz"},null,{"$f":"MALL!$C$2","v":"Charles \nLeclerc"}]

{"sheet":"M4","index":6,"n_rows":18,"n_cols":5,"rows_kept":18,"cut":false,"hidden":false,"merged":[]}
[null,null,null,null,{"$f":"MALL!$D$3 & \" \" & MALL!$D$2","v":"1 Max \nVerstappen"}]
[]
[]
[null,null,null,{"$f":"MALL!$D$4","v":"Red Bull"}]
[null,null,null,{"$f":"MALL!$D$5","v":"Netherlands"}]
[null,null,null,{"$f":"MALL!$D$6","v":"1997-09-30"}]
[]
[]
[null,null,{"$f":"MALL!C12","v":"Oracle Red Bull Racing"}]
[null,null,{"$f":"MALL!C13","v":"Milton Keynes, United Kingdom"}]
[]
[]
[]
[]
[]
[]
[null,{"$f":"MALL!$D$3","v":1},null,{"$f":"MALL!$E$3","v":11}]
[null,{"$f":"MALL!$D$2","v":"Max \nVerstappen"},null,{"$f":"MALL!$E$2","v":"Sergio \nPérez"}]

{"sheet":"M5","index":7,"n_rows":18,"n_cols":5,"rows_kept":18,"cut":false,"hidden":false,"merged":[]}
[null,null,null,null,{"$f":"MALL!$E$3 & \" \" & MALL!$E$2","v":"11 Sergio \nPérez"}]
[]
[]
[null,null,null,{"$f":"MALL!$E$4","v":"Red Bull"}]
[null,null,null,{"$f":"MALL!$E$5","v":"Mexico"}]
[null,null,null,{"$f":"MALL!$E$6","v":"1990-01-26"}]
[]
[]
[null,null,{"$f":"MALL!C12","v":"Oracle Red Bull Racing"}]
[null,null,{"$f":"MALL!C13","v":"Milton Keynes, United Kingdom"}]
[]
[]
[]
[]
[]
[]
[null,{"$f":"MALL!$D$3","v":1},null,{"$f":"MALL!$E$3","v":11}]
[null,{"$f":"MALL!$D$2","v":"Max \nVerstappen"},null,{"$f":"MALL!$E$2","v":"Sergio \nPérez"}]

{"sheet":"MAP","index":8,"n_rows":77,"n_cols":3,"rows_kept":77,"cut":false,"hidden":false,"merged":[]}
["Country","Group","Driver"]
["Australia","Win1","M3"]
["Australia","Win2","M5"]
["Australia","Win3","George Russell"]
["Austria","Win1","M3"]
["Austria","Win2","M4"]
["Austria","Win3","Lewis Hamilton"]
["Azerbaijan","Win1","M4"]
["Azerbaijan","Win2","M5"]
["Azerbaijan","Win3","George Russell"]
["Bahrain","Win1","M3"]
["Bahrain","Win2","M1"]
["Bahrain","Win3","Lewis Hamilton"]
["Belgium","Win1","M4"]
["Belgium","Win2","M5"]
["Belgium","Win3","M1"]
["Brazil","Win1","George Russell"]
["Brazil","Win2","Lewis Hamilton"]
["Brazil","Win3","M1"]
["Canada","Win1","M4"]
["Canada","Win2","M1"]
["Canada","Win3","Lewis Hamilton"]
["France","Win1","M4"]
["France","Win2","Lewis Hamilton"]
["France","Win3","George Russell"]
["Hungary","Win1","M4"]
["Hungary","Win2","Lewis Hamilton"]
["Hungary","Win3","George Russell"]
["Italy","Team","M1"]
["Italy","Team","M3"]
["Italy","Win1","M4"]
["Italy","Win1","M4"]
["Italy","Win2","M5"]
["Italy","Win2","M3"]
["Italy","Win3","Lando Norris"]
["Italy","Win3","George Russell"]
["Japan","Win1","M4"]
["Japan","Win2","M5"]
["Japan","Win3","M3"]
["Mexico","Driver","M5"]
["Mexico","Win1","M4"]
["Mexico","Win2","Lewis Hamilton"]
["Mexico","Win3","M5"]
["Monaco","Driver","M3"]
["Monaco","Win1","M5"]
["Monaco","Win2","M1"]
["Monaco","Win3","M4"]
["Netherlands","Driver","M4"]
["Netherlands","Win1","M4"]
["Netherlands","Win2","George Russell"]
["Netherlands","Win3","M3"]
["Saudi Arabia","Win1","M4"]
["Saudi Arabia","Win2","M3"]
["Saudi Arabia","Win3","M1"]
["Singapore","Win1","M5"]
["Singapore","Win2","M3"]
["Singapore","Win3","M1"]
["Spain","Driver","M1"]
["Spain","Driver","M2"]
["Spain","Win1","M4"]
{"$rows_left_out":18}
{"sheet":"RACES","index":9,"n_rows":67,"n_cols":5,"rows_kept":67,"cut":false,"hidden":false,"merged":[]}
["Date","Race","Winner","Driver","Name"]
["2022-03-20","Bahrain",3,"M3",{"$f":"IF(LEFT(TableRaces[[#This Row],[Driver]])=\"M\",INDEX(MALL!$A$2:$E$2,1,RIGHT(TableRaces[[#This Row],[Driver]])),SUBSTITUTE(TableRaces[[#This Row],[Driver]],\" \",\" \" & CHAR(10)))","v":"Charles \nLeclerc"}]
["2022-03-20","Bahrain",2,"M1",{"$f":"IF(LEFT(TableRaces[[#This Row],[Driver]])=\"M\",INDEX(MALL!$A$2:$E$2,1,RIGHT(TableRaces[[#This Row],[Driver]])),SUBSTITUTE(TableRaces[[#This Row],[Driver]],\" \",\" \" & CHAR(10)))","v":"Carlos \nSainz"}]
["2022-03-20","Bahrain",1,"Lewis Hamilton",{"$f":"IF(LEFT(TableRaces[[#This Row],[Driver]])=\"M\",INDEX(MALL!$A$2:$E$2,1,RIGHT(TableRaces[[#This Row],[Driver]])),SUBSTITUTE(TableRaces[[#This Row],[Driver]],\" \",\" \" & CHAR(10)))","v":"Lewis \nHamilton"}]
["2022-03-27","Saudi Arabia",3,"M4",{"$f":"IF(LEFT(TableRaces[[#This Row],[Driver]])=\"M\",INDEX(MALL!$A$2:$E$2,1,RIGHT(TableRaces[[#This Row],[Driver]])),SUBSTITUTE(TableRaces[[#This Row],[Driver]],\" \",\" \" & CHAR(10)))","v":"Max \nVerstappen"}]
["2022-03-27","Saudi Arabia",2,"M3",{"$f":"IF(LEFT(TableRaces[[#This Row],[Driver]])=\"M\",INDEX(MALL!$A$2:$E$2,1,RIGHT(TableRaces[[#This Row],[Driver]])),SUBSTITUTE(TableRaces[[#This Row],[Driver]],\" \",\" \" & CHAR(10)))","v":"Charles \nLeclerc"}]
["2022-03-27","Saudi Arabia",1,"M1",{"$f":"IF(LEFT(TableRaces[[#This Row],[Driver]])=\"M\",INDEX(MALL!$A$2:$E$2,1,RIGHT(TableRaces[[#This Row],[Driver]])),SUBSTITUTE(TableRaces[[#This Row],[Driver]],\" \",\" \" & CHAR(10)))","v":"Carlos \nSainz"}]
["2022-04-10","Australia",3,"M3",{"$f":"IF(LEFT(TableRaces[[#This Row],[Driver]])=\"M\",INDEX(MALL!$A$2:$E$2,1,RIGHT(TableRaces[[#This Row],[Driver]])),SUBSTITUTE(TableRaces[[#This Row],[Driver]],\" \",\" \" & CHAR(10)))","v":"Charles \nLeclerc"}]
["2022-04-10","Australia",2,"M5",{"$f":"IF(LEFT(TableRaces[[#This Row],[Driver]])=\"M\",INDEX(MALL!$A$2:$E$2,1,RIGHT(TableRaces[[#This Row],[Driver]])),SUBSTITUTE(TableRaces[[#This Row],[Driver]],\" \",\" \" & CHAR(10)))","v":"Sergio \nPérez"}]
["2022-04-10","Australia",1,"George Russell",{"$f":"IF(LEFT(TableRaces[[#This Row],[Driver]])=\"M\",INDEX(MALL!$A$2:$E$2,1,RIGHT(TableRaces[[#This Row],[Driver]])),SUBSTITUTE(TableRaces[[#This Row],[Driver]],\" \",\" \" & CHAR(10)))","v":"George \nRussell"}]
["2022-04-24","Italy",3,"M4",{"$f":"IF(LEFT(TableRaces[[#This Row],[Driver]])=\"M\",INDEX(MALL!$A$2:$E$2,1,RIGHT(TableRaces[[#This Row],[Driver]])),SUBSTITUTE(TableRaces[[#This Row],[Driver]],\" \",\" \" & CHAR(10)))","v":"Max \nVerstappen"}]
["2022-04-24","Italy",2,"M5",{"$f":"IF(LEFT(TableRaces[[#This Row],[Driver]])=\"M\",INDEX(MALL!$A$2:$E$2,1,RIGHT(TableRaces[[#This Row],[Driver]])),SUBSTITUTE(TableRaces[[#This Row],[Driver]],\" \",\" \" & CHAR(10)))","v":"Sergio \nPérez"}]
["2022-04-24","Italy",1,"Lando Norris",{"$f":"IF(LEFT(TableRaces[[#This Row],[Driver]])=\"M\",INDEX(MALL!$A$2:$E$2,1,RIGHT(TableRaces[[#This Row],[Driver]])),SUBSTITUTE(TableRaces[[#This Row],[Driver]],\" \",\" \" & CHAR(10)))","v":"Lando \nNorris"}]
["2022-05-08","United States",3,"M4",{"$f":"IF(LEFT(TableRaces[[#This Row],[Driver]])=\"M\",INDEX(MALL!$A$2:$E$2,1,RIGHT(TableRaces[[#This Row],[Driver]])),SUBSTITUTE(TableRaces[[#This Row],[Driver]],\" \",\" \" & CHAR(10)))","v":"Max \nVerstappen"}]
["2022-05-08","United States",2,"M3",{"$f":"IF(LEFT(TableRaces[[#This Row],[Driver]])=\"M\",INDEX(MALL!$A$2:$E$2,1,RIGHT(TableRaces[[#This Row],[Driver]])),SUBSTITUTE(TableRaces[[#This Row],[Driver]],\" \",\" \" & CHAR(10)))","v":"Charles \nLeclerc"}]
["2022-05-08","United States",1,"M1",{"$f":"IF(LEFT(TableRaces[[#This Row],[Driver]])=\"M\",INDEX(MALL!$A$2:$E$2,1,RIGHT(TableRaces[[#This Row],[Driver]])),SUBSTITUTE(TableRaces[[#This Row],[Driver]],\" \",\" \" & CHAR(10)))","v":"Carlos \nSainz"}]
["2022-05-22","Spain",3,"M4",{"$f":"IF(LEFT(TableRaces[[#This Row],[Driver]])=\"M\",INDEX(MALL!$A$2:$E$2,1,RIGHT(TableRaces[[#This Row],[Driver]])),SUBSTITUTE(TableRaces[[#This Row],[Driver]],\" \",\" \" & CHAR(10)))","v":"Max \nVerstappen"}]
["2022-05-22","Spain",2,"M5",{"$f":"IF(LEFT(TableRaces[[#This Row],[Driver]])=\"M\",INDEX(MALL!$A$2:$E$2,1,RIGHT(TableRaces[[#This Row],[Driver]])),SUBSTITUTE(TableRaces[[#This Row],[Driver]],\" \",\" \" & CHAR(10)))","v":"Sergio \nPérez"}]
["2022-05-22","Spain",1,"George Russell",{"$f":"IF(LEFT(TableRaces[[#This Row],[Driver]])=\"M\",INDEX(MALL!$A$2:$E$2,1,RIGHT(TableRaces[[#This Row],[Driver]])),SUBSTITUTE(TableRaces[[#This Row],[Driver]],\" \",\" \" & CHAR(10)))","v":"George \nRussell"}]
["2022-05-29","Monaco",3,"M5",{"$f":"IF(LEFT(TableRaces[[#This Row],[Driver]])=\"M\",INDEX(MALL!$A$2:$E$2,1,RIGHT(TableRaces[[#This Row],[Driver]])),SUBSTITUTE(TableRaces[[#This Row],[Driver]],\" \",\" \" & CHAR(10)))","v":"Sergio \nPérez"}]
["2022-05-29","Monaco",2,"M1",{"$f":"IF(LEFT(TableRaces[[#This Row],[Driver]])=\"M\",INDEX(MALL!$A$2:$E$2,1,RIGHT(TableRaces[[#This Row],[Driver]])),SUBSTITUTE(TableRaces[[#This Row],[Driver]],\" \",\" \" & CHAR(10)))","v":"Carlos \nSainz"}]
["2022-05-29","Monaco",1,"M4",{"$f":"IF(LEFT(TableRaces[[#This Row],[Driver]])=\"M\",INDEX(MALL!$A$2:$E$2,1,RIGHT(TableRaces[[#This Row],[Driver]])),SUBSTITUTE(TableRaces[[#This Row],[Driver]],\" \",\" \" & CHAR(10)))","v":"Max \nVerstappen"}]
["2022-06-12","Azerbaijan",3,"M4",{"$f":"IF(LEFT(TableRaces[[#This Row],[Driver]])=\"M\",INDEX(MALL!$A$2:$E$2,1,RIGHT(TableRaces[[#This Row],[Driver]])),SUBSTITUTE(TableRaces[[#This Row],[Driver]],\" \",\" \" & CHAR(10)))","v":"Max \nVerstappen"}]
["2022-06-12","Azerbaijan",2,"M5",{"$f":"IF(LEFT(TableRaces[[#This Row],[Driver]])=\"M\",INDEX(MALL!$A$2:$E$2,1,RIGHT(TableRaces[[#This Row],[Driver]])),SUBSTITUTE(TableRaces[[#This Row],[Driver]],\" \",\" \" & CHAR(10)))","v":"Sergio \nPérez"}]
["2022-06-12","Azerbaijan",1,"George Russell",{"$f":"IF(LEFT(TableRaces[[#This Row],[Driver]])=\"M\",INDEX(MALL!$A$2:$E$2,1,RIGHT(TableRaces[[#This Row],[Driver]])),SUBSTITUTE(TableRaces[[#This Row],[Driver]],\" \",\" \" & CHAR(10)))","v":"George \nRussell"}]
["2022-06-19","Canada",3,"M4",{"$f":"IF(LEFT(TableRaces[[#This Row],[Driver]])=\"M\",INDEX(MALL!$A$2:$E$2,1,RIGHT(TableRaces[[#This Row],[Driver]])),SUBSTITUTE(TableRaces[[#This Row],[Driver]],\" \",\" \" & CHAR(10)))","v":"Max \nVerstappen"}]
["2022-06-19","Canada",2,"M1",{"$f":"IF(LEFT(TableRaces[[#This Row],[Driver]])=\"M\",INDEX(MALL!$A$2:$E$2,1,RIGHT(TableRaces[[#This Row],[Driver]])),SUBSTITUTE(TableRaces[[#This Row],[Driver]],\" \",\" \" & CHAR(10)))","v":"Carlos \nSainz"}]
["2022-06-19","Canada",1,"Lewis Hamilton",{"$f":"IF(LEFT(TableRaces[[#This Row],[Driver]])=\"M\",INDEX(MALL!$A$2:$E$2,1,RIGHT(TableRaces[[#This Row],[Driver]])),SUBSTITUTE(TableRaces[[#This Row],[Driver]],\" \",\" \" & CHAR(10)))","v":"Lewis \nHamilton"}]
["2022-07-03","United Kingdom",3,"M1",{"$f":"IF(LEFT(TableRaces[[#This Row],[Driver]])=\"M\",INDEX(MALL!$A$2:$E$2,1,RIGHT(TableRaces[[#This Row],[Driver]])),SUBSTITUTE(TableRaces[[#This Row],[Driver]],\" \",\" \" & CHAR(10)))","v":"Carlos \nSainz"}]
["2022-07-03","United Kingdom",2,"M5",{"$f":"IF(LEFT(TableRaces[[#This Row],[Driver]])=\"M\",INDEX(MALL!$A$2:$E$2,1,RIGHT(TableRaces[[#This Row],[Driver]])),SUBSTITUTE(TableRaces[[#This Row],[Driver]],\" \",\" \" & CHAR(10)))","v":"Sergio \nPérez"}]
["2022-07-03","United Kingdom",1,"Lewis Hamilton",{"$f":"IF(LEFT(TableRaces[[#This Row],[Driver]])=\"M\",INDEX(MALL!$A$2:$E$2,1,RIGHT(TableRaces[[#This Row],[Driver]])),SUBSTITUTE(TableRaces[[#This Row],[Driver]],\" \",\" \" & CHAR(10)))","v":"Lewis \nHamilton"}]
["2022-07-10","Austria",3,"M3",{"$f":"IF(LEFT(TableRaces[[#This Row],[Driver]])=\"M\",INDEX(MALL!$A$2:$E$2,1,RIGHT(TableRaces[[#This Row],[Driver]])),SUBSTITUTE(TableRaces[[#This Row],[Driver]],\" \",\" \" & CHAR(10)))","v":"Charles \nLeclerc"}]
["2022-07-10","Austria",2,"M4",{"$f":"IF(LEFT(TableRaces[[#This Row],[Driver]])=\"M\",INDEX(MALL!$A$2:$E$2,1,RIGHT(TableRaces[[#This Row],[Driver]])),SUBSTITUTE(TableRaces[[#This Row],[Driver]],\" \",\" \" & CHAR(10)))","v":"Max \nVerstappen"}]
["2022-07-10","Austria",1,"Lewis Hamilton",{"$f":"IF(LEFT(TableRaces[[#This Row],[Driver]])=\"M\",INDEX(MALL!$A$2:$E$2,1,RIGHT(TableRaces[[#This Row],[Driver]])),SUBSTITUTE(TableRaces[[#This Row],[Driver]],\" \",\" \" & CHAR(10)))","v":"Lewis \nHamilton"}]
["2022-07-24","France",3,"M4",{"$f":"IF(LEFT(TableRaces[[#This Row],[Driver]])=\"M\",INDEX(MALL!$A$2:$E$2,1,RIGHT(TableRaces[[#This Row],[Driver]])),SUBSTITUTE(TableRaces[[#This Row],[Driver]],\" \",\" \" & CHAR(10)))","v":"Max \nVerstappen"}]
["2022-07-24","France",2,"Lewis Hamilton",{"$f":"IF(LEFT(TableRaces[[#This Row],[Driver]])=\"M\",INDEX(MALL!$A$2:$E$2,1,RIGHT(TableRaces[[#This Row],[Driver]])),SUBSTITUTE(TableRaces[[#This Row],[Driver]],\" \",\" \" & CHAR(10)))","v":"Lewis \nHamilton"}]
["2022-07-24","France",1,"George Russell",{"$f":"IF(LEFT(TableRaces[[#This Row],[Driver]])=\"M\",INDEX(MALL!$A$2:$E$2,1,RIGHT(TableRaces[[#This Row],[Driver]])),SUBSTITUTE(TableRaces[[#This Row],[Driver]],\" \",\" \" & CHAR(10)))","v":"George \nRussell"}]
["2022-07-31","Hungary",3,"M4",{"$f":"IF(LEFT(TableRaces[[#This Row],[Driver]])=\"M\",INDEX(MALL!$A$2:$E$2,1,RIGHT(TableRaces[[#This Row],[Driver]])),SUBSTITUTE(TableRaces[[#This Row],[Driver]],\" \",\" \" & CHAR(10)))","v":"Max \nVerstappen"}]
["2022-07-31","Hungary",2,"Lewis Hamilton",{"$f":"IF(LEFT(TableRaces[[#This Row],[Driver]])=\"M\",INDEX(MALL!$A$2:$E$2,1,RIGHT(TableRaces[[#This Row],[Driver]])),SUBSTITUTE(TableRaces[[#This Row],[Driver]],\" \",\" \" & CHAR(10)))","v":"Lewis \nHamilton"}]
["2022-07-31","Hungary",1,"George Russell",{"$f":"IF(LEFT(TableRaces[[#This Row],[Driver]])=\"M\",INDEX(MALL!$A$2:$E$2,1,RIGHT(TableRaces[[#This Row],[Driver]])),SUBSTITUTE(TableRaces[[#This Row],[Driver]],\" \",\" \" & CHAR(10)))","v":"George \nRussell"}]
["2022-08-28","Belgium",3,"M4",{"$f":"IF(LEFT(TableRaces[[#This Row],[Driver]])=\"M\",INDEX(MALL!$A$2:$E$2,1,RIGHT(TableRaces[[#This Row],[Driver]])),SUBSTITUTE(TableRaces[[#This Row],[Driver]],\" \",\" \" & CHAR(10)))","v":"Max \nVerstappen"}]
["2022-08-28","Belgium",2,"M5",{"$f":"IF(LEFT(TableRaces[[#This Row],[Driver]])=\"M\",INDEX(MALL!$A$2:$E$2,1,RIGHT(TableRaces[[#This Row],[Driver]])),SUBSTITUTE(TableRaces[[#This Row],[Driver]],\" \",\" \" & CHAR(10)))","v":"Sergio \nPérez"}]
["2022-08-28","Belgium",1,"M1",{"$f":"IF(LEFT(TableRaces[[#This Row],[Driver]])=\"M\",INDEX(MALL!$A$2:$E$2,1,RIGHT(TableRaces[[#This Row],[Driver]])),SUBSTITUTE(TableRaces[[#This Row],[Driver]],\" \",\" \" & CHAR(10)))","v":"Carlos \nSainz"}]
["2022-09-04","Netherlands",3,"M4",{"$f":"IF(LEFT(TableRaces[[#This Row],[Driver]])=\"M\",INDEX(MALL!$A$2:$E$2,1,RIGHT(TableRaces[[#This Row],[Driver]])),SUBSTITUTE(TableRaces[[#This Row],[Driver]],\" \",\" \" & CHAR(10)))","v":"Max \nVerstappen"}]
["2022-09-04","Netherlands",2,"George Russell",{"$f":"IF(LEFT(TableRaces[[#This Row],[Driver]])=\"M\",INDEX(MALL!$A$2:$E$2,1,RIGHT(TableRaces[[#This Row],[Driver]])),SUBSTITUTE(TableRaces[[#This Row],[Driver]],\" \",\" \" & CHAR(10)))","v":"George \nRussell"}]
["2022-09-04","Netherlands",1,"M3",{"$f":"IF(LEFT(TableRaces[[#This Row],[Driver]])=\"M\",INDEX(MALL!$A$2:$E$2,1,RIGHT(TableRaces[[#This Row],[Driver]])),SUBSTITUTE(TableRaces[[#This Row],[Driver]],\" \",\" \" & CHAR(10)))","v":"Charles \nLeclerc"}]
["2022-09-11","Italy",3,"M4",{"$f":"IF(LEFT(TableRaces[[#This Row],[Driver]])=\"M\",INDEX(MALL!$A$2:$E$2,1,RIGHT(TableRaces[[#This Row],[Driver]])),SUBSTITUTE(TableRaces[[#This Row],[Driver]],\" \",\" \" & CHAR(10)))","v":"Max \nVerstappen"}]
["2022-09-11","Italy",2,"M3",{"$f":"IF(LEFT(TableRaces[[#This Row],[Driver]])=\"M\",INDEX(MALL!$A$2:$E$2,1,RIGHT(TableRaces[[#This Row],[Driver]])),SUBSTITUTE(TableRaces[[#This Row],[Driver]],\" \",\" \" & CHAR(10)))","v":"Charles \nLeclerc"}]
["2022-09-11","Italy",1,"George Russell",{"$f":"IF(LEFT(TableRaces[[#This Row],[Driver]])=\"M\",INDEX(MALL!$A$2:$E$2,1,RIGHT(TableRaces[[#This Row],[Driver]])),SUBSTITUTE(TableRaces[[#This Row],[Driver]],\" \",\" \" & CHAR(10)))","v":"George \nRussell"}]
["2022-10-02","Singapore",3,"M5",{"$f":"IF(LEFT(TableRaces[[#This Row],[Driver]])=\"M\",INDEX(MALL!$A$2:$E$2,1,RIGHT(TableRaces[[#This Row],[Driver]])),SUBSTITUTE(TableRaces[[#This Row],[Driver]],\" \",\" \" & CHAR(10)))","v":"Sergio \nPérez"}]
["2022-10-02","Singapore",2,"M3",{"$f":"IF(LEFT(TableRaces[[#This Row],[Driver]])=\"M\",INDEX(MALL!$A$2:$E$2,1,RIGHT(TableRaces[[#This Row],[Driver]])),SUBSTITUTE(TableRaces[[#This Row],[Driver]],\" \",\" \" & CHAR(10)))","v":"Charles \nLeclerc"}]
["2022-10-02","Singapore",1,"M1",{"$f":"IF(LEFT(TableRaces[[#This Row],[Driver]])=\"M\",INDEX(MALL!$A$2:$E$2,1,RIGHT(TableRaces[[#This Row],[Driver]])),SUBSTITUTE(TableRaces[[#This Row],[Driver]],\" \",\" \" & CHAR(10)))","v":"Carlos \nSainz"}]
["2022-10-09","Japan",3,"M4",{"$f":"IF(LEFT(TableRaces[[#This Row],[Driver]])=\"M\",INDEX(MALL!$A$2:$E$2,1,RIGHT(TableRaces[[#This Row],[Driver]])),SUBSTITUTE(TableRaces[[#This Row],[Driver]],\" \",\" \" & CHAR(10)))","v":"Max \nVerstappen"}]
["2022-10-09","Japan",2,"M5",{"$f":"IF(LEFT(TableRaces[[#This Row],[Driver]])=\"M\",INDEX(MALL!$A$2:$E$2,1,RIGHT(TableRaces[[#This Row],[Driver]])),SUBSTITUTE(TableRaces[[#This Row],[Driver]],\" \",\" \" & CHAR(10)))","v":"Sergio \nPérez"}]
["2022-10-09","Japan",1,"M3",{"$f":"IF(LEFT(TableRaces[[#This Row],[Driver]])=\"M\",INDEX(MALL!$A$2:$E$2,1,RIGHT(TableRaces[[#This Row],[Driver]])),SUBSTITUTE(TableRaces[[#This Row],[Driver]],\" \",\" \" & CHAR(10)))","v":"Charles \nLeclerc"}]
["2022-10-23","United States",3,"M4",{"$f":"IF(LEFT(TableRaces[[#This Row],[Driver]])=\"M\",INDEX(MALL!$A$2:$E$2,1,RIGHT(TableRaces[[#This Row],[Driver]])),SUBSTITUTE(TableRaces[[#This Row],[Driver]],\" \",\" \" & CHAR(10)))","v":"Max \nVerstappen"}]
["2022-10-23","United States",2,"Lewis Hamilton",{"$f":"IF(LEFT(TableRaces[[#This Row],[Driver]])=\"M\",INDEX(MALL!$A$2:$E$2,1,RIGHT(TableRaces[[#This Row],[Driver]])),SUBSTITUTE(TableRaces[[#This Row],[Driver]],\" \",\" \" & CHAR(10)))","v":"Lewis \nHamilton"}]
["2022-10-23","United States",1,"M3",{"$f":"IF(LEFT(TableRaces[[#This Row],[Driver]])=\"M\",INDEX(MALL!$A$2:$E$2,1,RIGHT(TableRaces[[#This Row],[Driver]])),SUBSTITUTE(TableRaces[[#This Row],[Driver]],\" \",\" \" & CHAR(10)))","v":"Charles \nLeclerc"}]
["2022-10-30","Mexico",3,"M4",{"$f":"IF(LEFT(TableRaces[[#This Row],[Driver]])=\"M\",INDEX(MALL!$A$2:$E$2,1,RIGHT(TableRaces[[#This Row],[Driver]])),SUBSTITUTE(TableRaces[[#This Row],[Driver]],\" \",\" \" & CHAR(10)))","v":"Max \nVerstappen"}]
["2022-10-30","Mexico",2,"Lewis Hamilton",{"$f":"IF(LEFT(TableRaces[[#This Row],[Driver]])=\"M\",INDEX(MALL!$A$2:$E$2,1,RIGHT(TableRaces[[#This Row],[Driver]])),SUBSTITUTE(TableRaces[[#This Row],[Driver]],\" \",\" \" & CHAR(10)))","v":"Lewis \nHamilton"}]
{"$rows_left_out":7}