{"text_format":"1","workbook":"xlsx","n_sheets":8,"sheets":["DASHBOARD","1-Manager","2-Manager","3-Manager","4-Manager","5-Manager","ALL","Processing"],"not_rendered":{"charts":6,"images":5,"macros":1,"external_links":0,"defined_names":0,"comments":0,"pivot_tables":0},"unopened":[],"bounds":{"document_bytes":16777216,"sheet_cells":100000,"rows_first":2000,"rows_last":500,"rows_between":2000,"halvings":0,"cell_chars":16384,"cell_head_chars":4096},"cells_cut":0,"cells_raw":0,"read":"whole","date_system":"1900"}

{"sheet":"DASHBOARD","index":0,"n_rows":35,"n_cols":28,"rows_kept":35,"cut":false,"hidden":false,"merged":[[2,1,2,2],[17,1,17,2],[17,5,17,6],[34,2,34,9]]}
[5,145,null,null,null,null,null,null,null,null,null,null,null,null,null,null,null,null,null,null,null,null,null,null,81,23.6,51,5]
[1,{"$f":"\"0\"&A2","v":"01"},null,null,null,null,null,null,null,null,null,null,null,null,null,null,null,null,null,null,null,null,null,null,96,30.4,52,75]
[null,"PRODUCTS BY DAYS",null,null,null,null,null,null,null,null,null,null,null,null,null,null,null,null,"RATING OF PRODUCTS",null,null,null,null,null,110,36,53,145]
[290,75,null,null,null,null,null,null,null,null,null,null,null,null,null,null,null,null,null,null,null,null,null,null,96,30.4,54,220]
[null,null,null,null,null,null,null,null,null,null,null,null,null,null,null,null,null,null,null,null,null,null,null,null,81,23.6,55,290]
[null,null,null,null,null,null,null,null,null,null,null,null,null,null,null,null,null,null,null,null,null,null,null,null,96,30.4,751]
[null,null,null,null,null,null,null,null,null,null,null,null,null,null,null,null,null,null,null,null,null,null,null,null,110,36,752]
[null,null,null,null,null,null,null,null,null,null,null,null,null,null,null,null,null,null,null,null,null,null,null,null,96,30.4,753]
[null,null,null,null,null,null,null,null,null,null,null,null,null,null,null,null,null,null,null,null,null,null,null,null,81,23.6,754]
[null,null,null,null,null,null,null,null,null,null,null,null,null,null,null,null,null,null,null,null,null,null,null,null,81,23.6,755]
[null,null,null,null,null,null,null,null,null,null,null,null,null,null,null,null,null,null,null,null,null,null,null,null,110,36,1451]
[null,null,null,null,null,null,null,null,null,null,null,null,null,null,null,null,null,null,null,null,null,null,null,null,96,30.4,1452]
[null,null,null,null,null,null,null,null,null,null,null,null,null,null,null,null,null,null,null,null,null,null,null,null,81,23.6,1453]
[null,null,null,null,null,null,null,null,null,null,null,null,null,null,null,null,null,null,null,null,null,null,null,null,81,23.6,1454]
[null,null,null,null,null,null,null,null,null,null,null,null,null,null,null,null,null,null,null,null,null,null,null,null,96,30.4,1455]
[null,null,null,null,null,null,null,null,null,null,null,null,null,null,null,null,null,null,null,null,null,null,null,null,96,30.4,2201]
[null,null,null,null,null,null,null,null,null,null,null,null,null,null,null,null,null,null,null,null,null,null,null,null,81,23.6,2202]
[null,"SALES FOR THE YEAR",null,null,null,"heatmap",null,null,null,null,null,null,null,null,null,null,null,null,"SEGMENTATION",null,null,null,null,null,81,23.6,2203]
[null,null,null,null,null,null,null,null,null,null,null,null,null,null,null,null,null,null,null,null,null,null,null,null,96,30.4,2204]
[null,null,null,null,null,null,null,null,null,null,null,null,null,null,null,null,null,null,null,null,null,null,null,null,110,36,2205]
[null,null,null,null,null,null,null,null,null,null,null,null,null,null,null,null,null,null,null,null,null,null,null,null,81,23.6,2901]
[null,null,null,null,null,null,null,null,null,null,null,null,null,null,null,null,null,null,null,null,null,null,null,null,81,23.6,2902]
[null,null,null,null,null,null,null,null,null,null,null,null,null,null,null,null,null,null,null,null,null,null,null,null,96,30.4,2903]
[null,null,null,null,null,null,null,null,null,null,null,null,null,null,null,null,null,null,null,null,null,null,null,null,110,36,2904]
[null,null,null,null,null,null,null,null,null,null,null,null,null,null,null,null,null,null,null,null,null,null,null,null,96,30.4,2905]
[]
[]
[]
[]
[]
[]
[]
[null,null,null,null,null,null,null,null,null,null,"https://exceltable.com/"]
[]
[null,null,"https://exceltable.com/en/templates/3d-menu-for-dashboard-in-excel"]

{"sheet":"1-Manager","index":1,"n_rows":369,"n_cols":10,"rows_kept":369,"cut":false,"hidden":false,"merged":[[0,9,0,19],[0,8,1,8],[0,7,1,7],[0,0,1,0],[0,1,0,4],[0,6,1,6],[0,5,1,5]]}
["Date","Product Groups",null,null,null,"Total sales","State","Days of the week","№ Month","https://exceltable.com/en/templates/3d-menu-for-dashboard-in-excel"]
[null,"A","B","C","D"]
["2020-01-01",165,93,89,39,{"$f":"SUM(B3:E3)","v":386},"Alabama",{"$f":"WEEKDAY(A3,2)","v":3},{"$f":"MONTH(A3)","v":1}]
["2020-01-02",109,54,52,28,{"$f":"SUM(B4:E4)","v":243},"Alabama",{"$f":"WEEKDAY(A4,2)","v":4},{"$f":"MONTH(A4)","v":1}]
["2020-01-03",146,82,104,13,345,"Alabama",5,1]
["2020-01-04",181,79,123,39,422,"Alabama",6,1]
["2020-01-05",14,31,13,11,69,"Alabama",7,1]
["2020-01-06",38,48,45,6,137,"Alabama",1,1]
["2020-01-07",21,85,118,20,244,"Alabama",2,1]
["2020-01-08",99,83,16,28,226,"Alabama",3,1]
["2020-01-09",30,19,112,11,172,"Alabama",4,1]
["2020-01-10",83,81,40,34,238,"Alabama",5,1]
["2020-01-11",199,93,70,24,386,"Alabama",6,1]
["2020-01-12",26,16,35,3,80,"Alabama",7,1]
["2020-01-13",66,27,67,10,170,"Alabama",1,1]
["2020-01-14",92,61,117,44,314,"Alabama",2,1]
["2020-01-15",181,97,31,6,315,"Alabama",3,1]
["2020-01-16",183,44,106,10,343,"Alabama",4,1]
["2020-01-17",61,50,30,23,164,"Alabama",5,1]
["2020-01-18",81,19,75,35,210,"Alabama",6,1]
["2020-01-19",60,4,13,13,90,"Alabama",7,1]
["2020-01-20",45,16,27,3,91,"Alabama",1,1]
["2020-01-21",67,68,107,23,265,"Alabama",2,1]
["2020-01-22",181,22,28,5,236,"Alabama",3,1]
["2020-01-23",68,21,30,38,157,"Alabama",4,1]
["2020-01-24",98,15,84,16,213,"Alabama",5,1]
["2020-01-25",146,25,134,16,321,"Alabama",6,1]
["2020-01-26",54,25,24,15,118,"Alabama",7,1]
["2020-01-27",35,20,50,20,125,"Alabama",1,1]
["2020-01-28",110,77,129,47,363,"Alabama",2,1]
["2020-01-29",22,55,60,38,175,"Alabama",3,1]
["2020-01-30",92,74,33,19,218,"Alabama",4,1]
["2020-01-31",195,33,24,47,299,"Alabama",5,1]
["2020-02-01",121,50,27,43,241,"Arizona",6,2]
["2020-02-02",56,16,49,13,134,"Arizona",7,2]
["2020-02-03",10,14,22,5,51,"Arizona",1,2]
["2020-02-04",70,43,113,32,258,"Arizona",2,2]
["2020-02-05",85,79,90,12,266,"Arizona",3,2]
["2020-02-06",53,91,63,16,223,"Arizona",4,2]
["2020-02-07",84,36,25,41,186,"Arizona",5,2]
["2020-02-08",75,65,61,42,243,"Arizona",6,2]
["2020-02-09",56,28,26,12,122,"Arizona",7,2]
["2020-02-10",45,6,61,15,127,"Arizona",1,2]
["2020-02-11",167,18,34,6,225,"Arizona",2,2]
["2020-02-12",90,68,22,49,229,"Arizona",3,2]
["2020-02-13",153,18,47,10,228,"Arizona",4,2]
["2020-02-14",69,50,122,48,289,"Arizona",5,2]
["2020-02-15",162,96,64,45,367,"Arizona",6,2]
["2020-02-16",15,32,41,16,104,"Arizona",7,2]
["2020-02-17",41,21,7,2,71,"Arizona",1,2]
["2020-02-18",144,98,71,48,361,"Arizona",2,2]
["2020-02-19",123,64,42,41,270,"Arizona",3,2]
["2020-02-20",45,42,78,46,211,"Arizona",4,2]
["2020-02-21",29,35,37,16,117,"Arizona",5,2]
["2020-02-22",111,96,21,25,253,"Arizona",6,2]
["2020-02-23",17,29,20,4,70,"Arizona",7,2]
["2020-02-24",20,24,66,18,128,"Arizona",1,2]
["2020-02-25",98,10,126,6,240,"Arizona",2,2]
["2020-02-26",96,99,122,35,352,"Arizona",3,2]
["2020-02-27",40,58,122,49,269,"Arizona",4,2]
["2020-02-28",170,57,16,22,265,"Arizona",5,2]
["2020-02-29",167,28,81,36,312,"Arizona",6,2]
["2020-03-01",12,16,47,14,89,"Arkansas",7,3]
["2020-03-02",75,37,28,19,159,"Arkansas",1,3]
["2020-03-03",129,18,126,6,279,"Arkansas",2,3]
["2020-03-04",126,85,144,17,372,"Arkansas",3,3]
["2020-03-05",122,40,142,14,318,"Arkansas",4,3]
["2020-03-06",172,76,62,25,{"$f":"SUM(B68:E68)","v":335},"Arkansas",{"$f":"WEEKDAY(A68,2)","v":5},{"$f":"MONTH(A68)","v":3}]
["2020-03-07",193,50,102,15,360,"Arkansas",6,3]
["2020-03-08",63,16,44,14,137,"Arkansas",7,3]
["2020-03-09",79,40,71,16,206,"Arkansas",1,3]
["2020-03-10",135,62,30,20,247,"Arkansas",2,3]
["2020-03-11",63,46,59,19,187,"Arkansas",3,3]
["2020-03-12",165,26,32,23,246,"Arkansas",4,3]
["2020-03-13",174,58,119,47,398,"Arkansas",5,3]
["2020-03-14",62,76,40,32,210,"Arkansas",6,3]
["2020-03-15",50,27,45,2,124,"Arkansas",7,3]
["2020-03-16",33,26,15,7,81,"Arkansas",1,3]
["2020-03-17",120,15,97,13,245,"Arkansas",2,3]
["2020-03-18",28,91,142,6,267,"Arkansas",3,3]
["2020-03-19",59,47,38,14,158,"Arkansas",4,3]
["2020-03-20",119,29,86,39,273,"Arkansas",5,3]
["2020-03-21",59,87,100,33,279,"Arkansas",6,3]
["2020-03-22",55,33,13,13,114,"Arkansas",7,3]
["2020-03-23",50,48,60,9,167,"Arkansas",1,3]
["2020-03-24",169,35,133,15,352,"Arkansas",2,3]
["2020-03-25",150,81,125,36,392,"Arkansas",3,3]
["2020-03-26",61,15,23,16,115,"Arkansas",4,3]
["2020-03-27",66,52,138,35,291,"Arkansas",5,3]
["2020-03-28",94,55,25,36,210,"Arkansas",6,3]
["2020-03-29",66,26,29,10,131,"Arkansas",7,3]
["2020-03-30",96,20,65,9,190,"Arkansas",1,3]
["2020-03-31",164,15,77,21,277,"Arkansas",2,3]
["2020-04-01",132,65,127,43,367,"California",3,4]
["2020-04-02",136,85,100,34,355,"California",4,4]
["2020-04-03",68,84,52,8,212,"California",5,4]
["2020-04-04",165,16,53,49,283,"California",6,4]
["2020-04-05",26,10,26,10,72,"California",7,4]
["2020-04-06",58,25,57,16,156,"California",1,4]
["2020-04-07",128,32,103,11,274,"California",2,4]
["2020-04-08",182,23,121,36,362,"California",3,4]
["2020-04-09",81,84,149,5,319,"California",4,4]
["2020-04-10",42,95,68,23,228,"California",5,4]
["2020-04-11",180,14,44,15,253,"California",6,4]
["2020-04-12",66,10,9,3,88,"California",7,4]
["2020-04-13",29,5,12,5,51,"California",1,4]
["2020-04-14",30,53,77,13,173,"California",2,4]
["2020-04-15",177,15,117,19,328,"California",3,4]
["2020-04-16",150,53,94,7,304,"California",4,4]
["2020-04-17",177,32,143,28,380,"California",5,4]
["2020-04-18",89,50,130,10,279,"California",6,4]
["2020-04-19",60,21,10,10,101,"California",7,4]
["2020-04-20",85,13,16,4,118,"California",1,4]
["2020-04-21",117,30,40,47,234,"California",2,4]
["2020-04-22",29,25,38,36,128,"California",3,4]
["2020-04-23",78,60,142,41,321,"California",4,4]
["2020-04-24",145,44,38,32,259,"California",5,4]
["2020-04-25",78,85,118,38,319,"California",6,4]
["2020-04-26",24,25,7,16,72,"California",7,4]
["2020-04-27",15,48,69,9,141,"California",1,4]
["2020-04-28",198,15,147,12,372,"California",2,4]
["2020-04-29",158,82,94,48,382,"California",3,4]
["2020-04-30",101,61,126,43,331,"California",4,4]
["2020-05-01",99,73,116,45,333,"Colorado",5,5]
["2020-05-02",58,20,41,37,156,"Colorado",6,5]
["2020-05-03",31,13,13,10,67,"Colorado",7,5]
["2020-05-04",71,29,23,22,145,"Colorado",1,5]
["2020-05-05",104,35,50,46,235,"Colorado",2,5]
["2020-05-06",70,21,23,14,128,"Colorado",3,5]
["2020-05-07",77,82,61,40,260,"Colorado",4,5]
["2020-05-08",48,97,98,44,287,"Colorado",5,5]
["2020-05-09",82,88,78,43,{"$f":"SUM(B132:E132)","v":291},"Colorado",{"$f":"WEEKDAY(A132,2)","v":6},{"$f":"MONTH(A132)","v":5}]
["2020-05-10",35,5,16,2,58,"Colorado",7,5]
["2020-05-11",97,44,29,13,183,"Colorado",1,5]
["2020-05-12",93,69,90,32,284,"Colorado",2,5]
["2020-05-13",198,83,40,41,362,"Colorado",3,5]
["2020-05-14",106,70,46,16,238,"Colorado",4,5]
["2020-05-15",183,37,53,6,279,"Colorado",5,5]
["2020-05-16",191,23,29,20,263,"Colorado",6,5]
["2020-05-17",13,22,9,6,50,"Colorado",7,5]
["2020-05-18",76,35,44,14,169,"Colorado",1,5]
["2020-05-19",188,61,103,13,365,"Colorado",2,5]
["2020-05-20",48,14,115,19,196,"Colorado",3,5]
["2020-05-21",196,75,69,21,361,"Colorado",4,5]
["2020-05-22",37,94,138,48,317,"Colorado",5,5]
["2020-05-23",71,67,66,13,217,"Colorado",6,5]
["2020-05-24",63,22,31,11,127,"Colorado",7,5]
["2020-05-25",62,50,47,15,174,"Colorado",1,5]
["2020-05-26",176,30,85,17,308,"Colorado",2,5]
["2020-05-27",51,91,145,30,317,"Colorado",3,5]
["2020-05-28",54,69,28,39,190,"Colorado",4,5]
["2020-05-29",130,30,122,29,311,"Colorado",5,5]
["2020-05-30",179,62,57,23,321,"Colorado",6,5]
["2020-05-31",31,11,39,4,85,"Colorado",7,5]
["2020-06-01",10,42,51,7,110,"Connecticut",1,6]
["2020-06-02",54,80,147,47,328,"Connecticut",2,6]
["2020-06-03",91,73,107,14,285,"Connecticut",3,6]
["2020-06-04",156,72,104,21,353,"Connecticut",4,6]
["2020-06-05",55,90,123,11,279,"Connecticut",5,6]
["2020-06-06",180,87,18,16,301,"Connecticut",6,6]
["2020-06-07",15,15,20,11,61,"Connecticut",7,6]
["2020-06-08",86,48,51,25,210,"Connecticut",1,6]
["2020-06-09",48,98,145,43,334,"Connecticut",2,6]
["2020-06-10",90,73,23,24,210,"Connecticut",3,6]
["2020-06-11",186,26,49,28,289,"Connecticut",4,6]
["2020-06-12",62,99,90,8,259,"Connecticut",5,6]
["2020-06-13",99,14,141,49,303,"Connecticut",6,6]
["2020-06-14",42,10,39,15,106,"Connecticut",7,6]
["2020-06-15",13,32,17,3,65,"Connecticut",1,6]
["2020-06-16",126,34,100,44,304,"Connecticut",2,6]
["2020-06-17",178,27,59,12,276,"Connecticut",3,6]
["2020-06-18",186,60,72,9,327,"Connecticut",4,6]
["2020-06-19",109,84,47,36,276,"Connecticut",5,6]
["2020-06-20",65,46,62,22,195,"Connecticut",6,6]
["2020-06-21",16,27,47,14,104,"Connecticut",7,6]
["2020-06-22",95,8,9,12,124,"Connecticut",1,6]
["2020-06-23",67,54,43,6,170,"Connecticut",2,6]
["2020-06-24",67,23,148,12,250,"Connecticut",3,6]
["2020-06-25",195,17,61,28,301,"Connecticut",4,6]
["2020-06-26",193,72,78,6,349,"Connecticut",5,6]
["2020-06-27",55,65,112,39,271,"Connecticut",6,6]
["2020-06-28",62,14,30,6,112,"Connecticut",7,6]
["2020-06-29",61,42,24,2,129,"Connecticut",1,6]
["2020-06-30",79,93,107,50,329,"Connecticut",2,6]
["2020-07-01",54,88,103,6,251,"Delaware",3,7]
["2020-07-02",131,59,143,18,351,"Delaware",4,7]
["2020-07-03",118,25,16,14,173,"Delaware",5,7]
["2020-07-04",90,35,145,27,297,"Delaware",6,7]
["2020-07-05",15,20,45,7,87,"Delaware",7,7]
["2020-07-06",94,43,41,5,183,"Delaware",1,7]
["2020-07-07",35,89,56,45,225,"Delaware",2,7]
["2020-07-08",30,50,64,31,175,"Delaware",3,7]
["2020-07-09",86,49,47,44,226,"Delaware",4,7]
["2020-07-10",85,91,108,5,289,"Delaware",5,7]
["2020-07-11",68,94,118,15,295,"Delaware",6,7]
["2020-07-12",48,13,10,12,{"$f":"SUM(B196:E196)","v":83},"Delaware",{"$f":"WEEKDAY(A196,2)","v":7},{"$f":"MONTH(A196)","v":7}]
["2020-07-13",75,39,16,25,155,"Delaware",1,7]
["2020-07-14",178,89,31,10,308,"Delaware",2,7]
["2020-07-15",51,75,136,49,311,"Delaware",3,7]
["2020-07-16",67,96,56,27,246,"Delaware",4,7]
["2020-07-17",37,39,107,22,205,"Delaware",5,7]
["2020-07-18",178,62,89,25,354,"Delaware",6,7]
["2020-07-19",40,10,35,11,96,"Delaware",7,7]
["2020-07-20",37,13,31,22,103,"Delaware",1,7]
["2020-07-21",187,50,142,43,422,"Delaware",2,7]
["2020-07-22",84,46,123,15,268,"Delaware",3,7]
["2020-07-23",122,97,63,18,300,"Delaware",4,7]
["2020-07-24",79,86,127,35,327,"Delaware",5,7]
["2020-07-25",124,22,120,24,290,"Delaware",6,7]
["2020-07-26",16,20,19,3,58,"Delaware",7,7]
["2020-07-27",18,41,48,3,110,"Delaware",1,7]
["2020-07-28",189,73,60,34,356,"Delaware",2,7]
["2020-07-29",134,78,104,30,346,"Delaware",3,7]
["2020-07-30",141,15,92,21,269,"Delaware",4,7]
["2020-07-31",83,65,131,43,322,"Delaware",5,7]
["2020-08-01",79,75,105,38,297,"Florida",6,8]
["2020-08-02",62,30,44,15,151,"Florida",7,8]
["2020-08-03",77,39,55,9,180,"Florida",1,8]
["2020-08-04",167,96,24,17,304,"Florida",2,8]
["2020-08-05",25,42,43,7,117,"Florida",3,8]
["2020-08-06",28,16,85,5,134,"Florida",4,8]
["2020-08-07",38,67,147,38,290,"Florida",5,8]
["2020-08-08",160,55,73,8,296,"Florida",6,8]
["2020-08-09",36,30,47,2,115,"Florida",7,8]
["2020-08-10",70,35,25,17,147,"Florida",1,8]
["2020-08-11",71,59,107,12,249,"Florida",2,8]
["2020-08-12",76,90,25,27,218,"Florida",3,8]
["2020-08-13",143,92,59,24,318,"Florida",4,8]
["2020-08-14",157,76,63,46,342,"Florida",5,8]
["2020-08-15",25,87,146,20,278,"Florida",6,8]
["2020-08-16",37,17,31,9,94,"Florida",7,8]
["2020-08-17",83,7,62,13,165,"Florida",1,8]
["2020-08-18",57,72,149,27,305,"Florida",2,8]
["2020-08-19",43,67,101,39,250,"Florida",3,8]
["2020-08-20",50,61,88,10,209,"Florida",4,8]
["2020-08-21",189,87,43,15,334,"Florida",5,8]
["2020-08-22",140,19,88,49,296,"Florida",6,8]
["2020-08-23",35,12,29,12,88,"Florida",7,8]
["2020-08-24",89,17,44,24,174,"Florida",1,8]
["2020-08-25",190,74,139,42,445,"Florida",2,8]
["2020-08-26",31,45,96,45,217,"Florida",3,8]
["2020-08-27",183,35,57,33,308,"Florida",4,8]
["2020-08-28",112,21,21,30,184,"Florida",5,8]
["2020-08-29",58,12,71,26,167,"Florida",6,8]
["2020-08-30",52,9,25,4,90,"Florida",7,8]
["2020-08-31",60,5,22,19,106,"Florida",1,8]
["2020-09-01",56,55,144,28,283,"Georgia",2,9]
["2020-09-02",195,24,121,18,358,"Georgia",3,9]
["2020-09-03",52,100,149,29,330,"Georgia",4,9]
["2020-09-04",145,73,92,8,318,"Georgia",5,9]
["2020-09-05",168,56,143,18,385,"Georgia",6,9]
["2020-09-06",35,4,19,14,72,"Georgia",7,9]
["2020-09-07",35,27,39,23,124,"Georgia",1,9]
["2020-09-08",178,17,39,27,261,"Georgia",2,9]
["2020-09-09",72,31,99,42,244,"Georgia",3,9]
["2020-09-10",152,92,53,49,346,"Georgia",4,9]
["2020-09-11",179,67,126,48,420,"Georgia",5,9]
["2020-09-12",90,11,26,11,138,"Georgia",6,9]
["2020-09-13",13,25,50,10,98,"Georgia",7,9]
["2020-09-14",28,35,22,8,{"$f":"SUM(B260:E260)","v":93},"Georgia",{"$f":"WEEKDAY(A260,2)","v":1},{"$f":"MONTH(A260)","v":9}]
["2020-09-15",23,50,66,5,144,"Georgia",2,9]
["2020-09-16",146,16,149,47,358,"Georgia",3,9]
["2020-09-17",62,22,38,37,159,"Georgia",4,9]
["2020-09-18",189,15,126,34,364,"Georgia",5,9]
["2020-09-19",21,77,17,16,131,"Georgia",6,9]
["2020-09-20",17,22,19,16,74,"Georgia",7,9]
["2020-09-21",20,14,14,22,70,"Georgia",1,9]
["2020-09-22",69,19,24,43,155,"Georgia",2,9]
["2020-09-23",185,86,126,16,413,"Georgia",3,9]
["2020-09-24",198,42,103,23,366,"Georgia",4,9]
["2020-09-25",111,73,18,47,249,"Georgia",5,9]
["2020-09-26",27,39,134,28,228,"Georgia",6,9]
["2020-09-27",51,13,8,9,81,"Georgia",7,9]
["2020-09-28",24,8,40,15,87,"Georgia",1,9]
["2020-09-29",78,52,144,5,279,"Georgia",2,9]
["2020-09-30",90,79,99,46,314,"Georgia",3,9]
["2020-10-01",27,18,40,23,108,"Idaho",4,10]
["2020-10-02",171,54,63,34,322,"Idaho",5,10]
["2020-10-03",44,94,28,16,182,"Idaho",6,10]
["2020-10-04",30,10,35,9,84,"Idaho",7,10]
["2020-10-05",31,41,59,25,156,"Idaho",1,10]
["2020-10-06",149,25,110,35,319,"Idaho",2,10]
["2020-10-07",84,95,30,22,231,"Idaho",3,10]
["2020-10-08",157,39,37,6,239,"Idaho",4,10]
["2020-10-09",161,49,71,11,292,"Idaho",5,10]
["2020-10-10",175,55,56,34,320,"Idaho",6,10]
["2020-10-11",33,8,20,11,72,"Idaho",7,10]
["2020-10-12",71,17,61,13,162,"Idaho",1,10]
["2020-10-13",29,88,110,28,255,"Idaho",2,10]
["2020-10-14",94,93,118,30,335,"Idaho",3,10]
["2020-10-15",125,95,27,14,261,"Idaho",4,10]
["2020-10-16",159,28,141,14,342,"Idaho",5,10]
["2020-10-17",41,79,87,5,212,"Idaho",6,10]
["2020-10-18",44,6,6,7,63,"Idaho",7,10]
["2020-10-19",47,46,57,9,159,"Idaho",1,10]
["2020-10-20",143,49,142,37,371,"Idaho",2,10]
["2020-10-21",77,85,54,11,227,"Idaho",3,10]
["2020-10-22",30,32,148,11,221,"Idaho",4,10]
["2020-10-23",53,49,26,18,146,"Idaho",5,10]
["2020-10-24",89,28,141,37,295,"Idaho",6,10]
["2020-10-25",22,5,20,3,50,"Idaho",7,10]
["2020-10-26",95,48,41,25,209,"Idaho",1,10]
["2020-10-27",82,64,40,19,205,"Idaho",2,10]
["2020-10-28",150,100,74,32,356,"Idaho",3,10]
["2020-10-29",115,16,44,29,204,"Idaho",4,10]
["2020-10-30",47,89,20,48,204,"Idaho",5,10]
["2020-10-31",146,32,105,6,289,"Idaho",6,10]
["2020-11-01",26,13,12,15,66,"Alabama",7,11]
["2020-11-02",22,23,72,11,128,"Alabama",1,11]
["2020-11-03",109,69,148,42,368,"Alabama",2,11]
["2020-11-04",44,37,39,37,157,"Alabama",3,11]
["2020-11-05",157,96,109,21,383,"Alabama",4,11]
["2020-11-06",76,80,56,10,222,"Alabama",5,11]
["2020-11-07",108,58,19,7,192,"Alabama",6,11]
["2020-11-08",21,32,21,3,77,"Alabama",7,11]
["2020-11-09",47,8,73,9,137,"Alabama",1,11]
["2020-11-10",122,26,101,47,296,"Alabama",2,11]
["2020-11-11",142,61,146,31,380,"Alabama",3,11]
["2020-11-12",22,58,25,20,125,"Alabama",4,11]
["2020-11-13",101,34,29,45,209,"Alabama",5,11]
["2020-11-14",120,51,114,42,327,"Alabama",6,11]
["2020-11-15",11,19,15,11,56,"Alabama",7,11]
["2020-11-16",19,34,61,20,134,"Alabama",1,11]
["2020-11-17",55,25,24,34,{"$f":"SUM(B324:E324)","v":138},"Alabama",{"$f":"WEEKDAY(A324,2)","v":2},{"$f":"MONTH(A324)","v":11}]
["2020-11-18",113,67,17,10,207,"Alabama",3,11]
["2020-11-19",183,11,95,10,299,"Alabama",4,11]
["2020-11-20",161,70,143,42,416,"Alabama",5,11]
["2020-11-21",122,38,90,24,274,"Alabama",6,11]
["2020-11-22",18,9,36,3,66,"Alabama",7,11]
["2020-11-23",73,45,75,5,198,"Alabama",1,11]
["2020-11-24",127,86,119,8,340,"Alabama",2,11]
["2020-11-25",89,65,132,11,297,"Alabama",3,11]
["2020-11-26",125,36,94,35,290,"Alabama",4,11]
["2020-11-27",193,18,140,40,391,"Alabama",5,11]
["2020-11-28",115,37,53,37,242,"Alabama",6,11]
["2020-11-29",29,7,46,12,94,"Alabama",7,11]
["2020-11-30",75,6,56,3,140,"Alabama",1,11]
["2020-12-01",119,51,83,36,289,"Arizona",2,12]
["2020-12-02",66,26,31,40,163,"Arizona",3,12]
["2020-12-03",43,40,69,26,178,"Arizona",4,12]
["2020-12-04",144,72,71,50,337,"Arizona",5,12]
["2020-12-05",135,70,69,21,295,"Arizona",6,12]
["2020-12-06",60,9,8,16,93,"Arizona",7,12]
["2020-12-07",16,27,65,12,120,"Arizona",1,12]
["2020-12-08",67,32,94,46,239,"Arizona",2,12]
["2020-12-09",57,16,98,26,197,"Arizona",3,12]
["2020-12-10",168,60,129,14,371,"Arizona",4,12]
["2020-12-11",72,96,80,19,267,"Arizona",5,12]
["2020-12-12",166,99,81,37,383,"Arizona",6,12]
["2020-12-13",34,11,17,8,70,"Arizona",7,12]
["2020-12-14",49,5,19,22,95,"Arizona",1,12]
["2020-12-15",53,90,87,43,273,"Arizona",2,12]
["2020-12-16",86,35,111,49,281,"Arizona",3,12]
["2020-12-17",56,95,57,9,217,"Arizona",4,12]
["2020-12-18",158,31,140,46,375,"Arizona",5,12]
["2020-12-19",182,13,20,47,262,"Arizona",6,12]
["2020-12-20",49,8,37,12,106,"Arizona",7,12]
["2020-12-21",47,39,24,19,129,"Arizona",1,12]
["2020-12-22",91,57,101,18,267,"Arizona",2,12]
["2020-12-23",118,80,112,12,322,"Arizona",3,12]
["2020-12-24",84,40,22,36,182,"Arizona",4,12]
["2020-12-25",116,19,69,42,246,"Arizona",5,12]
["2020-12-26",184,97,103,24,408,"Arizona",6,12]
["2020-12-27",40,28,12,5,85,"Arizona",7,12]
["2020-12-28",73,30,67,4,174,"Arizona",1,12]
["2020-12-29",41,14,17,7,79,"Arizona",2,12]
["2020-12-30",109,49,86,33,277,"Arizona",3,12]
["2020-12-31",197,93,76,11,377,"Arizona",4,12]
[null,null,null,null,null,{"$f":"SUM(F3:F368)","v":83893}]

{"sheet":"2-Manager","index":2,"n_rows":369,"n_cols":10,"rows_kept":369,"cut":false,"hidden":false,"merged":[[0,9,0,19],[0,0,1,0],[0,1,0,4],[0,6,1,6],[0,5,1,5],[0,8,1,8],[0,7,1,7]]}
["Date","Product Groups",null,null,null,"Total sales","State","Days of the week","№ Month","https://exceltable.com/en/templates/3d-menu-for-dashboard-in-excel"]
[null,"A","B","C","D"]
["2020-01-01",45,65,67,26,{"$f":"SUM(B3:E3)","v":203},"Illinois",{"$f":"WEEKDAY(A3,2)","v":3},{"$f":"MONTH(A3)","v":1}]
["2020-01-02",67,76,147,48,{"$f":"SUM(B4:E4)","v":338},"Illinois",{"$f":"WEEKDAY(A4,2)","v":4},{"$f":"MONTH(A4)","v":1}]
["2020-01-03",71,90,23,17,201,"Illinois",5,1]
["2020-01-04",84,59,140,25,308,"Illinois",6,1]
["2020-01-05",21,25,16,16,78,"Illinois",7,1]
["2020-01-06",32,70,128,34,264,"Illinois",1,1]
["2020-01-07",17,11,26,23,77,"Illinois",2,1]
["2020-01-08",41,42,23,47,153,"Illinois",3,1]
["2020-01-09",10,24,73,16,123,"Illinois",4,1]
["2020-01-10",30,46,110,40,226,"Illinois",5,1]
["2020-01-11",11,38,51,37,137,"Illinois",6,1]
["2020-01-12",19,16,26,10,71,"Illinois",7,1]
["2020-01-13",60,97,134,45,336,"Illinois",1,1]
["2020-01-14",24,37,53,7,121,"Illinois",2,1]
["2020-01-15",78,75,62,27,242,"Illinois",3,1]
["2020-01-16",86,29,148,5,268,"Illinois",4,1]
["2020-01-17",97,17,145,46,305,"Illinois",5,1]
["2020-01-18",86,70,121,18,295,"Illinois",6,1]
["2020-01-19",21,11,26,8,66,"Illinois",7,1]
["2020-01-20",21,35,104,6,166,"Illinois",1,1]
["2020-01-21",46,49,51,9,155,"Illinois",2,1]
["2020-01-22",16,40,89,7,152,"Illinois",3,1]
["2020-01-23",100,96,82,11,289,"Illinois",4,1]
["2020-01-24",96,19,74,27,216,"Illinois",5,1]
["2020-01-25",51,48,115,26,240,"Illinois",6,1]
["2020-01-26",25,21,16,10,72,"Illinois",7,1]
["2020-01-27",59,87,109,50,305,"Illinois",1,1]
["2020-01-28",17,19,74,15,125,"Illinois",2,1]
["2020-01-29",58,27,130,25,240,"Illinois",3,1]
["2020-01-30",69,33,37,19,158,"Illinois",4,1]
["2020-01-31",62,28,46,38,174,"Illinois",5,1]
["2020-02-01",95,69,58,22,244,"Indiana",6,2]
["2020-02-02",24,25,37,6,92,"Indiana",7,2]
["2020-02-03",67,41,97,13,218,"Indiana",1,2]
["2020-02-04",24,15,40,6,85,"Indiana",2,2]
["2020-02-05",53,34,116,49,252,"Indiana",3,2]
["2020-02-06",19,99,137,8,263,"Indiana",4,2]
["2020-02-07",32,48,67,31,178,"Indiana",5,2]
["2020-02-08",24,16,113,13,166,"Indiana",6,2]
["2020-02-09",13,17,5,9,44,"Indiana",7,2]
["2020-02-10",24,46,137,46,253,"Indiana",1,2]
["2020-02-11",15,9,40,16,80,"Indiana",2,2]
["2020-02-12",87,48,96,36,267,"Indiana",3,2]
["2020-02-13",100,34,109,10,253,"Indiana",4,2]
["2020-02-14",91,14,73,45,223,"Indiana",5,2]
["2020-02-15",72,41,77,11,201,"Indiana",6,2]
["2020-02-16",8,33,11,14,66,"Indiana",7,2]
["2020-02-17",71,20,132,22,245,"Indiana",1,2]
["2020-02-18",27,30,35,3,95,"Indiana",2,2]
["2020-02-19",53,38,78,31,200,"Indiana",3,2]
["2020-02-20",98,13,64,6,181,"Indiana",4,2]
["2020-02-21",52,100,145,45,342,"Indiana",5,2]
["2020-02-22",86,18,17,19,140,"Indiana",6,2]
["2020-02-23",3,28,30,14,75,"Indiana",7,2]
["2020-02-24",63,73,107,41,284,"Indiana",1,2]
["2020-02-25",30,35,22,4,91,"Indiana",2,2]
["2020-02-26",19,97,92,40,248,"Indiana",3,2]
["2020-02-27",35,12,17,5,69,"Indiana",4,2]
["2020-02-28",70,14,18,15,117,"Indiana",5,2]
["2020-02-29",48,15,63,18,144,"Indiana",6,2]
["2020-03-01",4,31,27,11,73,"Iowa",7,3]
["2020-03-02",50,54,67,27,198,"Iowa",1,3]
["2020-03-03",7,20,20,14,61,"Iowa",2,3]
["2020-03-04",32,13,128,50,223,"Iowa",3,3]
["2020-03-05",40,46,75,40,201,"Iowa",4,3]
["2020-03-06",69,80,126,31,{"$f":"SUM(B68:E68)","v":306},"Iowa",{"$f":"WEEKDAY(A68,2)","v":5},{"$f":"MONTH(A68)","v":3}]
["2020-03-07",21,51,133,8,213,"Iowa",6,3]
["2020-03-08",24,9,12,10,55,"Iowa",7,3]
["2020-03-09",33,63,150,15,261,"Iowa",1,3]
["2020-03-10",40,18,65,18,141,"Iowa",2,3]
["2020-03-11",25,15,34,41,115,"Iowa",3,3]
["2020-03-12",71,89,94,33,287,"Iowa",4,3]
["2020-03-13",52,84,46,12,194,"Iowa",5,3]
["2020-03-14",40,80,47,43,210,"Iowa",6,3]
["2020-03-15",5,21,32,14,72,"Iowa",7,3]
["2020-03-16",22,42,129,36,229,"Iowa",1,3]
["2020-03-17",22,42,54,5,123,"Iowa",2,3]
["2020-03-18",55,26,138,19,238,"Iowa",3,3]
["2020-03-19",100,29,115,17,261,"Iowa",4,3]
["2020-03-20",75,26,73,26,200,"Iowa",5,3]
["2020-03-21",44,56,15,7,122,"Iowa",6,3]
["2020-03-22",21,11,49,4,85,"Iowa",7,3]
["2020-03-23",32,51,118,33,234,"Iowa",1,3]
["2020-03-24",17,38,56,16,127,"Iowa",2,3]
["2020-03-25",34,91,115,10,250,"Iowa",3,3]
["2020-03-26",19,74,42,11,146,"Iowa",4,3]
["2020-03-27",23,77,129,45,274,"Iowa",5,3]
["2020-03-28",79,69,116,32,296,"Iowa",6,3]
["2020-03-29",33,4,19,5,61,"Iowa",7,3]
["2020-03-30",94,51,50,5,200,"Iowa",1,3]
["2020-03-31",29,20,48,23,120,"Iowa",2,3]
["2020-04-01",86,59,139,10,294,"Kansas",3,4]
["2020-04-02",63,58,52,19,192,"Kansas",4,4]
["2020-04-03",64,42,121,41,268,"Kansas",5,4]
["2020-04-04",40,97,126,22,285,"Kansas",6,4]
["2020-04-05",31,15,38,13,97,"Kansas",7,4]
["2020-04-06",36,28,37,50,151,"Kansas",1,4]
["2020-04-07",45,7,52,19,123,"Kansas",2,4]
["2020-04-08",100,96,55,8,259,"Kansas",3,4]
["2020-04-09",81,16,21,10,128,"Kansas",4,4]
["2020-04-10",87,38,53,30,208,"Kansas",5,4]
["2020-04-11",51,90,106,45,292,"Kansas",6,4]
["2020-04-12",24,14,34,13,85,"Kansas",7,4]
["2020-04-13",79,57,81,47,264,"Kansas",1,4]
["2020-04-14",22,33,10,3,68,"Kansas",2,4]
["2020-04-15",19,16,63,27,125,"Kansas",3,4]
["2020-04-16",40,54,28,24,146,"Kansas",4,4]
["2020-04-17",27,79,129,33,268,"Kansas",5,4]
["2020-04-18",37,51,99,5,192,"Kansas",6,4]
["2020-04-19",29,14,40,11,94,"Kansas",7,4]
["2020-04-20",53,52,18,21,144,"Kansas",1,4]
["2020-04-21",44,27,42,8,121,"Kansas",2,4]
["2020-04-22",87,10,138,11,246,"Kansas",3,4]
["2020-04-23",21,59,110,25,215,"Kansas",4,4]
["2020-04-24",46,48,15,31,140,"Kansas",5,4]
["2020-04-25",63,69,47,43,222,"Kansas",6,4]
["2020-04-26",23,5,38,7,73,"Kansas",7,4]
["2020-04-27",58,57,145,30,290,"Kansas",1,4]
["2020-04-28",40,6,20,10,76,"Kansas",2,4]
["2020-04-29",14,79,53,11,157,"Kansas",3,4]
["2020-04-30",93,24,34,28,179,"Kansas",4,4]
["2020-05-01",77,99,88,16,280,"Kentucky",5,5]
["2020-05-02",93,37,26,11,167,"Kentucky",6,5]
["2020-05-03",33,25,29,14,101,"Kentucky",7,5]
["2020-05-04",81,48,54,47,230,"Kentucky",1,5]
["2020-05-05",46,15,62,20,143,"Kentucky",2,5]
["2020-05-06",55,33,52,19,159,"Kentucky",3,5]
["2020-05-07",87,54,92,21,254,"Kentucky",4,5]
["2020-05-08",67,33,75,24,199,"Kentucky",5,5]
["2020-05-09",50,42,15,47,{"$f":"SUM(B132:E132)","v":154},"Kentucky",{"$f":"WEEKDAY(A132,2)","v":6},{"$f":"MONTH(A132)","v":5}]
["2020-05-10",21,14,34,2,71,"Kentucky",7,5]
["2020-05-11",70,52,19,23,164,"Kentucky",1,5]
["2020-05-12",32,16,20,14,82,"Kentucky",2,5]
["2020-05-13",65,93,86,44,288,"Kentucky",3,5]
["2020-05-14",24,45,21,32,122,"Kentucky",4,5]
["2020-05-15",39,17,107,50,213,"Kentucky",5,5]
["2020-05-16",70,77,44,41,232,"Kentucky",6,5]
["2020-05-17",16,13,48,1,78,"Kentucky",7,5]
["2020-05-18",33,37,34,22,126,"Kentucky",1,5]
["2020-05-19",22,36,20,13,91,"Kentucky",2,5]
["2020-05-20",72,27,94,44,237,"Kentucky",3,5]
["2020-05-21",55,90,29,32,206,"Kentucky",4,5]
["2020-05-22",33,32,56,29,150,"Kentucky",5,5]
["2020-05-23",11,82,114,33,240,"Kentucky",6,5]
["2020-05-24",5,14,25,3,47,"Kentucky",7,5]
["2020-05-25",79,58,67,37,241,"Kentucky",1,5]
["2020-05-26",9,49,57,3,118,"Kentucky",2,5]
["2020-05-27",28,75,131,35,269,"Kentucky",3,5]
["2020-05-28",72,36,121,29,258,"Kentucky",4,5]
["2020-05-29",74,20,99,33,226,"Kentucky",5,5]
["2020-05-30",24,56,68,43,191,"Kentucky",6,5]
["2020-05-31",12,6,10,11,39,"Kentucky",7,5]
["2020-06-01",91,39,86,20,236,"Louisiana",1,6]
["2020-06-02",43,47,40,24,154,"Louisiana",2,6]
["2020-06-03",85,54,134,26,299,"Louisiana",3,6]
["2020-06-04",17,41,122,25,205,"Louisiana",4,6]
["2020-06-05",37,57,149,15,258,"Louisiana",5,6]
["2020-06-06",44,89,34,50,217,"Louisiana",6,6]
["2020-06-07",18,9,5,9,41,"Louisiana",7,6]
["2020-06-08",26,37,68,27,158,"Louisiana",1,6]
["2020-06-09",15,36,42,22,115,"Louisiana",2,6]
["2020-06-10",35,26,113,26,200,"Louisiana",3,6]
["2020-06-11",99,89,141,49,378,"Louisiana",4,6]
["2020-06-12",93,59,79,10,241,"Louisiana",5,6]
["2020-06-13",88,22,96,40,246,"Louisiana",6,6]
["2020-06-14",9,22,46,4,81,"Louisiana",7,6]
["2020-06-15",89,51,149,46,335,"Louisiana",1,6]
["2020-06-16",6,12,46,8,72,"Louisiana",2,6]
["2020-06-17",90,29,106,35,260,"Louisiana",3,6]
["2020-06-18",97,95,100,23,315,"Louisiana",4,6]
["2020-06-19",81,88,43,12,224,"Louisiana",5,6]
["2020-06-20",83,87,77,21,268,"Louisiana",6,6]
["2020-06-21",33,26,16,15,90,"Louisiana",7,6]
["2020-06-22",93,70,26,18,207,"Louisiana",1,6]
["2020-06-23",6,36,28,3,73,"Louisiana",2,6]
["2020-06-24",94,80,54,46,274,"Louisiana",3,6]
["2020-06-25",37,35,87,38,197,"Louisiana",4,6]
["2020-06-26",10,92,119,24,245,"Louisiana",5,6]
["2020-06-27",90,37,65,21,213,"Louisiana",6,6]
["2020-06-28",6,5,21,11,43,"Louisiana",7,6]
["2020-06-29",23,89,140,14,266,"Louisiana",1,6]
["2020-06-30",30,44,49,7,130,"Louisiana",2,6]
["2020-07-01",71,100,86,44,301,"Maine",3,7]
["2020-07-02",25,68,109,13,215,"Maine",4,7]
["2020-07-03",40,99,70,42,251,"Maine",5,7]
["2020-07-04",16,78,146,29,269,"Maine",6,7]
["2020-07-05",32,18,19,10,79,"Maine",7,7]
["2020-07-06",57,63,53,39,212,"Maine",1,7]
["2020-07-07",22,29,51,13,115,"Maine",2,7]
["2020-07-08",77,51,102,8,238,"Maine",3,7]
["2020-07-09",10,41,128,37,216,"Maine",4,7]
["2020-07-10",61,32,68,11,172,"Maine",5,7]
["2020-07-11",71,62,107,39,279,"Maine",6,7]
["2020-07-12",14,18,39,11,{"$f":"SUM(B196:E196)","v":82},"Maine",{"$f":"WEEKDAY(A196,2)","v":7},{"$f":"MONTH(A196)","v":7}]
["2020-07-13",28,93,34,22,177,"Maine",1,7]
["2020-07-14",37,41,7,2,87,"Maine",2,7]
["2020-07-15",73,11,132,11,227,"Maine",3,7]
["2020-07-16",24,96,19,47,186,"Maine",4,7]
["2020-07-17",18,71,127,39,255,"Maine",5,7]
["2020-07-18",64,46,16,24,150,"Maine",6,7]
["2020-07-19",10,15,41,12,78,"Maine",7,7]
["2020-07-20",87,89,124,44,344,"Maine",1,7]
["2020-07-21",29,7,52,17,105,"Maine",2,7]
["2020-07-22",73,15,133,34,255,"Maine",3,7]
["2020-07-23",46,42,22,44,154,"Maine",4,7]
["2020-07-24",96,47,90,39,272,"Maine",5,7]
["2020-07-25",92,17,134,11,254,"Maine",6,7]
["2020-07-26",29,15,17,16,77,"Maine",7,7]
["2020-07-27",21,57,89,47,214,"Maine",1,7]
["2020-07-28",41,22,55,4,122,"Maine",2,7]
["2020-07-29",30,17,45,11,103,"Maine",3,7]
["2020-07-30",44,56,26,27,153,"Maine",4,7]
["2020-07-31",17,76,69,33,195,"Maine",5,7]
["2020-08-01",29,47,110,33,219,"Maryland",6,8]
["2020-08-02",31,24,15,7,77,"Maryland",7,8]
["2020-08-03",97,85,45,34,261,"Maryland",1,8]
["2020-08-04",16,40,50,16,122,"Maryland",2,8]
["2020-08-05",68,63,144,12,287,"Maryland",3,8]
["2020-08-06",95,20,142,7,264,"Maryland",4,8]
["2020-08-07",75,45,47,50,217,"Maryland",5,8]
["2020-08-08",37,72,91,28,228,"Maryland",6,8]
["2020-08-09",3,3,20,8,34,"Maryland",7,8]
["2020-08-10",88,72,79,47,286,"Maryland",1,8]
["2020-08-11",34,43,57,8,142,"Maryland",2,8]
["2020-08-12",83,65,119,24,291,"Maryland",3,8]
["2020-08-13",43,68,139,43,293,"Maryland",4,8]
["2020-08-14",34,74,21,34,163,"Maryland",5,8]
["2020-08-15",87,57,108,26,278,"Maryland",6,8]
["2020-08-16",29,17,26,6,78,"Maryland",7,8]
["2020-08-17",20,66,38,18,142,"Maryland",1,8]
["2020-08-18",37,34,31,25,127,"Maryland",2,8]
["2020-08-19",61,23,16,8,108,"Maryland",3,8]
["2020-08-20",49,19,87,12,167,"Maryland",4,8]
["2020-08-21",53,30,84,35,202,"Maryland",5,8]
["2020-08-22",85,25,116,28,254,"Maryland",6,8]
["2020-08-23",32,3,41,6,82,"Maryland",7,8]
["2020-08-24",81,32,79,49,241,"Maryland",1,8]
["2020-08-25",36,31,17,18,102,"Maryland",2,8]
["2020-08-26",18,10,141,32,201,"Maryland",3,8]
["2020-08-27",16,63,68,46,193,"Maryland",4,8]
["2020-08-28",80,33,129,19,261,"Maryland",5,8]
["2020-08-29",15,82,72,14,183,"Maryland",6,8]
["2020-08-30",14,13,15,8,50,"Maryland",7,8]
["2020-08-31",46,41,89,19,195,"Maryland",1,8]
["2020-09-01",10,49,14,8,81,"Massachusetts",2,9]
["2020-09-02",47,18,94,37,196,"Massachusetts",3,9]
["2020-09-03",65,95,24,47,231,"Massachusetts",4,9]
["2020-09-04",100,69,133,48,350,"Massachusetts",5,9]
["2020-09-05",91,69,124,25,309,"Massachusetts",6,9]
["2020-09-06",16,9,8,7,40,"Massachusetts",7,9]
["2020-09-07",81,72,97,12,262,"Massachusetts",1,9]
["2020-09-08",24,49,58,17,148,"Massachusetts",2,9]
["2020-09-09",32,90,27,18,167,"Massachusetts",3,9]
["2020-09-10",78,61,58,34,231,"Massachusetts",4,9]
["2020-09-11",63,79,26,10,178,"Massachusetts",5,9]
["2020-09-12",78,15,47,35,175,"Massachusetts",6,9]
["2020-09-13",13,11,43,16,83,"Massachusetts",7,9]
["2020-09-14",12,50,115,24,{"$f":"SUM(B260:E260)","v":201},"Massachusetts",{"$f":"WEEKDAY(A260,2)","v":1},{"$f":"MONTH(A260)","v":9}]
["2020-09-15",6,9,11,12,38,"Massachusetts",2,9]
["2020-09-16",70,44,36,28,178,"Massachusetts",3,9]
["2020-09-17",39,66,123,6,234,"Massachusetts",4,9]
["2020-09-18",51,86,91,25,253,"Massachusetts",5,9]
["2020-09-19",95,77,53,48,273,"Massachusetts",6,9]
["2020-09-20",21,11,47,15,94,"Massachusetts",7,9]
["2020-09-21",16,19,114,14,163,"Massachusetts",1,9]
["2020-09-22",24,24,69,22,139,"Massachusetts",2,9]
["2020-09-23",62,39,139,18,258,"Massachusetts",3,9]
["2020-09-24",22,24,26,40,112,"Massachusetts",4,9]
["2020-09-25",60,14,102,27,203,"Massachusetts",5,9]
["2020-09-26",63,85,95,46,289,"Massachusetts",6,9]
["2020-09-27",6,16,41,8,71,"Massachusetts",7,9]
["2020-09-28",40,49,146,43,278,"Massachusetts",1,9]
["2020-09-29",11,40,65,11,127,"Massachusetts",2,9]
["2020-09-30",27,81,44,10,162,"Massachusetts",3,9]
["2020-10-01",40,29,133,39,241,"Michigan",4,10]
["2020-10-02",35,94,88,30,247,"Michigan",5,10]
["2020-10-03",16,100,85,38,239,"Michigan",6,10]
["2020-10-04",28,31,13,15,87,"Michigan",7,10]
["2020-10-05",84,86,137,32,339,"Michigan",1,10]
["2020-10-06",21,17,64,9,111,"Michigan",2,10]
["2020-10-07",58,36,66,47,207,"Michigan",3,10]
["2020-10-08",11,32,58,34,135,"Michigan",4,10]
["2020-10-09",58,29,101,43,231,"Michigan",5,10]
["2020-10-10",89,97,144,35,365,"Michigan",6,10]
["2020-10-11",27,21,49,4,101,"Michigan",7,10]
["2020-10-12",97,11,50,47,205,"Michigan",1,10]
["2020-10-13",10,32,41,17,100,"Michigan",2,10]
["2020-10-14",75,75,100,20,270,"Michigan",3,10]
["2020-10-15",74,89,57,49,269,"Michigan",4,10]
["2020-10-16",82,48,46,8,184,"Michigan",5,10]
["2020-10-17",50,70,74,40,234,"Michigan",6,10]
["2020-10-18",11,29,5,1,46,"Michigan",7,10]
["2020-10-19",45,25,113,13,196,"Michigan",1,10]
["2020-10-20",6,24,70,10,110,"Michigan",2,10]
["2020-10-21",16,64,131,37,248,"Michigan",3,10]
["2020-10-22",22,44,104,23,193,"Michigan",4,10]
["2020-10-23",75,52,47,20,194,"Michigan",5,10]
["2020-10-24",10,45,137,43,235,"Michigan",6,10]
["2020-10-25",8,14,43,16,81,"Michigan",7,10]
["2020-10-26",17,27,95,37,176,"Michigan",1,10]
["2020-10-27",39,5,64,10,118,"Michigan",2,10]
["2020-10-28",31,95,147,43,316,"Michigan",3,10]
["2020-10-29",24,59,47,31,161,"Michigan",4,10]
["2020-10-30",98,66,42,5,211,"Michigan",5,10]
["2020-10-31",37,82,103,27,249,"Michigan",6,10]
["2020-11-01",20,33,8,3,64,"Illinois",7,11]
["2020-11-02",11,83,129,20,243,"Illinois",1,11]
["2020-11-03",30,9,70,15,124,"Illinois",2,11]
["2020-11-04",16,78,24,21,139,"Illinois",3,11]
["2020-11-05",59,77,87,27,250,"Illinois",4,11]
["2020-11-06",15,75,54,17,161,"Illinois",5,11]
["2020-11-07",49,37,58,32,176,"Illinois",6,11]
["2020-11-08",16,23,18,13,70,"Illinois",7,11]
["2020-11-09",75,19,49,25,168,"Illinois",1,11]
["2020-11-10",9,8,41,9,67,"Illinois",2,11]
["2020-11-11",55,96,106,31,288,"Illinois",3,11]
["2020-11-12",37,14,66,31,148,"Illinois",4,11]
["2020-11-13",88,89,72,40,289,"Illinois",5,11]
["2020-11-14",86,73,43,39,241,"Illinois",6,11]
["2020-11-15",28,14,10,13,65,"Illinois",7,11]
["2020-11-16",11,62,97,26,196,"Illinois",1,11]
["2020-11-17",7,44,29,13,{"$f":"SUM(B324:E324)","v":93},"Illinois",{"$f":"WEEKDAY(A324,2)","v":2},{"$f":"MONTH(A324)","v":11}]
["2020-11-18",33,25,143,9,210,"Illinois",3,11]
["2020-11-19",90,88,70,47,295,"Illinois",4,11]
["2020-11-20",29,21,86,37,173,"Illinois",5,11]
["2020-11-21",30,22,132,31,215,"Illinois",6,11]
["2020-11-22",13,29,45,13,100,"Illinois",7,11]
["2020-11-23",78,17,80,49,224,"Illinois",1,11]
["2020-11-24",25,36,62,2,125,"Illinois",2,11]
["2020-11-25",65,61,24,12,162,"Illinois",3,11]
["2020-11-26",74,30,49,30,183,"Illinois",4,11]
["2020-11-27",79,93,70,24,266,"Illinois",5,11]
["2020-11-28",44,57,119,39,259,"Illinois",6,11]
["2020-11-29",16,26,7,8,57,"Illinois",7,11]
["2020-11-30",70,83,81,37,271,"Illinois",1,11]
["2020-12-01",32,10,12,12,66,"Indiana",2,12]
["2020-12-02",54,33,39,33,159,"Indiana",3,12]
["2020-12-03",81,14,44,17,156,"Indiana",4,12]
["2020-12-04",15,28,64,48,155,"Indiana",5,12]
["2020-12-05",39,83,135,9,266,"Indiana",6,12]
["2020-12-06",33,4,31,1,69,"Indiana",7,12]
["2020-12-07",30,86,79,29,224,"Indiana",1,12]
["2020-12-08",42,5,47,3,97,"Indiana",2,12]
["2020-12-09",93,85,147,32,357,"Indiana",3,12]
["2020-12-10",94,98,62,24,278,"Indiana",4,12]
["2020-12-11",90,81,118,43,332,"Indiana",5,12]
["2020-12-12",41,80,137,24,282,"Indiana",6,12]
["2020-12-13",26,8,22,2,58,"Indiana",7,12]
["2020-12-14",45,84,56,17,202,"Indiana",1,12]
["2020-12-15",33,40,53,16,142,"Indiana",2,12]
["2020-12-16",28,63,148,49,288,"Indiana",3,12]
["2020-12-17",71,78,82,13,244,"Indiana",4,12]
["2020-12-18",31,52,131,15,229,"Indiana",5,12]
["2020-12-19",78,51,136,22,287,"Indiana",6,12]
["2020-12-20",17,14,46,3,80,"Indiana",7,12]
["2020-12-21",14,89,120,19,242,"Indiana",1,12]
["2020-12-22",17,7,43,17,84,"Indiana",2,12]
["2020-12-23",42,33,116,39,230,"Indiana",3,12]
["2020-12-24",75,41,50,46,212,"Indiana",4,12]
["2020-12-25",89,52,40,12,193,"Indiana",5,12]
["2020-12-26",40,26,61,42,169,"Indiana",6,12]
["2020-12-27",9,17,37,2,65,"Indiana",7,12]
["2020-12-28",19,86,110,35,250,"Indiana",1,12]
["2020-12-29",42,24,42,7,115,"Indiana",2,12]
["2020-12-30",52,72,60,8,192,"Indiana",3,12]
["2020-12-31",21,59,136,20,236,"Indiana",4,12]
[null,null,null,null,null,{"$f":"SUM(F3:F368)","v":68104}]

{"sheet":"3-Manager","index":3,"n_rows":369,"n_cols":10,"rows_kept":369,"cut":false,"hidden":false,"merged":[[0,9,0,19],[0,0,1,0],[0,1,0,4],[0,6,1,6],[0,5,1,5],[0,8,1,8],[0,7,1,7]]}
["Date","Product Groups",null,null,null,"Total sales","State","Days of the week","№ Month","https://exceltable.com/en/templates/3d-menu-for-dashboard-in-excel"]
[null,"A","B","C","D"]
["2020-01-01",32,19,23,13,{"$f":"SUM(B3:E3)","v":87},"Minnesota",{"$f":"WEEKDAY(A3,2)","v":3},{"$f":"MONTH(A3)","v":1}]
["2020-01-02",47,37,50,32,166,"Minnesota",{"$f":"WEEKDAY(A4,2)","v":4},{"$f":"MONTH(A4)","v":1}]
["2020-01-03",54,33,38,15,140,"Minnesota",5,1]
["2020-01-04",93,42,26,23,184,"Minnesota",6,1]
["2020-01-05",23,6,8,8,45,"Minnesota",7,1]
["2020-01-06",55,5,17,28,105,"Minnesota",1,1]
["2020-01-07",97,30,18,13,158,"Minnesota",2,1]
["2020-01-08",75,22,20,25,142,"Minnesota",3,1]
["2020-01-09",15,17,48,6,86,"Minnesota",4,1]
["2020-01-10",57,36,37,24,154,"Minnesota",5,1]
["2020-01-11",47,18,17,28,110,"Minnesota",6,1]
["2020-01-12",5,3,13,4,25,"Minnesota",7,1]
["2020-01-13",59,29,26,24,138,"Minnesota",1,1]
["2020-01-14",89,45,15,25,174,"Minnesota",2,1]
["2020-01-15",68,9,7,17,101,"Minnesota",3,1]
["2020-01-16",127,14,13,41,195,"Minnesota",4,1]
["2020-01-17",71,17,35,47,170,"Minnesota",5,1]
["2020-01-18",47,46,13,5,111,"Minnesota",6,1]
["2020-01-19",21,7,15,14,57,"Minnesota",7,1]
["2020-01-20",144,11,44,15,214,"Minnesota",1,1]
["2020-01-21",105,9,21,17,152,"Minnesota",2,1]
["2020-01-22",71,5,8,4,88,"Minnesota",3,1]
["2020-01-23",77,23,23,37,160,"Minnesota",4,1]
["2020-01-24",85,46,15,32,178,"Minnesota",5,1]
["2020-01-25",63,38,21,32,154,"Minnesota",6,1]
["2020-01-26",24,14,12,10,60,"Minnesota",7,1]
["2020-01-27",122,10,16,36,184,"Minnesota",1,1]
["2020-01-28",144,32,29,46,251,"Minnesota",2,1]
["2020-01-29",56,25,5,2,88,"Minnesota",3,1]
["2020-01-30",131,14,19,36,200,"Minnesota",4,1]
["2020-01-31",114,13,20,36,183,"Minnesota",5,1]
["2020-02-01",92,28,9,28,157,"Mississippi",6,2]
["2020-02-02",48,3,14,14,79,"Mississippi",7,2]
["2020-02-03",132,9,17,22,180,"Mississippi",1,2]
["2020-02-04",147,5,45,49,246,"Mississippi",2,2]
["2020-02-05",38,4,15,11,68,"Mississippi",3,2]
["2020-02-06",99,50,34,45,228,"Mississippi",4,2]
["2020-02-07",26,29,23,22,100,"Mississippi",5,2]
["2020-02-08",16,41,44,18,119,"Mississippi",6,2]
["2020-02-09",18,14,5,2,39,"Mississippi",7,2]
["2020-02-10",88,27,21,38,174,"Mississippi",1,2]
["2020-02-11",30,30,33,50,143,"Mississippi",2,2]
["2020-02-12",24,14,10,21,69,"Mississippi",3,2]
["2020-02-13",134,33,33,26,226,"Mississippi",4,2]
["2020-02-14",109,21,20,43,193,"Mississippi",5,2]
["2020-02-15",62,22,26,6,116,"Mississippi",6,2]
["2020-02-16",48,9,8,11,76,"Mississippi",7,2]
["2020-02-17",127,26,20,20,193,"Mississippi",1,2]
["2020-02-18",122,16,44,28,210,"Mississippi",2,2]
["2020-02-19",69,22,21,22,134,"Mississippi",3,2]
["2020-02-20",87,48,45,48,228,"Mississippi",4,2]
["2020-02-21",74,22,9,25,130,"Mississippi",5,2]
["2020-02-22",44,46,34,9,133,"Mississippi",6,2]
["2020-02-23",21,3,6,16,46,"Mississippi",7,2]
["2020-02-24",51,26,39,10,126,"Mississippi",1,2]
["2020-02-25",43,35,27,10,115,"Mississippi",2,2]
["2020-02-26",26,14,12,8,60,"Mississippi",3,2]
["2020-02-27",137,49,13,33,232,"Mississippi",4,2]
["2020-02-28",16,21,49,50,136,"Mississippi",5,2]
["2020-02-29",81,15,49,46,191,"Mississippi",6,2]
["2020-03-01",14,3,14,4,35,"Missouri",7,3]
["2020-03-02",24,39,15,50,128,"Missouri",1,3]
["2020-03-03",134,10,40,5,189,"Missouri",2,3]
["2020-03-04",71,25,9,11,116,"Missouri",3,3]
["2020-03-05",55,28,8,20,111,"Missouri",4,3]
["2020-03-06",130,15,44,15,{"$f":"SUM(B68:E68)","v":204},"Missouri",{"$f":"WEEKDAY(A68,2)","v":5},{"$f":"MONTH(A68)","v":3}]
["2020-03-07",132,26,10,10,178,"Missouri",6,3]
["2020-03-08",9,14,8,15,46,"Missouri",7,3]
["2020-03-09",80,48,39,28,195,"Missouri",1,3]
["2020-03-10",109,8,34,42,193,"Missouri",2,3]
["2020-03-11",54,11,13,4,82,"Missouri",3,3]
["2020-03-12",109,36,20,33,198,"Missouri",4,3]
["2020-03-13",84,43,49,25,201,"Missouri",5,3]
["2020-03-14",36,7,11,22,76,"Missouri",6,3]
["2020-03-15",10,10,6,7,33,"Missouri",7,3]
["2020-03-16",129,9,42,32,212,"Missouri",1,3]
["2020-03-17",102,42,41,35,220,"Missouri",2,3]
["2020-03-18",73,4,15,5,97,"Missouri",3,3]
["2020-03-19",110,15,31,22,178,"Missouri",4,3]
["2020-03-20",147,33,7,36,223,"Missouri",5,3]
["2020-03-21",52,12,22,8,94,"Missouri",6,3]
["2020-03-22",49,3,15,14,81,"Missouri",7,3]
["2020-03-23",45,45,50,32,172,"Missouri",1,3]
["2020-03-24",99,10,50,19,178,"Missouri",2,3]
["2020-03-25",59,12,21,24,116,"Missouri",3,3]
["2020-03-26",127,42,49,7,225,"Missouri",4,3]
["2020-03-27",141,17,11,25,194,"Missouri",5,3]
["2020-03-28",69,38,8,41,156,"Missouri",6,3]
["2020-03-29",40,14,9,16,79,"Missouri",7,3]
["2020-03-30",61,29,26,30,146,"Missouri",1,3]
["2020-03-31",56,22,28,15,121,"Missouri",2,3]
["2020-04-01",36,17,22,23,98,"Montana",3,4]
["2020-04-02",36,37,34,36,143,"Montana",4,4]
["2020-04-03",49,33,7,27,116,"Montana",5,4]
["2020-04-04",39,18,8,11,76,"Montana",6,4]
["2020-04-05",6,2,10,3,21,"Montana",7,4]
["2020-04-06",38,39,34,9,120,"Montana",1,4]
["2020-04-07",42,8,42,10,102,"Montana",2,4]
["2020-04-08",35,20,18,16,89,"Montana",3,4]
["2020-04-09",116,46,37,35,234,"Montana",4,4]
["2020-04-10",33,32,11,13,89,"Montana",5,4]
["2020-04-11",111,31,23,31,196,"Montana",6,4]
["2020-04-12",35,4,7,16,62,"Montana",7,4]
["2020-04-13",64,37,16,28,145,"Montana",1,4]
["2020-04-14",150,33,36,49,268,"Montana",2,4]
["2020-04-15",53,14,2,25,94,"Montana",3,4]
["2020-04-16",117,16,20,39,192,"Montana",4,4]
["2020-04-17",37,48,30,48,163,"Montana",5,4]
["2020-04-18",35,24,25,7,91,"Montana",6,4]
["2020-04-19",10,8,7,7,32,"Montana",7,4]
["2020-04-20",39,7,23,17,86,"Montana",1,4]
["2020-04-21",78,28,9,31,146,"Montana",2,4]
["2020-04-22",11,24,14,7,56,"Montana",3,4]
["2020-04-23",126,32,48,27,233,"Montana",4,4]
["2020-04-24",16,19,40,48,123,"Montana",5,4]
["2020-04-25",139,29,42,14,224,"Montana",6,4]
["2020-04-26",7,8,3,13,31,"Montana",7,4]
["2020-04-27",103,49,46,14,212,"Montana",1,4]
["2020-04-28",18,33,25,11,87,"Montana",2,4]
["2020-04-29",46,19,12,9,86,"Montana",3,4]
["2020-04-30",130,9,48,40,227,"Montana",4,4]
["2020-05-01",126,39,29,44,238,"Nebraska",5,5]
["2020-05-02",128,13,48,32,221,"Nebraska",6,5]
["2020-05-03",27,7,15,15,64,"Nebraska",7,5]
["2020-05-04",46,34,5,21,106,"Nebraska",1,5]
["2020-05-05",31,44,26,18,119,"Nebraska",2,5]
["2020-05-06",57,20,12,10,99,"Nebraska",3,5]
["2020-05-07",45,7,38,16,106,"Nebraska",4,5]
["2020-05-08",106,34,6,35,181,"Nebraska",5,5]
["2020-05-09",35,12,25,41,{"$f":"SUM(B132:E132)","v":113},"Nebraska",{"$f":"WEEKDAY(A132,2)","v":6},{"$f":"MONTH(A132)","v":5}]
["2020-05-10",23,12,10,6,51,"Nebraska",7,5]
["2020-05-11",28,35,24,32,119,"Nebraska",1,5]
["2020-05-12",71,44,47,29,191,"Nebraska",2,5]
["2020-05-13",54,21,9,18,102,"Nebraska",3,5]
["2020-05-14",50,33,8,26,117,"Nebraska",4,5]
["2020-05-15",70,30,48,46,194,"Nebraska",5,5]
["2020-05-16",147,44,45,47,283,"Nebraska",6,5]
["2020-05-17",42,10,2,13,67,"Nebraska",7,5]
["2020-05-18",41,8,13,49,111,"Nebraska",1,5]
["2020-05-19",90,8,13,21,132,"Nebraska",2,5]
["2020-05-20",23,22,11,13,69,"Nebraska",3,5]
["2020-05-21",76,16,50,42,184,"Nebraska",4,5]
["2020-05-22",29,40,41,27,137,"Nebraska",5,5]
["2020-05-23",95,12,26,10,143,"Nebraska",6,5]
["2020-05-24",41,8,11,2,62,"Nebraska",7,5]
["2020-05-25",68,48,20,35,171,"Nebraska",1,5]
["2020-05-26",126,5,11,18,160,"Nebraska",2,5]
["2020-05-27",64,11,19,15,109,"Nebraska",3,5]
["2020-05-28",52,44,47,24,167,"Nebraska",4,5]
["2020-05-29",103,39,36,28,206,"Nebraska",5,5]
["2020-05-30",40,26,6,31,103,"Nebraska",6,5]
["2020-05-31",34,14,4,6,58,"Nebraska",7,5]
["2020-06-01",46,17,39,22,124,"Nevada",1,6]
["2020-06-02",98,14,36,48,196,"Nevada",2,6]
["2020-06-03",44,14,16,13,87,"Nevada",3,6]
["2020-06-04",113,46,11,18,188,"Nevada",4,6]
["2020-06-05",47,20,12,43,122,"Nevada",5,6]
["2020-06-06",23,8,45,23,99,"Nevada",6,6]
["2020-06-07",47,11,12,10,80,"Nevada",7,6]
["2020-06-08",39,18,50,43,150,"Nevada",1,6]
["2020-06-09",71,16,38,37,162,"Nevada",2,6]
["2020-06-10",12,16,18,18,64,"Nevada",3,6]
["2020-06-11",62,23,48,12,145,"Nevada",4,6]
["2020-06-12",130,33,17,10,190,"Nevada",5,6]
["2020-06-13",32,48,48,47,175,"Nevada",6,6]
["2020-06-14",41,15,11,3,70,"Nevada",7,6]
["2020-06-15",124,23,42,26,215,"Nevada",1,6]
["2020-06-16",100,36,8,22,166,"Nevada",2,6]
["2020-06-17",17,15,8,18,58,"Nevada",3,6]
["2020-06-18",79,21,16,14,130,"Nevada",4,6]
["2020-06-19",16,8,27,48,99,"Nevada",5,6]
["2020-06-20",15,30,5,9,59,"Nevada",6,6]
["2020-06-21",31,11,2,14,58,"Nevada",7,6]
["2020-06-22",91,7,43,29,170,"Nevada",1,6]
["2020-06-23",131,34,36,15,216,"Nevada",2,6]
["2020-06-24",27,5,16,19,67,"Nevada",3,6]
["2020-06-25",93,39,21,43,196,"Nevada",4,6]
["2020-06-26",84,34,50,6,174,"Nevada",5,6]
["2020-06-27",142,19,17,42,220,"Nevada",6,6]
["2020-06-28",8,12,16,7,43,"Nevada",7,6]
["2020-06-29",37,34,31,45,147,"Nevada",1,6]
["2020-06-30",76,24,16,17,133,"Nevada",2,6]
["2020-07-01",49,10,13,3,75,"New hampshire",3,7]
["2020-07-02",88,34,20,21,163,"New hampshire",4,7]
["2020-07-03",137,50,21,40,248,"New hampshire",5,7]
["2020-07-04",102,47,33,48,230,"New hampshire",6,7]
["2020-07-05",20,16,16,3,55,"New hampshire",7,7]
["2020-07-06",41,21,6,36,104,"New hampshire",1,7]
["2020-07-07",133,32,33,31,229,"New hampshire",2,7]
["2020-07-08",35,12,21,16,84,"New hampshire",3,7]
["2020-07-09",32,19,23,49,123,"New hampshire",4,7]
["2020-07-10",60,25,43,40,168,"New hampshire",5,7]
["2020-07-11",65,49,34,22,170,"New hampshire",6,7]
["2020-07-12",39,12,11,11,{"$f":"SUM(B196:E196)","v":73},"New hampshire",{"$f":"WEEKDAY(A196,2)","v":7},{"$f":"MONTH(A196)","v":7}]
["2020-07-13",89,32,50,29,200,"New hampshire",1,7]
["2020-07-14",76,12,32,27,147,"New hampshire",2,7]
["2020-07-15",69,14,4,12,99,"New hampshire",3,7]
["2020-07-16",115,15,10,37,177,"New hampshire",4,7]
["2020-07-17",53,27,27,12,119,"New hampshire",5,7]
["2020-07-18",36,43,34,6,119,"New hampshire",6,7]
["2020-07-19",44,8,3,6,61,"New hampshire",7,7]
["2020-07-20",70,29,14,16,129,"New hampshire",1,7]
["2020-07-21",46,47,27,19,139,"New hampshire",2,7]
["2020-07-22",53,25,15,7,100,"New hampshire",3,7]
["2020-07-23",129,48,24,20,221,"New hampshire",4,7]
["2020-07-24",100,46,42,31,219,"New hampshire",5,7]
["2020-07-25",20,26,47,18,111,"New hampshire",6,7]
["2020-07-26",18,13,3,14,48,"New hampshire",7,7]
["2020-07-27",73,44,23,9,149,"New hampshire",1,7]
["2020-07-28",118,31,36,36,221,"New hampshire",2,7]
["2020-07-29",70,23,19,15,127,"New hampshire",3,7]
["2020-07-30",50,49,19,13,131,"New hampshire",4,7]
["2020-07-31",137,11,40,28,216,"New hampshire",5,7]
["2020-08-01",67,40,7,19,133,"New Jersey",6,8]
["2020-08-02",42,6,11,3,62,"New Jersey",7,8]
["2020-08-03",123,27,31,42,223,"New Jersey",1,8]
["2020-08-04",52,30,29,17,128,"New Jersey",2,8]
["2020-08-05",15,8,7,22,52,"New Jersey",3,8]
["2020-08-06",28,37,35,32,132,"New Jersey",4,8]
["2020-08-07",46,38,21,27,132,"New Jersey",5,8]
["2020-08-08",112,43,44,32,231,"New Jersey",6,8]
["2020-08-09",42,3,8,16,69,"New Jersey",7,8]
["2020-08-10",76,7,12,46,141,"New Jersey",1,8]
["2020-08-11",40,27,30,45,142,"New Jersey",2,8]
["2020-08-12",42,21,12,22,97,"New Jersey",3,8]
["2020-08-13",110,43,16,9,178,"New Jersey",4,8]
["2020-08-14",97,36,43,48,224,"New Jersey",5,8]
["2020-08-15",30,36,45,30,141,"New Jersey",6,8]
["2020-08-16",42,11,1,6,60,"New Jersey",7,8]
["2020-08-17",32,19,31,48,130,"New Jersey",1,8]
["2020-08-18",129,40,12,24,205,"New Jersey",2,8]
["2020-08-19",51,7,6,21,85,"New Jersey",3,8]
["2020-08-20",46,42,48,12,148,"New Jersey",4,8]
["2020-08-21",30,7,12,7,56,"New Jersey",5,8]
["2020-08-22",115,48,9,27,199,"New Jersey",6,8]
["2020-08-23",23,4,7,16,50,"New Jersey",7,8]
["2020-08-24",17,46,9,21,93,"New Jersey",1,8]
["2020-08-25",40,43,13,12,108,"New Jersey",2,8]
["2020-08-26",27,5,7,12,51,"New Jersey",3,8]
["2020-08-27",87,37,40,24,188,"New Jersey",4,8]
["2020-08-28",17,28,48,17,110,"New Jersey",5,8]
["2020-08-29",39,21,50,25,135,"New Jersey",6,8]
["2020-08-30",40,11,1,3,55,"New Jersey",7,8]
["2020-08-31",131,50,35,23,239,"New Jersey",1,8]
["2020-09-01",42,16,40,27,125,"New Mexico",2,9]
["2020-09-02",11,18,10,2,41,"New Mexico",3,9]
["2020-09-03",134,49,13,15,211,"New Mexico",4,9]
["2020-09-04",130,36,38,31,235,"New Mexico",5,9]
["2020-09-05",36,34,49,29,148,"New Mexico",6,9]
["2020-09-06",36,7,14,5,62,"New Mexico",7,9]
["2020-09-07",101,50,21,23,195,"New Mexico",1,9]
["2020-09-08",27,45,46,23,141,"New Mexico",2,9]
["2020-09-09",26,15,17,12,70,"New Mexico",3,9]
["2020-09-10",15,35,5,14,69,"New Mexico",4,9]
["2020-09-11",92,20,24,29,165,"New Mexico",5,9]
["2020-09-12",39,8,41,24,112,"New Mexico",6,9]
["2020-09-13",5,2,2,16,25,"New Mexico",7,9]
["2020-09-14",115,14,30,25,{"$f":"SUM(B260:E260)","v":184},"New Mexico",{"$f":"WEEKDAY(A260,2)","v":1},{"$f":"MONTH(A260)","v":9}]
["2020-09-15",93,41,28,34,196,"New Mexico",2,9]
["2020-09-16",37,20,12,3,72,"New Mexico",3,9]
["2020-09-17",75,13,37,49,174,"New Mexico",4,9]
["2020-09-18",120,32,28,50,230,"New Mexico",5,9]
["2020-09-19",23,23,16,19,81,"New Mexico",6,9]
["2020-09-20",25,10,15,16,66,"New Mexico",7,9]
["2020-09-21",79,15,22,15,131,"New Mexico",1,9]
["2020-09-22",35,44,46,16,141,"New Mexico",2,9]
["2020-09-23",34,8,9,15,66,"New Mexico",3,9]
["2020-09-24",47,20,31,42,140,"New Mexico",4,9]
["2020-09-25",106,34,5,6,151,"New Mexico",5,9]
["2020-09-26",97,31,39,6,173,"New Mexico",6,9]
["2020-09-27",5,2,16,9,32,"New Mexico",7,9]
["2020-09-28",56,5,16,33,110,"New Mexico",1,9]
["2020-09-29",97,16,17,28,158,"New Mexico",2,9]
["2020-09-30",49,20,6,22,97,"New Mexico",3,9]
["2020-10-01",139,40,28,23,230,"New York",4,10]
["2020-10-02",60,32,29,40,161,"New York",5,10]
["2020-10-03",71,25,19,11,126,"New York",6,10]
["2020-10-04",24,5,12,13,54,"New York",7,10]
["2020-10-05",134,27,16,11,188,"New York",1,10]
["2020-10-06",128,16,41,24,209,"New York",2,10]
["2020-10-07",55,23,23,8,109,"New York",3,10]
["2020-10-08",77,8,30,39,154,"New York",4,10]
["2020-10-09",90,36,47,30,203,"New York",5,10]
["2020-10-10",128,20,30,38,216,"New York",6,10]
["2020-10-11",29,4,13,2,48,"New York",7,10]
["2020-10-12",26,43,49,24,142,"New York",1,10]
["2020-10-13",34,8,27,6,75,"New York",2,10]
["2020-10-14",54,10,15,11,90,"New York",3,10]
["2020-10-15",21,5,18,36,80,"New York",4,10]
["2020-10-16",67,31,6,43,147,"New York",5,10]
["2020-10-17",124,13,8,28,173,"New York",6,10]
["2020-10-18",11,16,2,8,37,"New York",7,10]
["2020-10-19",96,11,11,20,138,"New York",1,10]
["2020-10-20",150,10,25,5,190,"New York",2,10]
["2020-10-21",59,22,8,20,109,"New York",3,10]
["2020-10-22",135,8,32,49,224,"New York",4,10]
["2020-10-23",139,29,28,46,242,"New York",5,10]
["2020-10-24",83,16,15,23,137,"New York",6,10]
["2020-10-25",49,16,5,9,79,"New York",7,10]
["2020-10-26",59,12,12,31,114,"New York",1,10]
["2020-10-27",107,8,47,38,200,"New York",2,10]
["2020-10-28",40,15,5,8,68,"New York",3,10]
["2020-10-29",94,49,42,19,204,"New York",4,10]
["2020-10-30",47,26,35,36,144,"New York",5,10]
["2020-10-31",72,7,7,8,94,"New York",6,10]
["2020-11-01",17,13,2,4,36,"Minnesota",7,11]
["2020-11-02",17,29,38,6,90,"Minnesota",1,11]
["2020-11-03",46,46,8,25,125,"Minnesota",2,11]
["2020-11-04",20,11,14,25,70,"Minnesota",3,11]
["2020-11-05",114,31,36,41,222,"Minnesota",4,11]
["2020-11-06",149,38,14,19,220,"Minnesota",5,11]
["2020-11-07",124,28,40,25,217,"Minnesota",6,11]
["2020-11-08",49,9,14,16,88,"Minnesota",7,11]
["2020-11-09",48,44,30,46,168,"Minnesota",1,11]
["2020-11-10",85,16,38,18,157,"Minnesota",2,11]
["2020-11-11",45,7,5,21,78,"Minnesota",3,11]
["2020-11-12",115,39,8,25,187,"Minnesota",4,11]
["2020-11-13",61,43,15,44,163,"Minnesota",5,11]
["2020-11-14",110,11,48,18,187,"Minnesota",6,11]
["2020-11-15",23,16,8,11,58,"Minnesota",7,11]
["2020-11-16",107,7,39,11,164,"Minnesota",1,11]
["2020-11-17",49,11,6,22,{"$f":"SUM(B324:E324)","v":88},"Minnesota",{"$f":"WEEKDAY(A324,2)","v":2},{"$f":"MONTH(A324)","v":11}]
["2020-11-18",30,7,20,5,62,"Minnesota",3,11]
["2020-11-19",131,12,16,16,175,"Minnesota",4,11]
["2020-11-20",19,13,19,35,86,"Minnesota",5,11]
["2020-11-21",22,12,50,24,108,"Minnesota",6,11]
["2020-11-22",11,15,2,16,44,"Minnesota",7,11]
["2020-11-23",96,16,18,35,165,"Minnesota",1,11]
["2020-11-24",34,28,11,13,86,"Minnesota",2,11]
["2020-11-25",75,25,3,21,124,"Minnesota",3,11]
["2020-11-26",46,49,16,40,151,"Minnesota",4,11]
["2020-11-27",122,47,7,32,208,"Minnesota",5,11]
["2020-11-28",148,38,12,15,213,"Minnesota",6,11]
["2020-11-29",11,10,6,2,29,"Minnesota",7,11]
["2020-11-30",42,29,27,5,103,"Minnesota",1,11]
["2020-12-01",45,50,10,45,150,"Mississippi",2,12]
["2020-12-02",20,19,15,8,62,"Mississippi",3,12]
["2020-12-03",30,38,24,17,109,"Mississippi",4,12]
["2020-12-04",138,29,15,21,203,"Mississippi",5,12]
["2020-12-05",147,10,42,26,225,"Mississippi",6,12]
["2020-12-06",20,3,13,2,38,"Mississippi",7,12]
["2020-12-07",123,18,47,48,236,"Mississippi",1,12]
["2020-12-08",109,7,44,15,175,"Mississippi",2,12]
["2020-12-09",25,8,22,6,61,"Mississippi",3,12]
["2020-12-10",63,16,47,13,139,"Mississippi",4,12]
["2020-12-11",149,49,48,39,285,"Mississippi",5,12]
["2020-12-12",107,25,15,49,196,"Mississippi",6,12]
["2020-12-13",19,3,14,11,47,"Mississippi",7,12]
["2020-12-14",33,5,41,17,96,"Mississippi",1,12]
["2020-12-15",145,35,48,17,245,"Mississippi",2,12]
["2020-12-16",74,18,8,4,104,"Mississippi",3,12]
["2020-12-17",64,33,41,28,166,"Mississippi",4,12]
["2020-12-18",46,48,22,35,151,"Mississippi",5,12]
["2020-12-19",41,13,30,17,101,"Mississippi",6,12]
["2020-12-20",25,16,7,10,58,"Mississippi",7,12]
["2020-12-21",93,25,44,33,195,"Mississippi",1,12]
["2020-12-22",136,34,26,13,209,"Mississippi",2,12]
["2020-12-23",52,25,18,20,115,"Mississippi",3,12]
["2020-12-24",121,48,7,38,214,"Mississippi",4,12]
["2020-12-25",132,48,21,5,206,"Mississippi",5,12]
["2020-12-26",145,29,37,48,259,"Mississippi",6,12]
["2020-12-27",43,13,6,11,73,"Mississippi",7,12]
["2020-12-28",114,21,23,25,183,"Mississippi",1,12]
["2020-12-29",34,26,31,49,140,"Mississippi",2,12]
["2020-12-30",8,6,9,11,34,"Mississippi",3,12]
["2020-12-31",47,44,49,7,147,"Mississippi",4,12]
[null,null,null,null,null,{"$f":"SUM(F3:F368)","v":50044}]

{"sheet":"4-Manager","index":4,"n_rows":369,"n_cols":10,"rows_kept":369,"cut":false,"hidden":false,"merged":[[0,9,0,19],[0,8,1,8],[0,0,1,0],[0,1,0,4],[0,6,1,6],[0,5,1,5],[0,7,1,7]]}
["Date","Product Groups",null,null,null,"Total sales","State","Days of the week","№ Month","https://exceltable.com/en/templates/3d-menu-for-dashboard-in-excel"]
[null,"A","B","C","D"]
["2020-01-01",20,19,100,6,{"$f":"SUM(B3:E3)","v":145},"North Carolina",{"$f":"WEEKDAY(A3,2)","v":3},{"$f":"MONTH(A3)","v":1}]
["2020-01-02",7,9,44,1,61,"North Carolina",{"$f":"WEEKDAY(A4,2)","v":4},{"$f":"MONTH(A4)","v":1}]
["2020-01-03",9,17,11,4,41,"North Carolina",5,1]
["2020-01-04",7,3,56,27,93,"North Carolina",6,1]
["2020-01-05",6,9,7,1,23,"North Carolina",7,1]
["2020-01-06",27,5,47,12,91,"North Carolina",1,1]
["2020-01-07",6,5,63,28,102,"North Carolina",2,1]
["2020-01-08",21,3,48,16,88,"North Carolina",3,1]
["2020-01-09",1,10,19,6,36,"North Carolina",4,1]
["2020-01-10",19,20,23,28,90,"North Carolina",5,1]
["2020-01-11",17,30,69,26,142,"North Carolina",6,1]
["2020-01-12",9,4,17,1,31,"North Carolina",7,1]
["2020-01-13",15,6,10,24,55,"North Carolina",1,1]
["2020-01-14",26,14,29,6,75,"North Carolina",2,1]
["2020-01-15",18,20,80,6,124,"North Carolina",3,1]
["2020-01-16",6,7,41,2,56,"North Carolina",4,1]
["2020-01-17",17,7,60,5,89,"North Carolina",5,1]
["2020-01-18",24,19,19,18,80,"North Carolina",6,1]
["2020-01-19",6,8,4,7,25,"North Carolina",7,1]
["2020-01-20",16,22,81,23,142,"North Carolina",1,1]
["2020-01-21",10,22,67,10,109,"North Carolina",2,1]
["2020-01-22",12,25,51,8,96,"North Carolina",3,1]
["2020-01-23",13,2,24,4,43,"North Carolina",4,1]
["2020-01-24",20,26,21,30,97,"North Carolina",5,1]
["2020-01-25",3,11,89,30,133,"North Carolina",6,1]
["2020-01-26",8,9,24,8,49,"North Carolina",7,1]
["2020-01-27",22,10,15,29,76,"North Carolina",1,1]
["2020-01-28",22,8,34,19,83,"North Carolina",2,1]
["2020-01-29",21,7,48,17,93,"North Carolina",3,1]
["2020-01-30",13,10,41,9,73,"North Carolina",4,1]
["2020-01-31",11,14,71,27,123,"North Carolina",5,1]
["2020-02-01",13,3,75,27,118,"North Dakota",6,2]
["2020-02-02",4,5,14,7,30,"North Dakota",7,2]
["2020-02-03",11,26,30,12,79,"North Dakota",1,2]
["2020-02-04",5,26,41,26,98,"North Dakota",2,2]
["2020-02-05",17,4,50,10,81,"North Dakota",3,2]
["2020-02-06",3,3,27,15,48,"North Dakota",4,2]
["2020-02-07",25,3,60,7,95,"North Dakota",5,2]
["2020-02-08",14,19,94,20,147,"North Dakota",6,2]
["2020-02-09",3,6,31,1,41,"North Dakota",7,2]
["2020-02-10",20,18,21,5,64,"North Dakota",1,2]
["2020-02-11",27,11,75,28,141,"North Dakota",2,2]
["2020-02-12",25,22,13,7,67,"North Dakota",3,2]
["2020-02-13",13,4,7,6,30,"North Dakota",4,2]
["2020-02-14",29,10,22,11,72,"North Dakota",5,2]
["2020-02-15",3,4,61,24,92,"North Dakota",6,2]
["2020-02-16",8,9,10,3,30,"North Dakota",7,2]
["2020-02-17",20,19,32,3,74,"North Dakota",1,2]
["2020-02-18",27,23,32,15,97,"North Dakota",2,2]
["2020-02-19",23,5,50,27,105,"North Dakota",3,2]
["2020-02-20",12,2,18,14,46,"North Dakota",4,2]
["2020-02-21",23,15,93,5,136,"North Dakota",5,2]
["2020-02-22",30,6,12,9,57,"North Dakota",6,2]
["2020-02-23",3,8,20,9,40,"North Dakota",7,2]
["2020-02-24",13,30,86,13,142,"North Dakota",1,2]
["2020-02-25",7,27,70,24,128,"North Dakota",2,2]
["2020-02-26",29,16,67,4,116,"North Dakota",3,2]
["2020-02-27",9,10,6,2,27,"North Dakota",4,2]
["2020-02-28",24,27,30,15,96,"North Dakota",5,2]
["2020-02-29",4,5,72,7,88,"North Dakota",6,2]
["2020-03-01",1,4,4,7,16,"Ohio",7,3]
["2020-03-02",8,15,59,13,95,"Ohio",1,3]
["2020-03-03",27,15,82,15,139,"Ohio",2,3]
["2020-03-04",3,10,35,30,78,"Ohio",3,3]
["2020-03-05",11,12,18,8,49,"Ohio",4,3]
["2020-03-06",29,20,87,15,{"$f":"SUM(B68:E68)","v":151},"Ohio",{"$f":"WEEKDAY(A68,2)","v":5},{"$f":"MONTH(A68)","v":3}]
["2020-03-07",6,15,41,10,72,"Ohio",6,3]
["2020-03-08",3,9,8,10,30,"Ohio",7,3]
["2020-03-09",27,21,65,7,120,"Ohio",1,3]
["2020-03-10",7,24,27,15,73,"Ohio",2,3]
["2020-03-11",9,17,97,5,128,"Ohio",3,3]
["2020-03-12",8,8,10,15,41,"Ohio",4,3]
["2020-03-13",29,24,27,16,96,"Ohio",5,3]
["2020-03-14",6,26,49,18,99,"Ohio",6,3]
["2020-03-15",8,4,25,4,41,"Ohio",7,3]
["2020-03-16",16,15,46,23,100,"Ohio",1,3]
["2020-03-17",11,6,23,29,69,"Ohio",2,3]
["2020-03-18",12,25,65,20,122,"Ohio",3,3]
["2020-03-19",10,9,25,5,49,"Ohio",4,3]
["2020-03-20",9,18,75,4,106,"Ohio",5,3]
["2020-03-21",15,20,74,29,138,"Ohio",6,3]
["2020-03-22",1,8,8,2,19,"Ohio",7,3]
["2020-03-23",20,8,12,20,60,"Ohio",1,3]
["2020-03-24",3,14,82,15,114,"Ohio",2,3]
["2020-03-25",16,4,67,26,113,"Ohio",3,3]
["2020-03-26",8,15,9,6,38,"Ohio",4,3]
["2020-03-27",19,7,81,17,124,"Ohio",5,3]
["2020-03-28",14,6,19,29,68,"Ohio",6,3]
["2020-03-29",7,7,20,2,36,"Ohio",7,3]
["2020-03-30",27,23,12,13,75,"Ohio",1,3]
["2020-03-31",21,28,18,30,97,"Ohio",2,3]
["2020-04-01",25,26,25,27,103,"Oklahoma",3,4]
["2020-04-02",12,5,6,14,37,"Oklahoma",4,4]
["2020-04-03",22,22,55,27,126,"Oklahoma",5,4]
["2020-04-04",22,28,70,16,136,"Oklahoma",6,4]
["2020-04-05",9,9,29,8,55,"Oklahoma",7,4]
["2020-04-06",29,9,24,15,77,"Oklahoma",1,4]
["2020-04-07",30,29,97,28,184,"Oklahoma",2,4]
["2020-04-08",24,6,43,27,100,"Oklahoma",3,4]
["2020-04-09",7,10,5,6,28,"Oklahoma",4,4]
["2020-04-10",11,24,97,18,150,"Oklahoma",5,4]
["2020-04-11",14,17,57,6,94,"Oklahoma",6,4]
["2020-04-12",7,9,31,8,55,"Oklahoma",7,4]
["2020-04-13",24,5,71,26,126,"Oklahoma",1,4]
["2020-04-14",11,14,67,3,95,"Oklahoma",2,4]
["2020-04-15",15,19,35,7,76,"Oklahoma",3,4]
["2020-04-16",4,9,11,13,37,"Oklahoma",4,4]
["2020-04-17",5,15,49,18,87,"Oklahoma",5,4]
["2020-04-18",27,10,77,5,119,"Oklahoma",6,4]
["2020-04-19",8,4,18,5,35,"Oklahoma",7,4]
["2020-04-20",26,30,27,4,87,"Oklahoma",1,4]
["2020-04-21",24,4,84,29,141,"Oklahoma",2,4]
["2020-04-22",29,23,88,25,165,"Oklahoma",3,4]
["2020-04-23",8,9,26,7,50,"Oklahoma",4,4]
["2020-04-24",13,14,75,29,131,"Oklahoma",5,4]
["2020-04-25",18,28,21,7,74,"Oklahoma",6,4]
["2020-04-26",8,7,30,7,52,"Oklahoma",7,4]
["2020-04-27",26,13,37,12,88,"Oklahoma",1,4]
["2020-04-28",26,22,20,20,88,"Oklahoma",2,4]
["2020-04-29",25,4,100,22,151,"Oklahoma",3,4]
["2020-04-30",3,1,18,4,26,"Oklahoma",4,4]
["2020-05-01",24,29,85,23,161,"Oregon",5,5]
["2020-05-02",26,13,88,26,153,"Oregon",6,5]
["2020-05-03",3,6,24,5,38,"Oregon",7,5]
["2020-05-04",27,5,80,20,132,"Oregon",1,5]
["2020-05-05",28,24,19,26,97,"Oregon",2,5]
["2020-05-06",9,4,37,25,75,"Oregon",3,5]
["2020-05-07",3,8,25,5,41,"Oregon",4,5]
["2020-05-08",16,20,40,3,79,"Oregon",5,5]
["2020-05-09",12,3,15,14,{"$f":"SUM(B132:E132)","v":44},"Oregon",{"$f":"WEEKDAY(A132,2)","v":6},{"$f":"MONTH(A132)","v":5}]
["2020-05-10",3,6,6,5,20,"Oregon",7,5]
["2020-05-11",13,5,64,16,98,"Oregon",1,5]
["2020-05-12",15,26,22,28,91,"Oregon",2,5]
["2020-05-13",26,22,37,11,96,"Oregon",3,5]
["2020-05-14",9,14,11,13,47,"Oregon",4,5]
["2020-05-15",29,18,86,18,151,"Oregon",5,5]
["2020-05-16",5,22,38,4,69,"Oregon",6,5]
["2020-05-17",6,1,7,9,23,"Oregon",7,5]
["2020-05-18",17,11,91,11,130,"Oregon",1,5]
["2020-05-19",24,3,95,6,128,"Oregon",2,5]
["2020-05-20",30,26,80,20,156,"Oregon",3,5]
["2020-05-21",14,2,24,9,49,"Oregon",4,5]
["2020-05-22",13,28,20,5,66,"Oregon",5,5]
["2020-05-23",8,21,85,8,122,"Oregon",6,5]
["2020-05-24",2,8,32,1,43,"Oregon",7,5]
["2020-05-25",13,26,24,28,91,"Oregon",1,5]
["2020-05-26",15,29,91,7,142,"Oregon",2,5]
["2020-05-27",30,13,60,9,112,"Oregon",3,5]
["2020-05-28",15,5,36,4,60,"Oregon",4,5]
["2020-05-29",7,15,41,11,74,"Oregon",5,5]
["2020-05-30",14,15,64,28,121,"Oregon",6,5]
["2020-05-31",9,1,3,8,21,"Oregon",7,5]
["2020-06-01",3,26,25,24,78,"Pennsylvania",1,6]
["2020-06-02",21,25,87,19,152,"Pennsylvania",2,6]
["2020-06-03",29,29,97,30,185,"Pennsylvania",3,6]
["2020-06-04",10,9,50,6,75,"Pennsylvania",4,6]
["2020-06-05",10,27,92,15,144,"Pennsylvania",5,6]
["2020-06-06",7,12,78,24,121,"Pennsylvania",6,6]
["2020-06-07",10,4,24,10,48,"Pennsylvania",7,6]
["2020-06-08",23,23,77,17,140,"Pennsylvania",1,6]
["2020-06-09",14,17,53,14,98,"Pennsylvania",2,6]
["2020-06-10",9,21,30,20,80,"Pennsylvania",3,6]
["2020-06-11",4,3,49,6,62,"Pennsylvania",4,6]
["2020-06-12",21,12,59,17,109,"Pennsylvania",5,6]
["2020-06-13",25,14,67,30,136,"Pennsylvania",6,6]
["2020-06-14",3,7,10,7,27,"Pennsylvania",7,6]
["2020-06-15",9,9,66,5,89,"Pennsylvania",1,6]
["2020-06-16",15,20,42,6,83,"Pennsylvania",2,6]
["2020-06-17",6,30,69,13,118,"Pennsylvania",3,6]
["2020-06-18",9,12,30,12,63,"Pennsylvania",4,6]
["2020-06-19",30,17,49,25,121,"Pennsylvania",5,6]
["2020-06-20",28,23,47,4,102,"Pennsylvania",6,6]
["2020-06-21",5,9,12,5,31,"Pennsylvania",7,6]
["2020-06-22",21,24,73,15,133,"Pennsylvania",1,6]
["2020-06-23",22,22,18,6,68,"Pennsylvania",2,6]
["2020-06-24",10,10,91,13,124,"Pennsylvania",3,6]
["2020-06-25",6,12,19,6,43,"Pennsylvania",4,6]
["2020-06-26",3,13,76,10,102,"Pennsylvania",5,6]
["2020-06-27",14,22,58,9,103,"Pennsylvania",6,6]
["2020-06-28",6,5,29,5,45,"Pennsylvania",7,6]
["2020-06-29",26,30,28,17,101,"Pennsylvania",1,6]
["2020-06-30",28,11,24,25,88,"Pennsylvania",2,6]
["2020-07-01",17,19,29,21,86,"Rhode Island",3,7]
["2020-07-02",5,12,8,11,36,"Rhode Island",4,7]
["2020-07-03",7,18,97,30,152,"Rhode Island",5,7]
["2020-07-04",26,18,48,10,102,"Rhode Island",6,7]
["2020-07-05",6,7,21,2,36,"Rhode Island",7,7]
["2020-07-06",18,19,10,23,70,"Rhode Island",1,7]
["2020-07-07",6,11,54,8,79,"Rhode Island",2,7]
["2020-07-08",5,26,35,3,69,"Rhode Island",3,7]
["2020-07-09",7,9,32,7,55,"Rhode Island",4,7]
["2020-07-10",6,21,80,26,133,"Rhode Island",5,7]
["2020-07-11",13,3,93,4,113,"Rhode Island",6,7]
["2020-07-12",9,1,27,6,{"$f":"SUM(B196:E196)","v":43},"Rhode Island",{"$f":"WEEKDAY(A196,2)","v":7},{"$f":"MONTH(A196)","v":7}]
["2020-07-13",19,19,53,19,110,"Rhode Island",1,7]
["2020-07-14",15,20,89,9,133,"Rhode Island",2,7]
["2020-07-15",27,20,87,18,152,"Rhode Island",3,7]
["2020-07-16",12,4,30,5,51,"Rhode Island",4,7]
["2020-07-17",15,10,75,29,129,"Rhode Island",5,7]
["2020-07-18",22,10,59,22,113,"Rhode Island",6,7]
["2020-07-19",3,1,25,3,32,"Rhode Island",7,7]
["2020-07-20",16,4,84,5,109,"Rhode Island",1,7]
["2020-07-21",19,5,97,16,137,"Rhode Island",2,7]
["2020-07-22",5,30,21,24,80,"Rhode Island",3,7]
["2020-07-23",10,10,38,5,63,"Rhode Island",4,7]
["2020-07-24",3,6,44,14,67,"Rhode Island",5,7]
["2020-07-25",22,20,36,25,103,"Rhode Island",6,7]
["2020-07-26",10,3,15,1,29,"Rhode Island",7,7]
["2020-07-27",3,16,31,18,68,"Rhode Island",1,7]
["2020-07-28",4,25,21,13,63,"Rhode Island",2,7]
["2020-07-29",13,28,80,19,140,"Rhode Island",3,7]
["2020-07-30",4,6,43,3,56,"Rhode Island",4,7]
["2020-07-31",25,21,21,7,74,"Rhode Island",5,7]
["2020-08-01",30,3,16,11,60,"South Carolina",6,8]
["2020-08-02",2,9,22,1,34,"South Carolina",7,8]
["2020-08-03",13,20,47,16,96,"South Carolina",1,8]
["2020-08-04",5,26,10,17,58,"South Carolina",2,8]
["2020-08-05",16,12,48,7,83,"South Carolina",3,8]
["2020-08-06",5,11,18,15,49,"South Carolina",4,8]
["2020-08-07",14,23,30,17,84,"South Carolina",5,8]
["2020-08-08",9,25,86,17,137,"South Carolina",6,8]
["2020-08-09",9,6,17,7,39,"South Carolina",7,8]
["2020-08-10",27,28,34,20,109,"South Carolina",1,8]
["2020-08-11",30,18,13,16,77,"South Carolina",2,8]
["2020-08-12",22,23,12,20,77,"South Carolina",3,8]
["2020-08-13",10,1,26,14,51,"South Carolina",4,8]
["2020-08-14",5,25,28,24,82,"South Carolina",5,8]
["2020-08-15",17,21,15,3,56,"South Carolina",6,8]
["2020-08-16",5,7,17,4,33,"South Carolina",7,8]
["2020-08-17",26,3,66,26,121,"South Carolina",1,8]
["2020-08-18",5,27,94,10,136,"South Carolina",2,8]
["2020-08-19",13,4,40,11,68,"South Carolina",3,8]
["2020-08-20",5,4,24,13,46,"South Carolina",4,8]
["2020-08-21",5,17,85,22,129,"South Carolina",5,8]
["2020-08-22",28,8,45,15,96,"South Carolina",6,8]
["2020-08-23",6,7,11,1,25,"South Carolina",7,8]
["2020-08-24",28,6,44,12,90,"South Carolina",1,8]
["2020-08-25",16,9,16,16,57,"South Carolina",2,8]
["2020-08-26",16,18,24,20,78,"South Carolina",3,8]
["2020-08-27",5,12,43,9,69,"South Carolina",4,8]
["2020-08-28",3,19,71,25,118,"South Carolina",5,8]
["2020-08-29",27,29,30,4,90,"South Carolina",6,8]
["2020-08-30",1,3,4,8,16,"South Carolina",7,8]
["2020-08-31",9,6,19,30,64,"South Carolina",1,8]
["2020-09-01",26,30,45,11,112,"South Dakota",2,9]
["2020-09-02",13,20,49,25,107,"South Dakota",3,9]
["2020-09-03",12,6,41,2,61,"South Dakota",4,9]
["2020-09-04",12,21,46,30,109,"South Dakota",5,9]
["2020-09-05",15,12,59,6,92,"South Dakota",6,9]
["2020-09-06",3,8,24,9,44,"South Dakota",7,9]
["2020-09-07",29,9,30,13,81,"South Dakota",1,9]
["2020-09-08",10,17,98,6,131,"South Dakota",2,9]
["2020-09-09",17,23,91,18,149,"South Dakota",3,9]
["2020-09-10",12,1,20,4,37,"South Dakota",4,9]
["2020-09-11",20,15,22,29,86,"South Dakota",5,9]
["2020-09-12",4,30,16,9,59,"South Dakota",6,9]
["2020-09-13",1,2,4,5,12,"South Dakota",7,9]
["2020-09-14",20,12,31,6,{"$f":"SUM(B260:E260)","v":69},"South Dakota",{"$f":"WEEKDAY(A260,2)","v":1},{"$f":"MONTH(A260)","v":9}]
["2020-09-15",12,3,32,16,63,"South Dakota",2,9]
["2020-09-16",10,19,29,30,88,"South Dakota",3,9]
["2020-09-17",7,6,5,7,25,"South Dakota",4,9]
["2020-09-18",25,21,31,30,107,"South Dakota",5,9]
["2020-09-19",14,18,23,21,76,"South Dakota",6,9]
["2020-09-20",2,7,15,8,32,"South Dakota",7,9]
["2020-09-21",14,22,76,3,115,"South Dakota",1,9]
["2020-09-22",4,26,30,27,87,"South Dakota",2,9]
["2020-09-23",11,22,25,23,81,"South Dakota",3,9]
["2020-09-24",8,4,30,3,45,"South Dakota",4,9]
["2020-09-25",20,29,84,6,139,"South Dakota",5,9]
["2020-09-26",5,24,38,25,92,"South Dakota",6,9]
["2020-09-27",10,3,20,9,42,"South Dakota",7,9]
["2020-09-28",16,17,12,12,57,"South Dakota",1,9]
["2020-09-29",14,8,87,10,119,"South Dakota",2,9]
["2020-09-30",21,13,76,25,135,"South Dakota",3,9]
["2020-10-01",11,6,35,14,66,"Tennessee",4,10]
["2020-10-02",20,14,45,28,107,"Tennessee",5,10]
["2020-10-03",13,15,24,14,66,"Tennessee",6,10]
["2020-10-04",4,1,15,9,29,"Tennessee",7,10]
["2020-10-05",8,3,23,16,50,"Tennessee",1,10]
["2020-10-06",13,13,10,9,45,"Tennessee",2,10]
["2020-10-07",6,23,59,20,108,"Tennessee",3,10]
["2020-10-08",13,7,28,14,62,"Tennessee",4,10]
["2020-10-09",21,5,68,25,119,"Tennessee",5,10]
["2020-10-10",12,12,39,12,75,"Tennessee",6,10]
["2020-10-11",2,4,28,3,37,"Tennessee",7,10]
["2020-10-12",17,16,41,28,102,"Tennessee",1,10]
["2020-10-13",9,29,36,17,91,"Tennessee",2,10]
["2020-10-14",14,18,80,17,129,"Tennessee",3,10]
["2020-10-15",6,5,43,14,68,"Tennessee",4,10]
["2020-10-16",14,26,78,22,140,"Tennessee",5,10]
["2020-10-17",17,18,75,5,115,"Tennessee",6,10]
["2020-10-18",8,6,24,9,47,"Tennessee",7,10]
["2020-10-19",10,21,69,11,111,"Tennessee",1,10]
["2020-10-20",14,28,65,9,116,"Tennessee",2,10]
["2020-10-21",18,6,54,11,89,"Tennessee",3,10]
["2020-10-22",13,15,11,7,46,"Tennessee",4,10]
["2020-10-23",14,19,95,6,134,"Tennessee",5,10]
["2020-10-24",16,16,50,12,94,"Tennessee",6,10]
["2020-10-25",1,2,20,8,31,"Tennessee",7,10]
["2020-10-26",20,6,70,7,103,"Tennessee",1,10]
["2020-10-27",20,23,46,16,105,"Tennessee",2,10]
["2020-10-28",24,24,28,14,90,"Tennessee",3,10]
["2020-10-29",11,2,9,10,32,"Tennessee",4,10]
["2020-10-30",21,28,96,28,173,"Tennessee",5,10]
["2020-10-31",5,22,10,24,61,"Tennessee",6,10]
["2020-11-01",5,5,12,5,27,"North Carolina",7,11]
["2020-11-02",18,5,91,18,132,"North Carolina",1,11]
["2020-11-03",12,10,19,7,48,"North Carolina",2,11]
["2020-11-04",27,21,51,13,112,"North Carolina",3,11]
["2020-11-05",11,10,18,12,51,"North Carolina",4,11]
["2020-11-06",18,30,22,29,99,"North Carolina",5,11]
["2020-11-07",10,28,60,28,126,"North Carolina",6,11]
["2020-11-08",7,8,12,9,36,"North Carolina",7,11]
["2020-11-09",10,10,14,17,51,"North Carolina",1,11]
["2020-11-10",25,11,95,20,151,"North Carolina",2,11]
["2020-11-11",9,28,33,27,97,"North Carolina",3,11]
["2020-11-12",12,11,39,15,77,"North Carolina",4,11]
["2020-11-13",6,5,91,9,111,"North Carolina",5,11]
["2020-11-14",11,29,31,11,82,"North Carolina",6,11]
["2020-11-15",4,8,5,4,21,"North Carolina",7,11]
["2020-11-16",8,27,98,18,151,"North Carolina",1,11]
["2020-11-17",27,30,23,26,{"$f":"SUM(B324:E324)","v":106},"North Carolina",{"$f":"WEEKDAY(A324,2)","v":2},{"$f":"MONTH(A324)","v":11}]
["2020-11-18",22,9,18,11,60,"North Carolina",3,11]
["2020-11-19",13,12,12,2,39,"North Carolina",4,11]
["2020-11-20",5,3,41,25,74,"North Carolina",5,11]
["2020-11-21",22,24,61,23,130,"North Carolina",6,11]
["2020-11-22",9,7,26,2,44,"North Carolina",7,11]
["2020-11-23",9,30,23,21,83,"North Carolina",1,11]
["2020-11-24",13,17,52,12,94,"North Carolina",2,11]
["2020-11-25",3,30,39,25,97,"North Carolina",3,11]
["2020-11-26",1,10,46,10,67,"North Carolina",4,11]
["2020-11-27",25,13,35,16,89,"North Carolina",5,11]
["2020-11-28",21,21,62,16,120,"North Carolina",6,11]
["2020-11-29",9,8,20,1,38,"North Carolina",7,11]
["2020-11-30",28,29,16,9,82,"North Carolina",1,11]
["2020-12-01",27,16,83,12,138,"North Dakota",2,12]
["2020-12-02",4,27,84,26,141,"North Dakota",3,12]
["2020-12-03",9,12,46,11,78,"North Dakota",4,12]
["2020-12-04",4,22,28,8,62,"North Dakota",5,12]
["2020-12-05",19,6,78,25,128,"North Dakota",6,12]
["2020-12-06",9,3,28,6,46,"North Dakota",7,12]
["2020-12-07",5,16,87,16,124,"North Dakota",1,12]
["2020-12-08",20,30,88,23,161,"North Dakota",2,12]
["2020-12-09",14,23,29,21,87,"North Dakota",3,12]
["2020-12-10",13,13,34,14,74,"North Dakota",4,12]
["2020-12-11",5,25,49,3,82,"North Dakota",5,12]
["2020-12-12",12,23,49,17,101,"North Dakota",6,12]
["2020-12-13",3,5,27,9,44,"North Dakota",7,12]
["2020-12-14",15,8,30,29,82,"North Dakota",1,12]
["2020-12-15",25,24,94,10,153,"North Dakota",2,12]
["2020-12-16",15,8,56,15,94,"North Dakota",3,12]
["2020-12-17",13,15,22,11,61,"North Dakota",4,12]
["2020-12-18",9,29,27,3,68,"North Dakota",5,12]
["2020-12-19",25,20,51,6,102,"North Dakota",6,12]
["2020-12-20",1,1,31,2,35,"North Dakota",7,12]
["2020-12-21",4,22,32,30,88,"North Dakota",1,12]
["2020-12-22",26,26,94,8,154,"North Dakota",2,12]
["2020-12-23",21,28,87,29,165,"North Dakota",3,12]
["2020-12-24",8,6,12,7,33,"North Dakota",4,12]
["2020-12-25",26,17,38,13,94,"North Dakota",5,12]
["2020-12-26",22,30,55,25,132,"North Dakota",6,12]
["2020-12-27",3,9,26,7,45,"North Dakota",7,12]
["2020-12-28",24,29,42,16,111,"North Dakota",1,12]
["2020-12-29",22,17,46,9,94,"North Dakota",2,12]
["2020-12-30",30,19,69,28,146,"North Dakota",3,12]
["2020-12-31",8,15,17,3,43,"North Dakota",4,12]
[null,null,null,null,null,{"$f":"SUM(F3:F368)","v":31442}]

{"sheet":"5-Manager","index":5,"n_rows":369,"n_cols":10,"rows_kept":369,"cut":false,"hidden":false,"merged":[[0,9,0,19],[0,8,1,8],[0,0,1,0],[0,1,0,4],[0,6,1,6],[0,5,1,5],[0,7,1,7]]}
["Date","Product Groups",null,null,null,"Total sales","State","Days of the week","№ Month","https://exceltable.com/en/templates/3d-menu-for-dashboard-in-excel"]
[null,"A","B","C","D"]
["2020-01-01",15,9,8,77,{"$f":"SUM(B3:E3)","v":109},"Texas",{"$f":"WEEKDAY(A3,2)","v":3},{"$f":"MONTH(A3)","v":1}]
["2020-01-02",11,5,49,29,94,"Texas",{"$f":"WEEKDAY(A4,2)","v":4},{"$f":"MONTH(A4)","v":1}]
["2020-01-03",20,8,30,19,77,"Texas",5,1]
["2020-01-04",4,1,22,12,39,"Texas",6,1]
["2020-01-05",2,3,8,18,31,"Texas",7,1]
["2020-01-06",7,6,19,85,117,"Texas",1,1]
["2020-01-07",13,4,19,24,60,"Texas",2,1]
["2020-01-08",16,6,10,28,60,"Texas",3,1]
["2020-01-09",16,7,49,89,161,"Texas",4,1]
["2020-01-10",2,5,25,57,89,"Texas",5,1]
["2020-01-11",5,1,17,21,44,"Texas",6,1]
["2020-01-12",6,2,2,16,26,"Texas",7,1]
["2020-01-13",11,10,29,48,98,"Texas",1,1]
["2020-01-14",15,6,48,96,165,"Texas",2,1]
["2020-01-15",5,10,12,30,57,"Texas",3,1]
["2020-01-16",16,2,26,72,116,"Texas",4,1]
["2020-01-17",17,5,44,47,113,"Texas",5,1]
["2020-01-18",5,3,14,8,30,"Texas",6,1]
["2020-01-19",5,0,1,5,11,"Texas",7,1]
["2020-01-20",18,2,26,53,99,"Texas",1,1]
["2020-01-21",5,6,49,31,91,"Texas",2,1]
["2020-01-22",5,5,33,68,111,"Texas",3,1]
["2020-01-23",11,7,8,75,101,"Texas",4,1]
["2020-01-24",6,5,33,56,100,"Texas",5,1]
["2020-01-25",9,4,14,11,38,"Texas",6,1]
["2020-01-26",4,1,10,31,46,"Texas",7,1]
["2020-01-27",12,2,40,79,133,"Texas",1,1]
["2020-01-28",20,6,6,92,124,"Texas",2,1]
["2020-01-29",5,5,40,55,105,"Texas",3,1]
["2020-01-30",5,7,8,59,79,"Texas",4,1]
["2020-01-31",6,7,31,27,71,"Texas",5,1]
["2020-02-01",7,1,10,5,23,"Utah",6,2]
["2020-02-02",3,0,2,31,36,"Utah",7,2]
["2020-02-03",5,8,8,33,54,"Utah",1,2]
["2020-02-04",12,3,19,78,112,"Utah",2,2]
["2020-02-05",7,5,38,28,78,"Utah",3,2]
["2020-02-06",16,10,24,70,120,"Utah",4,2]
["2020-02-07",3,6,6,32,47,"Utah",5,2]
["2020-02-08",10,2,9,31,52,"Utah",6,2]
["2020-02-09",4,1,3,18,26,"Utah",7,2]
["2020-02-10",6,4,12,54,76,"Utah",1,2]
["2020-02-11",15,6,10,63,94,"Utah",2,2]
["2020-02-12",6,8,17,29,60,"Utah",3,2]
["2020-02-13",17,3,50,40,110,"Utah",4,2]
["2020-02-14",17,2,6,62,87,"Utah",5,2]
["2020-02-15",2,2,21,33,58,"Utah",6,2]
["2020-02-16",2,0,12,15,29,"Utah",7,2]
["2020-02-17",6,9,18,10,43,"Utah",1,2]
["2020-02-18",16,8,13,76,113,"Utah",2,2]
["2020-02-19",7,1,49,16,73,"Utah",3,2]
["2020-02-20",4,9,16,25,54,"Utah",4,2]
["2020-02-21",19,8,36,97,160,"Utah",5,2]
["2020-02-22",4,3,15,35,57,"Utah",6,2]
["2020-02-23",5,2,3,7,17,"Utah",7,2]
["2020-02-24",19,2,29,74,124,"Utah",1,2]
["2020-02-25",3,8,32,80,123,"Utah",2,2]
["2020-02-26",14,1,15,77,107,"Utah",3,2]
["2020-02-27",8,9,16,40,73,"Utah",4,2]
["2020-02-28",2,1,37,37,77,"Utah",5,2]
["2020-02-29",3,4,11,39,57,"Utah",6,2]
["2020-03-01",6,2,4,17,29,"Vermont",7,3]
["2020-03-02",17,2,14,44,77,"Vermont",1,3]
["2020-03-03",4,2,38,45,89,"Vermont",2,3]
["2020-03-04",14,8,38,56,116,"Vermont",3,3]
["2020-03-05",8,4,18,77,107,"Vermont",4,3]
["2020-03-06",3,5,23,38,{"$f":"SUM(B68:E68)","v":69},"Vermont",{"$f":"WEEKDAY(A68,2)","v":5},{"$f":"MONTH(A68)","v":3}]
["2020-03-07",9,4,24,28,65,"Vermont",6,3]
["2020-03-08",1,1,11,14,27,"Vermont",7,3]
["2020-03-09",3,9,16,54,82,"Vermont",1,3]
["2020-03-10",10,8,23,42,83,"Vermont",2,3]
["2020-03-11",10,1,41,28,80,"Vermont",3,3]
["2020-03-12",2,5,13,75,95,"Vermont",4,3]
["2020-03-13",15,6,9,97,127,"Vermont",5,3]
["2020-03-14",1,1,4,47,53,"Vermont",6,3]
["2020-03-15",2,3,2,11,18,"Vermont",7,3]
["2020-03-16",19,6,6,53,84,"Vermont",1,3]
["2020-03-17",12,4,11,48,75,"Vermont",2,3]
["2020-03-18",13,7,32,12,64,"Vermont",3,3]
["2020-03-19",5,2,22,56,85,"Vermont",4,3]
["2020-03-20",5,9,18,73,105,"Vermont",5,3]
["2020-03-21",8,1,15,50,74,"Vermont",6,3]
["2020-03-22",4,2,4,23,33,"Vermont",7,3]
["2020-03-23",20,10,48,96,174,"Vermont",1,3]
["2020-03-24",6,2,22,12,42,"Vermont",2,3]
["2020-03-25",16,5,43,16,80,"Vermont",3,3]
["2020-03-26",18,3,36,93,150,"Vermont",4,3]
["2020-03-27",15,2,25,92,134,"Vermont",5,3]
["2020-03-28",5,3,17,15,40,"Vermont",6,3]
["2020-03-29",6,1,5,25,37,"Vermont",7,3]
["2020-03-30",17,10,18,91,136,"Vermont",1,3]
["2020-03-31",3,5,50,94,152,"Vermont",2,3]
["2020-04-01",9,5,21,43,78,"Virginia",3,4]
["2020-04-02",8,9,34,45,96,"Virginia",4,4]
["2020-04-03",11,1,10,59,81,"Virginia",5,4]
["2020-04-04",9,3,25,29,66,"Virginia",6,4]
["2020-04-05",1,1,12,16,30,"Virginia",7,4]
["2020-04-06",19,5,12,47,83,"Virginia",1,4]
["2020-04-07",14,8,12,49,83,"Virginia",2,4]
["2020-04-08",4,7,15,99,125,"Virginia",3,4]
["2020-04-09",17,8,31,25,81,"Virginia",4,4]
["2020-04-10",8,3,18,20,49,"Virginia",5,4]
["2020-04-11",7,4,19,49,79,"Virginia",6,4]
["2020-04-12",5,2,10,27,44,"Virginia",7,4]
["2020-04-13",5,3,18,14,40,"Virginia",1,4]
["2020-04-14",10,1,43,62,116,"Virginia",2,4]
["2020-04-15",9,1,21,64,95,"Virginia",3,4]
["2020-04-16",7,5,48,98,158,"Virginia",4,4]
["2020-04-17",2,9,38,56,105,"Virginia",5,4]
["2020-04-18",8,1,3,21,33,"Virginia",6,4]
["2020-04-19",5,2,2,8,17,"Virginia",7,4]
["2020-04-20",20,8,6,72,106,"Virginia",1,4]
["2020-04-21",20,5,10,22,57,"Virginia",2,4]
["2020-04-22",15,1,15,96,127,"Virginia",3,4]
["2020-04-23",17,9,23,33,82,"Virginia",4,4]
["2020-04-24",12,7,32,35,86,"Virginia",5,4]
["2020-04-25",5,1,15,41,62,"Virginia",6,4]
["2020-04-26",3,2,5,19,29,"Virginia",7,4]
["2020-04-27",13,8,15,81,117,"Virginia",1,4]
["2020-04-28",10,4,46,87,147,"Virginia",2,4]
["2020-04-29",18,2,26,14,60,"Virginia",3,4]
["2020-04-30",5,2,44,83,134,"Virginia",4,4]
["2020-05-01",7,7,28,32,74,"Washington",5,5]
["2020-05-02",3,4,10,37,54,"Washington",6,5]
["2020-05-03",1,0,6,13,20,"Washington",7,5]
["2020-05-04",18,3,38,17,76,"Washington",1,5]
["2020-05-05",15,10,6,47,78,"Washington",2,5]
["2020-05-06",6,7,30,39,82,"Washington",3,5]
["2020-05-07",5,4,40,31,80,"Washington",4,5]
["2020-05-08",20,9,47,22,98,"Washington",5,5]
["2020-05-09",3,4,23,13,{"$f":"SUM(B132:E132)","v":43},"Washington",{"$f":"WEEKDAY(A132,2)","v":6},{"$f":"MONTH(A132)","v":5}]
["2020-05-10",1,3,16,21,41,"Washington",7,5]
["2020-05-11",18,4,13,65,100,"Washington",1,5]
["2020-05-12",20,2,7,77,106,"Washington",2,5]
["2020-05-13",7,3,47,13,70,"Washington",3,5]
["2020-05-14",5,1,31,54,91,"Washington",4,5]
["2020-05-15",3,3,17,88,111,"Washington",5,5]
["2020-05-16",9,0,7,12,28,"Washington",6,5]
["2020-05-17",6,3,13,24,46,"Washington",7,5]
["2020-05-18",12,6,7,60,85,"Washington",1,5]
["2020-05-19",8,8,12,33,61,"Washington",2,5]
["2020-05-20",16,7,9,57,89,"Washington",3,5]
["2020-05-21",17,6,24,29,76,"Washington",4,5]
["2020-05-22",5,1,24,16,46,"Washington",5,5]
["2020-05-23",1,1,22,32,56,"Washington",6,5]
["2020-05-24",5,2,10,20,37,"Washington",7,5]
["2020-05-25",16,4,6,10,36,"Washington",1,5]
["2020-05-26",9,8,9,22,48,"Washington",2,5]
["2020-05-27",16,8,29,30,83,"Washington",3,5]
["2020-05-28",10,6,33,81,130,"Washington",4,5]
["2020-05-29",14,9,16,95,134,"Washington",5,5]
["2020-05-30",9,1,18,20,48,"Washington",6,5]
["2020-05-31",0,3,10,25,38,"Washington",7,5]
["2020-06-01",14,9,35,30,88,"West Virginia",1,6]
["2020-06-02",4,6,12,72,94,"West Virginia",2,6]
["2020-06-03",13,6,8,73,100,"West Virginia",3,6]
["2020-06-04",17,5,16,84,122,"West Virginia",4,6]
["2020-06-05",14,1,40,91,146,"West Virginia",5,6]
["2020-06-06",4,1,19,26,50,"West Virginia",6,6]
["2020-06-07",6,1,2,11,20,"West Virginia",7,6]
["2020-06-08",8,10,15,70,103,"West Virginia",1,6]
["2020-06-09",6,10,13,34,63,"West Virginia",2,6]
["2020-06-10",9,1,30,15,55,"West Virginia",3,6]
["2020-06-11",8,5,9,41,63,"West Virginia",4,6]
["2020-06-12",16,4,36,41,97,"West Virginia",5,6]
["2020-06-13",5,2,2,47,56,"West Virginia",6,6]
["2020-06-14",3,1,15,28,47,"West Virginia",7,6]
["2020-06-15",15,3,47,47,112,"West Virginia",1,6]
["2020-06-16",16,10,37,32,95,"West Virginia",2,6]
["2020-06-17",15,8,28,55,106,"West Virginia",3,6]
["2020-06-18",9,8,32,59,108,"West Virginia",4,6]
["2020-06-19",8,3,10,78,99,"West Virginia",5,6]
["2020-06-20",6,3,22,46,77,"West Virginia",6,6]
["2020-06-21",3,2,4,8,17,"West Virginia",7,6]
["2020-06-22",14,2,41,32,89,"West Virginia",1,6]
["2020-06-23",13,5,19,65,102,"West Virginia",2,6]
["2020-06-24",2,3,43,67,115,"West Virginia",3,6]
["2020-06-25",13,5,9,94,121,"West Virginia",4,6]
["2020-06-26",19,2,38,40,99,"West Virginia",5,6]
["2020-06-27",7,3,2,47,59,"West Virginia",6,6]
["2020-06-28",4,1,16,15,36,"West Virginia",7,6]
["2020-06-29",13,7,17,91,128,"West Virginia",1,6]
["2020-06-30",7,6,41,66,120,"West Virginia",2,6]
["2020-07-01",13,9,26,95,143,"Wisconsin",3,7]
["2020-07-02",5,7,40,69,121,"Wisconsin",4,7]
["2020-07-03",11,1,35,62,109,"Wisconsin",5,7]
["2020-07-04",7,5,22,38,72,"Wisconsin",6,7]
["2020-07-05",0,0,16,6,22,"Wisconsin",7,7]
["2020-07-06",3,5,15,80,103,"Wisconsin",1,7]
["2020-07-07",11,1,5,22,39,"Wisconsin",2,7]
["2020-07-08",16,2,21,89,128,"Wisconsin",3,7]
["2020-07-09",5,9,26,54,94,"Wisconsin",4,7]
["2020-07-10",2,2,7,35,46,"Wisconsin",5,7]
["2020-07-11",7,4,16,48,75,"Wisconsin",6,7]
["2020-07-12",3,0,11,25,{"$f":"SUM(B196:E196)","v":39},"Wisconsin",{"$f":"WEEKDAY(A196,2)","v":7},{"$f":"MONTH(A196)","v":7}]
["2020-07-13",13,8,22,22,65,"Wisconsin",1,7]
["2020-07-14",9,9,26,36,80,"Wisconsin",2,7]
["2020-07-15",4,1,11,73,89,"Wisconsin",3,7]
["2020-07-16",2,5,46,73,126,"Wisconsin",4,7]
["2020-07-17",12,6,9,58,85,"Wisconsin",5,7]
["2020-07-18",8,2,15,26,51,"Wisconsin",6,7]
["2020-07-19",3,1,3,21,28,"Wisconsin",7,7]
["2020-07-20",7,9,36,83,135,"Wisconsin",1,7]
["2020-07-21",12,10,37,76,135,"Wisconsin",2,7]
["2020-07-22",19,4,36,16,75,"Wisconsin",3,7]
["2020-07-23",16,5,34,28,83,"Wisconsin",4,7]
["2020-07-24",12,5,25,97,139,"Wisconsin",5,7]
["2020-07-25",3,3,8,23,37,"Wisconsin",6,7]
["2020-07-26",4,2,10,29,45,"Wisconsin",7,7]
["2020-07-27",17,4,29,94,144,"Wisconsin",1,7]
["2020-07-28",19,3,44,12,78,"Wisconsin",2,7]
["2020-07-29",9,3,17,59,88,"Wisconsin",3,7]
["2020-07-30",18,2,28,52,100,"Wisconsin",4,7]
["2020-07-31",16,8,40,92,156,"Wisconsin",5,7]
["2020-08-01",8,2,6,38,54,"Wyoming",6,8]
["2020-08-02",4,3,3,29,39,"Wyoming",7,8]
["2020-08-03",17,9,6,54,86,"Wyoming",1,8]
["2020-08-04",17,7,42,73,139,"Wyoming",2,8]
["2020-08-05",6,5,16,78,105,"Wyoming",3,8]
["2020-08-06",7,5,35,62,109,"Wyoming",4,8]
["2020-08-07",11,10,6,67,94,"Wyoming",5,8]
["2020-08-08",10,5,17,27,59,"Wyoming",6,8]
["2020-08-09",3,2,9,25,39,"Wyoming",7,8]
["2020-08-10",13,9,10,57,89,"Wyoming",1,8]
["2020-08-11",7,8,49,95,159,"Wyoming",2,8]
["2020-08-12",13,6,32,58,109,"Wyoming",3,8]
["2020-08-13",19,4,16,78,117,"Wyoming",4,8]
["2020-08-14",13,4,6,34,57,"Wyoming",5,8]
["2020-08-15",2,5,8,32,47,"Wyoming",6,8]
["2020-08-16",5,1,13,17,36,"Wyoming",7,8]
["2020-08-17",6,1,44,34,85,"Wyoming",1,8]
["2020-08-18",3,3,15,22,43,"Wyoming",2,8]
["2020-08-19",6,1,40,42,89,"Wyoming",3,8]
["2020-08-20",9,9,42,75,135,"Wyoming",4,8]
["2020-08-21",17,9,48,56,130,"Wyoming",5,8]
["2020-08-22",4,1,22,39,66,"Wyoming",6,8]
["2020-08-23",3,2,8,3,16,"Wyoming",7,8]
["2020-08-24",2,3,36,83,124,"Wyoming",1,8]
["2020-08-25",18,7,21,23,69,"Wyoming",2,8]
["2020-08-26",11,5,7,82,105,"Wyoming",3,8]
["2020-08-27",7,7,15,60,89,"Wyoming",4,8]
["2020-08-28",2,1,34,17,54,"Wyoming",5,8]
["2020-08-29",4,0,17,30,51,"Wyoming",6,8]
["2020-08-30",3,2,16,30,51,"Wyoming",7,8]
["2020-08-31",18,8,36,95,157,"Wyoming",1,8]
["2020-09-01",13,1,27,43,84,"Texas",2,9]
["2020-09-02",14,3,12,23,52,"Texas",3,9]
["2020-09-03",18,2,39,49,108,"Texas",4,9]
["2020-09-04",15,8,50,100,173,"Texas",5,9]
["2020-09-05",5,2,10,40,57,"Texas",6,9]
["2020-09-06",5,1,13,14,33,"Texas",7,9]
["2020-09-07",5,6,44,89,144,"Texas",1,9]
["2020-09-08",19,1,28,43,91,"Texas",2,9]
["2020-09-09",11,1,41,63,116,"Texas",3,9]
["2020-09-10",15,8,8,41,72,"Texas",4,9]
["2020-09-11",15,1,29,68,113,"Texas",5,9]
["2020-09-12",3,1,8,50,62,"Texas",6,9]
["2020-09-13",4,0,16,26,46,"Texas",7,9]
["2020-09-14",15,2,11,56,{"$f":"SUM(B260:E260)","v":84},"Texas",{"$f":"WEEKDAY(A260,2)","v":1},{"$f":"MONTH(A260)","v":9}]
["2020-09-15",6,6,50,11,73,"Texas",2,9]
["2020-09-16",4,7,18,62,91,"Texas",3,9]
["2020-09-17",10,1,28,24,63,"Texas",4,9]
["2020-09-18",12,3,47,51,113,"Texas",5,9]
["2020-09-19",7,1,4,7,19,"Texas",6,9]
["2020-09-20",4,2,9,17,32,"Texas",7,9]
["2020-09-21",3,1,32,24,60,"Texas",1,9]
["2020-09-22",13,5,21,41,80,"Texas",2,9]
["2020-09-23",9,9,17,24,59,"Texas",3,9]
["2020-09-24",10,10,42,57,119,"Texas",4,9]
["2020-09-25",14,6,21,22,63,"Texas",5,9]
["2020-09-26",7,1,8,49,65,"Texas",6,9]
["2020-09-27",5,1,14,15,35,"Texas",7,9]
["2020-09-28",13,1,9,73,96,"Texas",1,9]
["2020-09-29",17,9,26,91,143,"Texas",2,9]
["2020-09-30",3,9,25,32,69,"Texas",3,9]
["2020-10-01",12,3,26,91,132,"Utah",4,10]
["2020-10-02",19,7,18,79,123,"Utah",5,10]
["2020-10-03",9,2,19,18,48,"Utah",6,10]
["2020-10-04",1,1,9,17,28,"Utah",7,10]
["2020-10-05",12,7,15,29,63,"Utah",1,10]
["2020-10-06",9,4,48,67,128,"Utah",2,10]
["2020-10-07",4,10,12,91,117,"Utah",3,10]
["2020-10-08",7,5,33,41,86,"Utah",4,10]
["2020-10-09",19,1,49,43,112,"Utah",5,10]
["2020-10-10",9,0,24,9,42,"Utah",6,10]
["2020-10-11",2,1,1,7,11,"Utah",7,10]
["2020-10-12",18,6,20,90,134,"Utah",1,10]
["2020-10-13",15,1,26,98,140,"Utah",2,10]
["2020-10-14",11,4,7,80,102,"Utah",3,10]
["2020-10-15",14,3,47,88,152,"Utah",4,10]
["2020-10-16",6,4,46,77,133,"Utah",5,10]
["2020-10-17",5,2,25,15,47,"Utah",6,10]
["2020-10-18",1,0,6,9,16,"Utah",7,10]
["2020-10-19",8,3,27,25,63,"Utah",1,10]
["2020-10-20",14,8,23,96,141,"Utah",2,10]
["2020-10-21",12,1,44,46,103,"Utah",3,10]
["2020-10-22",6,3,25,59,93,"Utah",4,10]
["2020-10-23",10,2,36,32,80,"Utah",5,10]
["2020-10-24",4,2,13,10,29,"Utah",6,10]
["2020-10-25",1,1,9,9,20,"Utah",7,10]
["2020-10-26",17,10,40,69,136,"Utah",1,10]
["2020-10-27",20,7,20,77,124,"Utah",2,10]
["2020-10-28",14,1,17,64,96,"Utah",3,10]
["2020-10-29",3,8,27,38,76,"Utah",4,10]
["2020-10-30",12,8,22,51,93,"Utah",5,10]
["2020-10-31",2,0,4,44,50,"Utah",6,10]
["2020-11-01",4,0,15,9,28,"Vermont",7,11]
["2020-11-02",20,10,7,84,121,"Vermont",1,11]
["2020-11-03",4,1,16,86,107,"Vermont",2,11]
["2020-11-04",2,2,21,94,119,"Vermont",3,11]
["2020-11-05",20,7,27,20,74,"Vermont",4,11]
["2020-11-06",4,10,27,25,66,"Vermont",5,11]
["2020-11-07",2,1,25,35,63,"Vermont",6,11]
["2020-11-08",4,1,6,29,40,"Vermont",7,11]
["2020-11-09",10,2,28,45,85,"Vermont",1,11]
["2020-11-10",10,10,16,65,101,"Vermont",2,11]
["2020-11-11",17,3,45,60,125,"Vermont",3,11]
["2020-11-12",17,9,27,100,153,"Vermont",4,11]
["2020-11-13",8,1,41,28,78,"Vermont",5,11]
["2020-11-14",1,3,16,22,42,"Vermont",6,11]
["2020-11-15",2,3,10,6,21,"Vermont",7,11]
["2020-11-16",4,9,29,74,116,"Vermont",1,11]
["2020-11-17",13,8,42,59,{"$f":"SUM(B324:E324)","v":122},"Vermont",{"$f":"WEEKDAY(A324,2)","v":2},{"$f":"MONTH(A324)","v":11}]
["2020-11-18",18,8,17,59,102,"Vermont",3,11]
["2020-11-19",8,2,11,82,103,"Vermont",4,11]
["2020-11-20",3,6,30,94,133,"Vermont",5,11]
["2020-11-21",7,3,12,24,46,"Vermont",6,11]
["2020-11-22",6,2,16,15,39,"Vermont",7,11]
["2020-11-23",18,6,36,63,123,"Vermont",1,11]
["2020-11-24",5,8,21,42,76,"Vermont",2,11]
["2020-11-25",19,7,11,80,117,"Vermont",3,11]
["2020-11-26",4,1,43,29,77,"Vermont",4,11]
["2020-11-27",5,2,33,16,56,"Vermont",5,11]
["2020-11-28",6,2,24,48,80,"Vermont",6,11]
["2020-11-29",1,2,13,30,46,"Vermont",7,11]
["2020-11-30",4,6,16,33,59,"Vermont",1,11]
["2020-12-01",9,6,32,70,117,"Virginia",2,12]
["2020-12-02",7,5,18,69,99,"Virginia",3,12]
["2020-12-03",17,8,9,54,88,"Virginia",4,12]
["2020-12-04",12,5,21,22,60,"Virginia",5,12]
["2020-12-05",5,4,14,10,33,"Virginia",6,12]
["2020-12-06",2,2,6,21,31,"Virginia",7,12]
["2020-12-07",13,5,42,72,132,"Virginia",1,12]
["2020-12-08",19,4,12,21,56,"Virginia",2,12]
["2020-12-09",8,8,37,76,129,"Virginia",3,12]
["2020-12-10",7,1,47,45,100,"Virginia",4,12]
["2020-12-11",15,7,37,95,154,"Virginia",5,12]
["2020-12-12",1,0,3,43,47,"Virginia",6,12]
["2020-12-13",0,0,8,26,34,"Virginia",7,12]
["2020-12-14",8,9,23,39,79,"Virginia",1,12]
["2020-12-15",13,4,40,23,80,"Virginia",2,12]
["2020-12-16",16,9,42,20,87,"Virginia",3,12]
["2020-12-17",4,9,39,68,120,"Virginia",4,12]
["2020-12-18",3,5,22,36,66,"Virginia",5,12]
["2020-12-19",2,1,16,22,41,"Virginia",6,12]
["2020-12-20",4,0,15,23,42,"Virginia",7,12]
["2020-12-21",11,4,41,43,99,"Virginia",1,12]
["2020-12-22",4,2,23,76,105,"Virginia",2,12]
["2020-12-23",7,3,36,48,94,"Virginia",3,12]
["2020-12-24",3,2,20,50,75,"Virginia",4,12]
["2020-12-25",14,9,17,42,82,"Virginia",5,12]
["2020-12-26",6,3,23,8,40,"Virginia",6,12]
["2020-12-27",1,0,7,21,29,"Virginia",7,12]
["2020-12-28",17,8,48,56,129,"Virginia",1,12]
["2020-12-29",8,6,21,24,59,"Virginia",2,12]
["2020-12-30",15,1,7,26,49,"Virginia",3,12]
["2020-12-31",3,3,22,30,58,"Virginia",4,12]
[null,null,null,null,null,{"$f":"SUM(F3:F368)","v":29932}]

{"sheet":"ALL","index":6,"n_rows":369,"n_cols":18,"rows_kept":369,"cut":false,"hidden":false,"merged":[[0,17,0,27],[0,8,1,8],[0,0,1,0],[0,1,0,4],[0,5,1,5],[0,7,1,7]]}
["Date","Product Groups",null,null,null,"Total sales",null,"Days of the week","№ Month",null,"State","1-Manager","2-Manager","3-Manager","4-Manager","5-Manager","ALL","https://exceltable.com/en/templates/3d-menu-for-dashboard-in-excel"]
[null,"A","B","C","D",null,null,null,null,null,"Alabama",{"$f":"SUMIFS('1-Manager'!$F$3:$F$368,'1-Manager'!$G$3:$G$368,ALL!K2)","v":13784},{"$f":"SUMIFS('2-Manager'!$F$3:$F$368,'2-Manager'!$G$3:$G$368,ALL!K2)","v":0},{"$f":"SUMIFS('3-Manager'!$F$3:$F$368,'3-Manager'!$G$3:$G$368,ALL!K2)","v":0},{"$f":"SUMIFS('4-Manager'!$F$3:$F$368,'4-Manager'!$G$3:$G$368,ALL!K2)","v":0},{"$f":"SUMIFS('5-Manager'!$F$3:$F$368,'5-Manager'!$G$3:$G$368,ALL!K2)","v":0},{"$f":"SUM(L2:P2)","v":13784}]
["2020-01-01",{"$f":"'1-Manager'!B3+'2-Manager'!B3+'3-Manager'!B3+'4-Manager'!B3+'5-Manager'!B3","v":277},{"$f":"'1-Manager'!C3+'2-Manager'!C3+'3-Manager'!C3+'4-Manager'!C3+'5-Manager'!C3","v":205},{"$f":"'1-Manager'!D3+'2-Manager'!D3+'3-Manager'!D3+'4-Manager'!D3+'5-Manager'!D3","v":287},{"$f":"'1-Manager'!E3+'2-Manager'!E3+'3-Manager'!E3+'4-Manager'!E3+'5-Manager'!E3","v":161},{"$f":"SUM(B3:E3)","v":930},null,{"$f":"WEEKDAY(A3,2)","v":3},{"$f":"MONTH(A3)","v":1},null,"Arizona",{"$f":"SUMIFS('1-Manager'!$F$3:$F$368,'1-Manager'!$G$3:$G$368,ALL!K3)","v":13369},{"$f":"SUMIFS('2-Manager'!$F$3:$F$368,'2-Manager'!$G$3:$G$368,ALL!K3)","v":0},{"$f":"SUMIFS('3-Manager'!$F$3:$F$368,'3-Manager'!$G$3:$G$368,ALL!K3)","v":0},{"$f":"SUMIFS('4-Manager'!$F$3:$F$368,'4-Manager'!$G$3:$G$368,ALL!K3)","v":0},{"$f":"SUMIFS('5-Manager'!$F$3:$F$368,'5-Manager'!$G$3:$G$368,ALL!K3)","v":0},{"$f":"SUM(L3:P3)","v":13369}]
["2020-01-02",{"$f":"'1-Manager'!B4+'2-Manager'!B4+'3-Manager'!B4+'4-Manager'!B4+'5-Manager'!B4","v":241},{"$f":"'1-Manager'!C4+'2-Manager'!C4+'3-Manager'!C4+'4-Manager'!C4+'5-Manager'!C4","v":181},{"$f":"'1-Manager'!D4+'2-Manager'!D4+'3-Manager'!D4+'4-Manager'!D4+'5-Manager'!D4","v":342},{"$f":"'1-Manager'!E4+'2-Manager'!E4+'3-Manager'!E4+'4-Manager'!E4+'5-Manager'!E4","v":138},{"$f":"SUM(B4:E4)","v":902},null,{"$f":"WEEKDAY(A4,2)","v":4},{"$f":"MONTH(A4)","v":1},null,"Arkansas",{"$f":"SUMIFS('1-Manager'!$F$3:$F$368,'1-Manager'!$G$3:$G$368,ALL!K4)","v":7209},{"$f":"SUMIFS('2-Manager'!$F$3:$F$368,'2-Manager'!$G$3:$G$368,ALL!K4)","v":0},{"$f":"SUMIFS('3-Manager'!$F$3:$F$368,'3-Manager'!$G$3:$G$368,ALL!K4)","v":0},{"$f":"SUMIFS('4-Manager'!$F$3:$F$368,'4-Manager'!$G$3:$G$368,ALL!K4)","v":0},{"$f":"SUMIFS('5-Manager'!$F$3:$F$368,'5-Manager'!$G$3:$G$368,ALL!K4)","v":0},7209]
["2020-01-03",{"$f":"'1-Manager'!B5+'2-Manager'!B5+'3-Manager'!B5+'4-Manager'!B5+'5-Manager'!B5","v":300},{"$f":"'1-Manager'!C5+'2-Manager'!C5+'3-Manager'!C5+'4-Manager'!C5+'5-Manager'!C5","v":230},{"$f":"'1-Manager'!D5+'2-Manager'!D5+'3-Manager'!D5+'4-Manager'!D5+'5-Manager'!D5","v":206},{"$f":"'1-Manager'!E5+'2-Manager'!E5+'3-Manager'!E5+'4-Manager'!E5+'5-Manager'!E5","v":68},804,null,5,1,null,"California",{"$f":"SUMIFS('1-Manager'!$F$3:$F$368,'1-Manager'!$G$3:$G$368,ALL!K5)","v":7262},{"$f":"SUMIFS('2-Manager'!$F$3:$F$368,'2-Manager'!$G$3:$G$368,ALL!K5)","v":0},{"$f":"SUMIFS('3-Manager'!$F$3:$F$368,'3-Manager'!$G$3:$G$368,ALL!K5)","v":0},{"$f":"SUMIFS('4-Manager'!$F$3:$F$368,'4-Manager'!$G$3:$G$368,ALL!K5)","v":0},{"$f":"SUMIFS('5-Manager'!$F$3:$F$368,'5-Manager'!$G$3:$G$368,ALL!K5)","v":0},7262]
["2020-01-04",{"$f":"'1-Manager'!B6+'2-Manager'!B6+'3-Manager'!B6+'4-Manager'!B6+'5-Manager'!B6","v":369},{"$f":"'1-Manager'!C6+'2-Manager'!C6+'3-Manager'!C6+'4-Manager'!C6+'5-Manager'!C6","v":184},{"$f":"'1-Manager'!D6+'2-Manager'!D6+'3-Manager'!D6+'4-Manager'!D6+'5-Manager'!D6","v":367},{"$f":"'1-Manager'!E6+'2-Manager'!E6+'3-Manager'!E6+'4-Manager'!E6+'5-Manager'!E6","v":126},1046,null,6,1,null,"Colorado",{"$f":"SUMIFS('1-Manager'!$F$3:$F$368,'1-Manager'!$G$3:$G$368,ALL!K6)","v":7077},{"$f":"SUMIFS('2-Manager'!$F$3:$F$368,'2-Manager'!$G$3:$G$368,ALL!K6)","v":0},{"$f":"SUMIFS('3-Manager'!$F$3:$F$368,'3-Manager'!$G$3:$G$368,ALL!K6)","v":0},{"$f":"SUMIFS('4-Manager'!$F$3:$F$368,'4-Manager'!$G$3:$G$368,ALL!K6)","v":0},{"$f":"SUMIFS('5-Manager'!$F$3:$F$368,'5-Manager'!$G$3:$G$368,ALL!K6)","v":0},7077]
["2020-01-05",{"$f":"'1-Manager'!B7+'2-Manager'!B7+'3-Manager'!B7+'4-Manager'!B7+'5-Manager'!B7","v":66},{"$f":"'1-Manager'!C7+'2-Manager'!C7+'3-Manager'!C7+'4-Manager'!C7+'5-Manager'!C7","v":74},{"$f":"'1-Manager'!D7+'2-Manager'!D7+'3-Manager'!D7+'4-Manager'!D7+'5-Manager'!D7","v":52},{"$f":"'1-Manager'!E7+'2-Manager'!E7+'3-Manager'!E7+'4-Manager'!E7+'5-Manager'!E7","v":54},246,null,7,1,null,"Connecticut",{"$f":"SUMIFS('1-Manager'!$F$3:$F$368,'1-Manager'!$G$3:$G$368,ALL!K7)","v":7010},{"$f":"SUMIFS('2-Manager'!$F$3:$F$368,'2-Manager'!$G$3:$G$368,ALL!K7)","v":0},{"$f":"SUMIFS('3-Manager'!$F$3:$F$368,'3-Manager'!$G$3:$G$368,ALL!K7)","v":0},{"$f":"SUMIFS('4-Manager'!$F$3:$F$368,'4-Manager'!$G$3:$G$368,ALL!K7)","v":0},{"$f":"SUMIFS('5-Manager'!$F$3:$F$368,'5-Manager'!$G$3:$G$368,ALL!K7)","v":0},7010]
["2020-01-06",{"$f":"'1-Manager'!B8+'2-Manager'!B8+'3-Manager'!B8+'4-Manager'!B8+'5-Manager'!B8","v":159},{"$f":"'1-Manager'!C8+'2-Manager'!C8+'3-Manager'!C8+'4-Manager'!C8+'5-Manager'!C8","v":134},{"$f":"'1-Manager'!D8+'2-Manager'!D8+'3-Manager'!D8+'4-Manager'!D8+'5-Manager'!D8","v":256},{"$f":"'1-Manager'!E8+'2-Manager'!E8+'3-Manager'!E8+'4-Manager'!E8+'5-Manager'!E8","v":165},714,null,1,1,null,"Delaware",{"$f":"SUMIFS('1-Manager'!$F$3:$F$368,'1-Manager'!$G$3:$G$368,ALL!K8)","v":7481},{"$f":"SUMIFS('2-Manager'!$F$3:$F$368,'2-Manager'!$G$3:$G$368,ALL!K8)","v":0},{"$f":"SUMIFS('3-Manager'!$F$3:$F$368,'3-Manager'!$G$3:$G$368,ALL!K8)","v":0},{"$f":"SUMIFS('4-Manager'!$F$3:$F$368,'4-Manager'!$G$3:$G$368,ALL!K8)","v":0},{"$f":"SUMIFS('5-Manager'!$F$3:$F$368,'5-Manager'!$G$3:$G$368,ALL!K8)","v":0},7481]
["2020-01-07",{"$f":"'1-Manager'!B9+'2-Manager'!B9+'3-Manager'!B9+'4-Manager'!B9+'5-Manager'!B9","v":154},{"$f":"'1-Manager'!C9+'2-Manager'!C9+'3-Manager'!C9+'4-Manager'!C9+'5-Manager'!C9","v":135},{"$f":"'1-Manager'!D9+'2-Manager'!D9+'3-Manager'!D9+'4-Manager'!D9+'5-Manager'!D9","v":244},{"$f":"'1-Manager'!E9+'2-Manager'!E9+'3-Manager'!E9+'4-Manager'!E9+'5-Manager'!E9","v":108},641,null,2,1,null,"Florida",{"$f":"SUMIFS('1-Manager'!$F$3:$F$368,'1-Manager'!$G$3:$G$368,ALL!K9)","v":6868},{"$f":"SUMIFS('2-Manager'!$F$3:$F$368,'2-Manager'!$G$3:$G$368,ALL!K9)","v":0},{"$f":"SUMIFS('3-Manager'!$F$3:$F$368,'3-Manager'!$G$3:$G$368,ALL!K9)","v":0},{"$f":"SUMIFS('4-Manager'!$F$3:$F$368,'4-Manager'!$G$3:$G$368,ALL!K9)","v":0},{"$f":"SUMIFS('5-Manager'!$F$3:$F$368,'5-Manager'!$G$3:$G$368,ALL!K9)","v":0},6868]
["2020-01-08",{"$f":"'1-Manager'!B10+'2-Manager'!B10+'3-Manager'!B10+'4-Manager'!B10+'5-Manager'!B10","v":252},{"$f":"'1-Manager'!C10+'2-Manager'!C10+'3-Manager'!C10+'4-Manager'!C10+'5-Manager'!C10","v":156},{"$f":"'1-Manager'!D10+'2-Manager'!D10+'3-Manager'!D10+'4-Manager'!D10+'5-Manager'!D10","v":117},{"$f":"'1-Manager'!E10+'2-Manager'!E10+'3-Manager'!E10+'4-Manager'!E10+'5-Manager'!E10","v":144},669,null,3,1,null,"Georgia",{"$f":"SUMIFS('1-Manager'!$F$3:$F$368,'1-Manager'!$G$3:$G$368,ALL!K10)","v":6942},{"$f":"SUMIFS('2-Manager'!$F$3:$F$368,'2-Manager'!$G$3:$G$368,ALL!K10)","v":0},{"$f":"SUMIFS('3-Manager'!$F$3:$F$368,'3-Manager'!$G$3:$G$368,ALL!K10)","v":0},{"$f":"SUMIFS('4-Manager'!$F$3:$F$368,'4-Manager'!$G$3:$G$368,ALL!K10)","v":0},{"$f":"SUMIFS('5-Manager'!$F$3:$F$368,'5-Manager'!$G$3:$G$368,ALL!K10)","v":0},6942]
["2020-01-09",{"$f":"'1-Manager'!B11+'2-Manager'!B11+'3-Manager'!B11+'4-Manager'!B11+'5-Manager'!B11","v":72},{"$f":"'1-Manager'!C11+'2-Manager'!C11+'3-Manager'!C11+'4-Manager'!C11+'5-Manager'!C11","v":77},{"$f":"'1-Manager'!D11+'2-Manager'!D11+'3-Manager'!D11+'4-Manager'!D11+'5-Manager'!D11","v":301},{"$f":"'1-Manager'!E11+'2-Manager'!E11+'3-Manager'!E11+'4-Manager'!E11+'5-Manager'!E11","v":128},578,null,4,1,null,"Idaho",{"$f":"SUMIFS('1-Manager'!$F$3:$F$368,'1-Manager'!$G$3:$G$368,ALL!K11)","v":6891},{"$f":"SUMIFS('2-Manager'!$F$3:$F$368,'2-Manager'!$G$3:$G$368,ALL!K11)","v":0},{"$f":"SUMIFS('3-Manager'!$F$3:$F$368,'3-Manager'!$G$3:$G$368,ALL!K11)","v":0},{"$f":"SUMIFS('4-Manager'!$F$3:$F$368,'4-Manager'!$G$3:$G$368,ALL!K11)","v":0},{"$f":"SUMIFS('5-Manager'!$F$3:$F$368,'5-Manager'!$G$3:$G$368,ALL!K11)","v":0},6891]
["2020-01-10",{"$f":"'1-Manager'!B12+'2-Manager'!B12+'3-Manager'!B12+'4-Manager'!B12+'5-Manager'!B12","v":191},{"$f":"'1-Manager'!C12+'2-Manager'!C12+'3-Manager'!C12+'4-Manager'!C12+'5-Manager'!C12","v":188},{"$f":"'1-Manager'!D12+'2-Manager'!D12+'3-Manager'!D12+'4-Manager'!D12+'5-Manager'!D12","v":235},{"$f":"'1-Manager'!E12+'2-Manager'!E12+'3-Manager'!E12+'4-Manager'!E12+'5-Manager'!E12","v":183},797,null,5,1,null,"Illinois",{"$f":"SUMIFS('1-Manager'!$F$3:$F$368,'1-Manager'!$G$3:$G$368,ALL!K12)","v":0},{"$f":"SUMIFS('2-Manager'!$F$3:$F$368,'2-Manager'!$G$3:$G$368,ALL!K12)","v":11426},{"$f":"SUMIFS('3-Manager'!$F$3:$F$368,'3-Manager'!$G$3:$G$368,ALL!K12)","v":0},{"$f":"SUMIFS('4-Manager'!$F$3:$F$368,'4-Manager'!$G$3:$G$368,ALL!K12)","v":0},{"$f":"SUMIFS('5-Manager'!$F$3:$F$368,'5-Manager'!$G$3:$G$368,ALL!K12)","v":0},11426]
["2020-01-11",{"$f":"'1-Manager'!B13+'2-Manager'!B13+'3-Manager'!B13+'4-Manager'!B13+'5-Manager'!B13","v":279},{"$f":"'1-Manager'!C13+'2-Manager'!C13+'3-Manager'!C13+'4-Manager'!C13+'5-Manager'!C13","v":180},{"$f":"'1-Manager'!D13+'2-Manager'!D13+'3-Manager'!D13+'4-Manager'!D13+'5-Manager'!D13","v":224},{"$f":"'1-Manager'!E13+'2-Manager'!E13+'3-Manager'!E13+'4-Manager'!E13+'5-Manager'!E13","v":136},819,null,6,1,null,"Indiana",{"$f":"SUMIFS('1-Manager'!$F$3:$F$368,'1-Manager'!$G$3:$G$368,ALL!K13)","v":0},{"$f":"SUMIFS('2-Manager'!$F$3:$F$368,'2-Manager'!$G$3:$G$368,ALL!K13)","v":11075},{"$f":"SUMIFS('3-Manager'!$F$3:$F$368,'3-Manager'!$G$3:$G$368,ALL!K13)","v":0},{"$f":"SUMIFS('4-Manager'!$F$3:$F$368,'4-Manager'!$G$3:$G$368,ALL!K13)","v":0},{"$f":"SUMIFS('5-Manager'!$F$3:$F$368,'5-Manager'!$G$3:$G$368,ALL!K13)","v":0},11075]
["2020-01-12",{"$f":"'1-Manager'!B14+'2-Manager'!B14+'3-Manager'!B14+'4-Manager'!B14+'5-Manager'!B14","v":65},{"$f":"'1-Manager'!C14+'2-Manager'!C14+'3-Manager'!C14+'4-Manager'!C14+'5-Manager'!C14","v":41},{"$f":"'1-Manager'!D14+'2-Manager'!D14+'3-Manager'!D14+'4-Manager'!D14+'5-Manager'!D14","v":93},{"$f":"'1-Manager'!E14+'2-Manager'!E14+'3-Manager'!E14+'4-Manager'!E14+'5-Manager'!E14","v":34},233,null,7,1,null,"Iowa",{"$f":"SUMIFS('1-Manager'!$F$3:$F$368,'1-Manager'!$G$3:$G$368,ALL!K14)","v":0},{"$f":"SUMIFS('2-Manager'!$F$3:$F$368,'2-Manager'!$G$3:$G$368,ALL!K14)","v":5576},{"$f":"SUMIFS('3-Manager'!$F$3:$F$368,'3-Manager'!$G$3:$G$368,ALL!K14)","v":0},{"$f":"SUMIFS('4-Manager'!$F$3:$F$368,'4-Manager'!$G$3:$G$368,ALL!K14)","v":0},{"$f":"SUMIFS('5-Manager'!$F$3:$F$368,'5-Manager'!$G$3:$G$368,ALL!K14)","v":0},5576]
["2020-01-13",{"$f":"'1-Manager'!B15+'2-Manager'!B15+'3-Manager'!B15+'4-Manager'!B15+'5-Manager'!B15","v":211},{"$f":"'1-Manager'!C15+'2-Manager'!C15+'3-Manager'!C15+'4-Manager'!C15+'5-Manager'!C15","v":169},{"$f":"'1-Manager'!D15+'2-Manager'!D15+'3-Manager'!D15+'4-Manager'!D15+'5-Manager'!D15","v":266},{"$f":"'1-Manager'!E15+'2-Manager'!E15+'3-Manager'!E15+'4-Manager'!E15+'5-Manager'!E15","v":151},797,null,1,1,null,"Kansas",{"$f":"SUMIFS('1-Manager'!$F$3:$F$368,'1-Manager'!$G$3:$G$368,ALL!K15)","v":0},{"$f":"SUMIFS('2-Manager'!$F$3:$F$368,'2-Manager'!$G$3:$G$368,ALL!K15)","v":5402},{"$f":"SUMIFS('3-Manager'!$F$3:$F$368,'3-Manager'!$G$3:$G$368,ALL!K15)","v":0},{"$f":"SUMIFS('4-Manager'!$F$3:$F$368,'4-Manager'!$G$3:$G$368,ALL!K15)","v":0},{"$f":"SUMIFS('5-Manager'!$F$3:$F$368,'5-Manager'!$G$3:$G$368,ALL!K15)","v":0},5402]
["2020-01-14",{"$f":"'1-Manager'!B16+'2-Manager'!B16+'3-Manager'!B16+'4-Manager'!B16+'5-Manager'!B16","v":246},{"$f":"'1-Manager'!C16+'2-Manager'!C16+'3-Manager'!C16+'4-Manager'!C16+'5-Manager'!C16","v":163},{"$f":"'1-Manager'!D16+'2-Manager'!D16+'3-Manager'!D16+'4-Manager'!D16+'5-Manager'!D16","v":262},{"$f":"'1-Manager'!E16+'2-Manager'!E16+'3-Manager'!E16+'4-Manager'!E16+'5-Manager'!E16","v":178},849,null,2,1,null,"Kentucky",{"$f":"SUMIFS('1-Manager'!$F$3:$F$368,'1-Manager'!$G$3:$G$368,ALL!K16)","v":0},{"$f":"SUMIFS('2-Manager'!$F$3:$F$368,'2-Manager'!$G$3:$G$368,ALL!K16)","v":5376},{"$f":"SUMIFS('3-Manager'!$F$3:$F$368,'3-Manager'!$G$3:$G$368,ALL!K16)","v":0},{"$f":"SUMIFS('4-Manager'!$F$3:$F$368,'4-Manager'!$G$3:$G$368,ALL!K16)","v":0},{"$f":"SUMIFS('5-Manager'!$F$3:$F$368,'5-Manager'!$G$3:$G$368,ALL!K16)","v":0},5376]
["2020-01-15",{"$f":"'1-Manager'!B17+'2-Manager'!B17+'3-Manager'!B17+'4-Manager'!B17+'5-Manager'!B17","v":350},{"$f":"'1-Manager'!C17+'2-Manager'!C17+'3-Manager'!C17+'4-Manager'!C17+'5-Manager'!C17","v":211},{"$f":"'1-Manager'!D17+'2-Manager'!D17+'3-Manager'!D17+'4-Manager'!D17+'5-Manager'!D17","v":192},{"$f":"'1-Manager'!E17+'2-Manager'!E17+'3-Manager'!E17+'4-Manager'!E17+'5-Manager'!E17","v":86},839,null,3,1,null,"Louisiana",{"$f":"SUMIFS('1-Manager'!$F$3:$F$368,'1-Manager'!$G$3:$G$368,ALL!K17)","v":0},{"$f":"SUMIFS('2-Manager'!$F$3:$F$368,'2-Manager'!$G$3:$G$368,ALL!K17)","v":6041},{"$f":"SUMIFS('3-Manager'!$F$3:$F$368,'3-Manager'!$G$3:$G$368,ALL!K17)","v":0},{"$f":"SUMIFS('4-Manager'!$F$3:$F$368,'4-Manager'!$G$3:$G$368,ALL!K17)","v":0},{"$f":"SUMIFS('5-Manager'!$F$3:$F$368,'5-Manager'!$G$3:$G$368,ALL!K17)","v":0},6041]
["2020-01-16",{"$f":"'1-Manager'!B18+'2-Manager'!B18+'3-Manager'!B18+'4-Manager'!B18+'5-Manager'!B18","v":418},{"$f":"'1-Manager'!C18+'2-Manager'!C18+'3-Manager'!C18+'4-Manager'!C18+'5-Manager'!C18","v":96},{"$f":"'1-Manager'!D18+'2-Manager'!D18+'3-Manager'!D18+'4-Manager'!D18+'5-Manager'!D18","v":334},{"$f":"'1-Manager'!E18+'2-Manager'!E18+'3-Manager'!E18+'4-Manager'!E18+'5-Manager'!E18","v":130},978,null,4,1,null,"Maine",{"$f":"SUMIFS('1-Manager'!$F$3:$F$368,'1-Manager'!$G$3:$G$368,ALL!K18)","v":0},{"$f":"SUMIFS('2-Manager'!$F$3:$F$368,'2-Manager'!$G$3:$G$368,ALL!K18)","v":5837},{"$f":"SUMIFS('3-Manager'!$F$3:$F$368,'3-Manager'!$G$3:$G$368,ALL!K18)","v":0},{"$f":"SUMIFS('4-Manager'!$F$3:$F$368,'4-Manager'!$G$3:$G$368,ALL!K18)","v":0},{"$f":"SUMIFS('5-Manager'!$F$3:$F$368,'5-Manager'!$G$3:$G$368,ALL!K18)","v":0},5837]
["2020-01-17",{"$f":"'1-Manager'!B19+'2-Manager'!B19+'3-Manager'!B19+'4-Manager'!B19+'5-Manager'!B19","v":263},{"$f":"'1-Manager'!C19+'2-Manager'!C19+'3-Manager'!C19+'4-Manager'!C19+'5-Manager'!C19","v":96},{"$f":"'1-Manager'!D19+'2-Manager'!D19+'3-Manager'!D19+'4-Manager'!D19+'5-Manager'!D19","v":314},{"$f":"'1-Manager'!E19+'2-Manager'!E19+'3-Manager'!E19+'4-Manager'!E19+'5-Manager'!E19","v":168},841,null,5,1,null,"Maryland",{"$f":"SUMIFS('1-Manager'!$F$3:$F$368,'1-Manager'!$G$3:$G$368,ALL!K19)","v":0},{"$f":"SUMIFS('2-Manager'!$F$3:$F$368,'2-Manager'!$G$3:$G$368,ALL!K19)","v":5748},{"$f":"SUMIFS('3-Manager'!$F$3:$F$368,'3-Manager'!$G$3:$G$368,ALL!K19)","v":0},{"$f":"SUMIFS('4-Manager'!$F$3:$F$368,'4-Manager'!$G$3:$G$368,ALL!K19)","v":0},{"$f":"SUMIFS('5-Manager'!$F$3:$F$368,'5-Manager'!$G$3:$G$368,ALL!K19)","v":0},5748]
["2020-01-18",{"$f":"'1-Manager'!B20+'2-Manager'!B20+'3-Manager'!B20+'4-Manager'!B20+'5-Manager'!B20","v":243},{"$f":"'1-Manager'!C20+'2-Manager'!C20+'3-Manager'!C20+'4-Manager'!C20+'5-Manager'!C20","v":157},{"$f":"'1-Manager'!D20+'2-Manager'!D20+'3-Manager'!D20+'4-Manager'!D20+'5-Manager'!D20","v":242},{"$f":"'1-Manager'!E20+'2-Manager'!E20+'3-Manager'!E20+'4-Manager'!E20+'5-Manager'!E20","v":84},726,null,6,1,null,"Massachusetts",{"$f":"SUMIFS('1-Manager'!$F$3:$F$368,'1-Manager'!$G$3:$G$368,ALL!K20)","v":0},{"$f":"SUMIFS('2-Manager'!$F$3:$F$368,'2-Manager'!$G$3:$G$368,ALL!K20)","v":5524},{"$f":"SUMIFS('3-Manager'!$F$3:$F$368,'3-Manager'!$G$3:$G$368,ALL!K20)","v":0},{"$f":"SUMIFS('4-Manager'!$F$3:$F$368,'4-Manager'!$G$3:$G$368,ALL!K20)","v":0},{"$f":"SUMIFS('5-Manager'!$F$3:$F$368,'5-Manager'!$G$3:$G$368,ALL!K20)","v":0},5524]
["2020-01-19",{"$f":"'1-Manager'!B21+'2-Manager'!B21+'3-Manager'!B21+'4-Manager'!B21+'5-Manager'!B21","v":113},{"$f":"'1-Manager'!C21+'2-Manager'!C21+'3-Manager'!C21+'4-Manager'!C21+'5-Manager'!C21","v":30},{"$f":"'1-Manager'!D21+'2-Manager'!D21+'3-Manager'!D21+'4-Manager'!D21+'5-Manager'!D21","v":59},{"$f":"'1-Manager'!E21+'2-Manager'!E21+'3-Manager'!E21+'4-Manager'!E21+'5-Manager'!E21","v":47},249,null,7,1,null,"Michigan",{"$f":"SUMIFS('1-Manager'!$F$3:$F$368,'1-Manager'!$G$3:$G$368,ALL!K21)","v":0},{"$f":"SUMIFS('2-Manager'!$F$3:$F$368,'2-Manager'!$G$3:$G$368,ALL!K21)","v":6099},{"$f":"SUMIFS('3-Manager'!$F$3:$F$368,'3-Manager'!$G$3:$G$368,ALL!K21)","v":0},{"$f":"SUMIFS('4-Manager'!$F$3:$F$368,'4-Manager'!$G$3:$G$368,ALL!K21)","v":0},{"$f":"SUMIFS('5-Manager'!$F$3:$F$368,'5-Manager'!$G$3:$G$368,ALL!K21)","v":0},6099]
["2020-01-20",{"$f":"'1-Manager'!B22+'2-Manager'!B22+'3-Manager'!B22+'4-Manager'!B22+'5-Manager'!B22","v":244},{"$f":"'1-Manager'!C22+'2-Manager'!C22+'3-Manager'!C22+'4-Manager'!C22+'5-Manager'!C22","v":86},{"$f":"'1-Manager'!D22+'2-Manager'!D22+'3-Manager'!D22+'4-Manager'!D22+'5-Manager'!D22","v":282},{"$f":"'1-Manager'!E22+'2-Manager'!E22+'3-Manager'!E22+'4-Manager'!E22+'5-Manager'!E22","v":100},712,null,1,1,null,"Minnesota",{"$f":"SUMIFS('1-Manager'!$F$3:$F$368,'1-Manager'!$G$3:$G$368,ALL!K22)","v":0},{"$f":"SUMIFS('2-Manager'!$F$3:$F$368,'2-Manager'!$G$3:$G$368,ALL!K22)","v":0},{"$f":"SUMIFS('3-Manager'!$F$3:$F$368,'3-Manager'!$G$3:$G$368,ALL!K22)","v":8132},{"$f":"SUMIFS('4-Manager'!$F$3:$F$368,'4-Manager'!$G$3:$G$368,ALL!K22)","v":0},{"$f":"SUMIFS('5-Manager'!$F$3:$F$368,'5-Manager'!$G$3:$G$368,ALL!K22)","v":0},8132]
["2020-01-21",{"$f":"'1-Manager'!B23+'2-Manager'!B23+'3-Manager'!B23+'4-Manager'!B23+'5-Manager'!B23","v":233},{"$f":"'1-Manager'!C23+'2-Manager'!C23+'3-Manager'!C23+'4-Manager'!C23+'5-Manager'!C23","v":154},{"$f":"'1-Manager'!D23+'2-Manager'!D23+'3-Manager'!D23+'4-Manager'!D23+'5-Manager'!D23","v":295},{"$f":"'1-Manager'!E23+'2-Manager'!E23+'3-Manager'!E23+'4-Manager'!E23+'5-Manager'!E23","v":90},772,null,2,1,null,"Mississippi",{"$f":"SUMIFS('1-Manager'!$F$3:$F$368,'1-Manager'!$G$3:$G$368,ALL!K23)","v":0},{"$f":"SUMIFS('2-Manager'!$F$3:$F$368,'2-Manager'!$G$3:$G$368,ALL!K23)","v":0},{"$f":"SUMIFS('3-Manager'!$F$3:$F$368,'3-Manager'!$G$3:$G$368,ALL!K23)","v":8769},{"$f":"SUMIFS('4-Manager'!$F$3:$F$368,'4-Manager'!$G$3:$G$368,ALL!K23)","v":0},{"$f":"SUMIFS('5-Manager'!$F$3:$F$368,'5-Manager'!$G$3:$G$368,ALL!K23)","v":0},8769]
["2020-01-22",{"$f":"'1-Manager'!B24+'2-Manager'!B24+'3-Manager'!B24+'4-Manager'!B24+'5-Manager'!B24","v":285},{"$f":"'1-Manager'!C24+'2-Manager'!C24+'3-Manager'!C24+'4-Manager'!C24+'5-Manager'!C24","v":97},{"$f":"'1-Manager'!D24+'2-Manager'!D24+'3-Manager'!D24+'4-Manager'!D24+'5-Manager'!D24","v":209},{"$f":"'1-Manager'!E24+'2-Manager'!E24+'3-Manager'!E24+'4-Manager'!E24+'5-Manager'!E24","v":92},683,null,3,1,null,"Missouri",{"$f":"SUMIFS('1-Manager'!$F$3:$F$368,'1-Manager'!$G$3:$G$368,ALL!K24)","v":0},{"$f":"SUMIFS('2-Manager'!$F$3:$F$368,'2-Manager'!$G$3:$G$368,ALL!K24)","v":0},{"$f":"SUMIFS('3-Manager'!$F$3:$F$368,'3-Manager'!$G$3:$G$368,ALL!K24)","v":4477},{"$f":"SUMIFS('4-Manager'!$F$3:$F$368,'4-Manager'!$G$3:$G$368,ALL!K24)","v":0},{"$f":"SUMIFS('5-Manager'!$F$3:$F$368,'5-Manager'!$G$3:$G$368,ALL!K24)","v":0},4477]
["2020-01-23",{"$f":"'1-Manager'!B25+'2-Manager'!B25+'3-Manager'!B25+'4-Manager'!B25+'5-Manager'!B25","v":269},{"$f":"'1-Manager'!C25+'2-Manager'!C25+'3-Manager'!C25+'4-Manager'!C25+'5-Manager'!C25","v":149},{"$f":"'1-Manager'!D25+'2-Manager'!D25+'3-Manager'!D25+'4-Manager'!D25+'5-Manager'!D25","v":167},{"$f":"'1-Manager'!E25+'2-Manager'!E25+'3-Manager'!E25+'4-Manager'!E25+'5-Manager'!E25","v":165},750,null,4,1,null,"Montana",{"$f":"SUMIFS('1-Manager'!$F$3:$F$368,'1-Manager'!$G$3:$G$368,ALL!K25)","v":0},{"$f":"SUMIFS('2-Manager'!$F$3:$F$368,'2-Manager'!$G$3:$G$368,ALL!K25)","v":0},{"$f":"SUMIFS('3-Manager'!$F$3:$F$368,'3-Manager'!$G$3:$G$368,ALL!K25)","v":3842},{"$f":"SUMIFS('4-Manager'!$F$3:$F$368,'4-Manager'!$G$3:$G$368,ALL!K25)","v":0},{"$f":"SUMIFS('5-Manager'!$F$3:$F$368,'5-Manager'!$G$3:$G$368,ALL!K25)","v":0},3842]
["2020-01-24",{"$f":"'1-Manager'!B26+'2-Manager'!B26+'3-Manager'!B26+'4-Manager'!B26+'5-Manager'!B26","v":305},{"$f":"'1-Manager'!C26+'2-Manager'!C26+'3-Manager'!C26+'4-Manager'!C26+'5-Manager'!C26","v":111},{"$f":"'1-Manager'!D26+'2-Manager'!D26+'3-Manager'!D26+'4-Manager'!D26+'5-Manager'!D26","v":227},{"$f":"'1-Manager'!E26+'2-Manager'!E26+'3-Manager'!E26+'4-Manager'!E26+'5-Manager'!E26","v":161},804,null,5,1,null,"Nebraska",{"$f":"SUMIFS('1-Manager'!$F$3:$F$368,'1-Manager'!$G$3:$G$368,ALL!K26)","v":0},{"$f":"SUMIFS('2-Manager'!$F$3:$F$368,'2-Manager'!$G$3:$G$368,ALL!K26)","v":0},{"$f":"SUMIFS('3-Manager'!$F$3:$F$368,'3-Manager'!$G$3:$G$368,ALL!K26)","v":4183},{"$f":"SUMIFS('4-Manager'!$F$3:$F$368,'4-Manager'!$G$3:$G$368,ALL!K26)","v":0},{"$f":"SUMIFS('5-Manager'!$F$3:$F$368,'5-Manager'!$G$3:$G$368,ALL!K26)","v":0},4183]
["2020-01-25",{"$f":"'1-Manager'!B27+'2-Manager'!B27+'3-Manager'!B27+'4-Manager'!B27+'5-Manager'!B27","v":272},{"$f":"'1-Manager'!C27+'2-Manager'!C27+'3-Manager'!C27+'4-Manager'!C27+'5-Manager'!C27","v":126},{"$f":"'1-Manager'!D27+'2-Manager'!D27+'3-Manager'!D27+'4-Manager'!D27+'5-Manager'!D27","v":373},{"$f":"'1-Manager'!E27+'2-Manager'!E27+'3-Manager'!E27+'4-Manager'!E27+'5-Manager'!E27","v":115},886,null,6,1,null,"Nevada",{"$f":"SUMIFS('1-Manager'!$F$3:$F$368,'1-Manager'!$G$3:$G$368,ALL!K27)","v":0},{"$f":"SUMIFS('2-Manager'!$F$3:$F$368,'2-Manager'!$G$3:$G$368,ALL!K27)","v":0},{"$f":"SUMIFS('3-Manager'!$F$3:$F$368,'3-Manager'!$G$3:$G$368,ALL!K27)","v":4003},{"$f":"SUMIFS('4-Manager'!$F$3:$F$368,'4-Manager'!$G$3:$G$368,ALL!K27)","v":0},{"$f":"SUMIFS('5-Manager'!$F$3:$F$368,'5-Manager'!$G$3:$G$368,ALL!K27)","v":0},4003]
["2020-01-26",{"$f":"'1-Manager'!B28+'2-Manager'!B28+'3-Manager'!B28+'4-Manager'!B28+'5-Manager'!B28","v":115},{"$f":"'1-Manager'!C28+'2-Manager'!C28+'3-Manager'!C28+'4-Manager'!C28+'5-Manager'!C28","v":70},{"$f":"'1-Manager'!D28+'2-Manager'!D28+'3-Manager'!D28+'4-Manager'!D28+'5-Manager'!D28","v":86},{"$f":"'1-Manager'!E28+'2-Manager'!E28+'3-Manager'!E28+'4-Manager'!E28+'5-Manager'!E28","v":74},345,null,7,1,null,"New hampshire",{"$f":"SUMIFS('1-Manager'!$F$3:$F$368,'1-Manager'!$G$3:$G$368,ALL!K28)","v":0},{"$f":"SUMIFS('2-Manager'!$F$3:$F$368,'2-Manager'!$G$3:$G$368,ALL!K28)","v":0},{"$f":"SUMIFS('3-Manager'!$F$3:$F$368,'3-Manager'!$G$3:$G$368,ALL!K28)","v":4455},{"$f":"SUMIFS('4-Manager'!$F$3:$F$368,'4-Manager'!$G$3:$G$368,ALL!K28)","v":0},{"$f":"SUMIFS('5-Manager'!$F$3:$F$368,'5-Manager'!$G$3:$G$368,ALL!K28)","v":0},4455]
["2020-01-27",{"$f":"'1-Manager'!B29+'2-Manager'!B29+'3-Manager'!B29+'4-Manager'!B29+'5-Manager'!B29","v":250},{"$f":"'1-Manager'!C29+'2-Manager'!C29+'3-Manager'!C29+'4-Manager'!C29+'5-Manager'!C29","v":129},{"$f":"'1-Manager'!D29+'2-Manager'!D29+'3-Manager'!D29+'4-Manager'!D29+'5-Manager'!D29","v":230},{"$f":"'1-Manager'!E29+'2-Manager'!E29+'3-Manager'!E29+'4-Manager'!E29+'5-Manager'!E29","v":214},823,null,1,1,null,"New Jersey",{"$f":"SUMIFS('1-Manager'!$F$3:$F$368,'1-Manager'!$G$3:$G$368,ALL!K29)","v":0},{"$f":"SUMIFS('2-Manager'!$F$3:$F$368,'2-Manager'!$G$3:$G$368,ALL!K29)","v":0},{"$f":"SUMIFS('3-Manager'!$F$3:$F$368,'3-Manager'!$G$3:$G$368,ALL!K29)","v":3997},{"$f":"SUMIFS('4-Manager'!$F$3:$F$368,'4-Manager'!$G$3:$G$368,ALL!K29)","v":0},{"$f":"SUMIFS('5-Manager'!$F$3:$F$368,'5-Manager'!$G$3:$G$368,ALL!K29)","v":0},3997]
["2020-01-28",{"$f":"'1-Manager'!B30+'2-Manager'!B30+'3-Manager'!B30+'4-Manager'!B30+'5-Manager'!B30","v":313},{"$f":"'1-Manager'!C30+'2-Manager'!C30+'3-Manager'!C30+'4-Manager'!C30+'5-Manager'!C30","v":142},{"$f":"'1-Manager'!D30+'2-Manager'!D30+'3-Manager'!D30+'4-Manager'!D30+'5-Manager'!D30","v":272},{"$f":"'1-Manager'!E30+'2-Manager'!E30+'3-Manager'!E30+'4-Manager'!E30+'5-Manager'!E30","v":219},946,null,2,1,null,"New Mexico",{"$f":"SUMIFS('1-Manager'!$F$3:$F$368,'1-Manager'!$G$3:$G$368,ALL!K30)","v":0},{"$f":"SUMIFS('2-Manager'!$F$3:$F$368,'2-Manager'!$G$3:$G$368,ALL!K30)","v":0},{"$f":"SUMIFS('3-Manager'!$F$3:$F$368,'3-Manager'!$G$3:$G$368,ALL!K30)","v":3801},{"$f":"SUMIFS('4-Manager'!$F$3:$F$368,'4-Manager'!$G$3:$G$368,ALL!K30)","v":0},{"$f":"SUMIFS('5-Manager'!$F$3:$F$368,'5-Manager'!$G$3:$G$368,ALL!K30)","v":0},3801]
["2020-01-29",{"$f":"'1-Manager'!B31+'2-Manager'!B31+'3-Manager'!B31+'4-Manager'!B31+'5-Manager'!B31","v":162},{"$f":"'1-Manager'!C31+'2-Manager'!C31+'3-Manager'!C31+'4-Manager'!C31+'5-Manager'!C31","v":119},{"$f":"'1-Manager'!D31+'2-Manager'!D31+'3-Manager'!D31+'4-Manager'!D31+'5-Manager'!D31","v":283},{"$f":"'1-Manager'!E31+'2-Manager'!E31+'3-Manager'!E31+'4-Manager'!E31+'5-Manager'!E31","v":137},701,null,3,1,null,"New York",{"$f":"SUMIFS('1-Manager'!$F$3:$F$368,'1-Manager'!$G$3:$G$368,ALL!K31)","v":0},{"$f":"SUMIFS('2-Manager'!$F$3:$F$368,'2-Manager'!$G$3:$G$368,ALL!K31)","v":0},{"$f":"SUMIFS('3-Manager'!$F$3:$F$368,'3-Manager'!$G$3:$G$368,ALL!K31)","v":4385},{"$f":"SUMIFS('4-Manager'!$F$3:$F$368,'4-Manager'!$G$3:$G$368,ALL!K31)","v":0},{"$f":"SUMIFS('5-Manager'!$F$3:$F$368,'5-Manager'!$G$3:$G$368,ALL!K31)","v":0},4385]
["2020-01-30",{"$f":"'1-Manager'!B32+'2-Manager'!B32+'3-Manager'!B32+'4-Manager'!B32+'5-Manager'!B32","v":310},{"$f":"'1-Manager'!C32+'2-Manager'!C32+'3-Manager'!C32+'4-Manager'!C32+'5-Manager'!C32","v":138},{"$f":"'1-Manager'!D32+'2-Manager'!D32+'3-Manager'!D32+'4-Manager'!D32+'5-Manager'!D32","v":138},{"$f":"'1-Manager'!E32+'2-Manager'!E32+'3-Manager'!E32+'4-Manager'!E32+'5-Manager'!E32","v":142},728,null,4,1,null,"North Carolina",{"$f":"SUMIFS('1-Manager'!$F$3:$F$368,'1-Manager'!$G$3:$G$368,ALL!K32)","v":0},{"$f":"SUMIFS('2-Manager'!$F$3:$F$368,'2-Manager'!$G$3:$G$368,ALL!K32)","v":0},{"$f":"SUMIFS('3-Manager'!$F$3:$F$368,'3-Manager'!$G$3:$G$368,ALL!K32)","v":0},{"$f":"SUMIFS('4-Manager'!$F$3:$F$368,'4-Manager'!$G$3:$G$368,ALL!K32)","v":5059},{"$f":"SUMIFS('5-Manager'!$F$3:$F$368,'5-Manager'!$G$3:$G$368,ALL!K32)","v":0},5059]
["2020-01-31",{"$f":"'1-Manager'!B33+'2-Manager'!B33+'3-Manager'!B33+'4-Manager'!B33+'5-Manager'!B33","v":388},{"$f":"'1-Manager'!C33+'2-Manager'!C33+'3-Manager'!C33+'4-Manager'!C33+'5-Manager'!C33","v":95},{"$f":"'1-Manager'!D33+'2-Manager'!D33+'3-Manager'!D33+'4-Manager'!D33+'5-Manager'!D33","v":192},{"$f":"'1-Manager'!E33+'2-Manager'!E33+'3-Manager'!E33+'4-Manager'!E33+'5-Manager'!E33","v":175},850,null,5,1,null,"North Dakota",{"$f":"SUMIFS('1-Manager'!$F$3:$F$368,'1-Manager'!$G$3:$G$368,ALL!K33)","v":0},{"$f":"SUMIFS('2-Manager'!$F$3:$F$368,'2-Manager'!$G$3:$G$368,ALL!K33)","v":0},{"$f":"SUMIFS('3-Manager'!$F$3:$F$368,'3-Manager'!$G$3:$G$368,ALL!K33)","v":0},{"$f":"SUMIFS('4-Manager'!$F$3:$F$368,'4-Manager'!$G$3:$G$368,ALL!K33)","v":5351},{"$f":"SUMIFS('5-Manager'!$F$3:$F$368,'5-Manager'!$G$3:$G$368,ALL!K33)","v":0},5351]
["2020-02-01",{"$f":"'1-Manager'!B34+'2-Manager'!B34+'3-Manager'!B34+'4-Manager'!B34+'5-Manager'!B34","v":328},{"$f":"'1-Manager'!C34+'2-Manager'!C34+'3-Manager'!C34+'4-Manager'!C34+'5-Manager'!C34","v":151},{"$f":"'1-Manager'!D34+'2-Manager'!D34+'3-Manager'!D34+'4-Manager'!D34+'5-Manager'!D34","v":179},{"$f":"'1-Manager'!E34+'2-Manager'!E34+'3-Manager'!E34+'4-Manager'!E34+'5-Manager'!E34","v":125},783,null,6,2,null,"Ohio",{"$f":"SUMIFS('1-Manager'!$F$3:$F$368,'1-Manager'!$G$3:$G$368,ALL!K34)","v":0},{"$f":"SUMIFS('2-Manager'!$F$3:$F$368,'2-Manager'!$G$3:$G$368,ALL!K34)","v":0},{"$f":"SUMIFS('3-Manager'!$F$3:$F$368,'3-Manager'!$G$3:$G$368,ALL!K34)","v":0},{"$f":"SUMIFS('4-Manager'!$F$3:$F$368,'4-Manager'!$G$3:$G$368,ALL!K34)","v":2556},{"$f":"SUMIFS('5-Manager'!$F$3:$F$368,'5-Manager'!$G$3:$G$368,ALL!K34)","v":0},2556]
["2020-02-02",{"$f":"'1-Manager'!B35+'2-Manager'!B35+'3-Manager'!B35+'4-Manager'!B35+'5-Manager'!B35","v":135},{"$f":"'1-Manager'!C35+'2-Manager'!C35+'3-Manager'!C35+'4-Manager'!C35+'5-Manager'!C35","v":49},{"$f":"'1-Manager'!D35+'2-Manager'!D35+'3-Manager'!D35+'4-Manager'!D35+'5-Manager'!D35","v":116},{"$f":"'1-Manager'!E35+'2-Manager'!E35+'3-Manager'!E35+'4-Manager'!E35+'5-Manager'!E35","v":71},371,null,7,2,null,"Oklahoma",{"$f":"SUMIFS('1-Manager'!$F$3:$F$368,'1-Manager'!$G$3:$G$368,ALL!K35)","v":0},{"$f":"SUMIFS('2-Manager'!$F$3:$F$368,'2-Manager'!$G$3:$G$368,ALL!K35)","v":0},{"$f":"SUMIFS('3-Manager'!$F$3:$F$368,'3-Manager'!$G$3:$G$368,ALL!K35)","v":0},{"$f":"SUMIFS('4-Manager'!$F$3:$F$368,'4-Manager'!$G$3:$G$368,ALL!K35)","v":2773},{"$f":"SUMIFS('5-Manager'!$F$3:$F$368,'5-Manager'!$G$3:$G$368,ALL!K35)","v":0},2773]
["2020-02-03",{"$f":"'1-Manager'!B36+'2-Manager'!B36+'3-Manager'!B36+'4-Manager'!B36+'5-Manager'!B36","v":225},{"$f":"'1-Manager'!C36+'2-Manager'!C36+'3-Manager'!C36+'4-Manager'!C36+'5-Manager'!C36","v":98},{"$f":"'1-Manager'!D36+'2-Manager'!D36+'3-Manager'!D36+'4-Manager'!D36+'5-Manager'!D36","v":174},{"$f":"'1-Manager'!E36+'2-Manager'!E36+'3-Manager'!E36+'4-Manager'!E36+'5-Manager'!E36","v":85},582,null,1,2,null,"Oregon",{"$f":"SUMIFS('1-Manager'!$F$3:$F$368,'1-Manager'!$G$3:$G$368,ALL!K36)","v":0},{"$f":"SUMIFS('2-Manager'!$F$3:$F$368,'2-Manager'!$G$3:$G$368,ALL!K36)","v":0},{"$f":"SUMIFS('3-Manager'!$F$3:$F$368,'3-Manager'!$G$3:$G$368,ALL!K36)","v":0},{"$f":"SUMIFS('4-Manager'!$F$3:$F$368,'4-Manager'!$G$3:$G$368,ALL!K36)","v":2730},{"$f":"SUMIFS('5-Manager'!$F$3:$F$368,'5-Manager'!$G$3:$G$368,ALL!K36)","v":0},2730]
["2020-02-04",{"$f":"'1-Manager'!B37+'2-Manager'!B37+'3-Manager'!B37+'4-Manager'!B37+'5-Manager'!B37","v":258},{"$f":"'1-Manager'!C37+'2-Manager'!C37+'3-Manager'!C37+'4-Manager'!C37+'5-Manager'!C37","v":92},{"$f":"'1-Manager'!D37+'2-Manager'!D37+'3-Manager'!D37+'4-Manager'!D37+'5-Manager'!D37","v":258},{"$f":"'1-Manager'!E37+'2-Manager'!E37+'3-Manager'!E37+'4-Manager'!E37+'5-Manager'!E37","v":191},799,null,2,2,null,"Pennsylvania",{"$f":"SUMIFS('1-Manager'!$F$3:$F$368,'1-Manager'!$G$3:$G$368,ALL!K37)","v":0},{"$f":"SUMIFS('2-Manager'!$F$3:$F$368,'2-Manager'!$G$3:$G$368,ALL!K37)","v":0},{"$f":"SUMIFS('3-Manager'!$F$3:$F$368,'3-Manager'!$G$3:$G$368,ALL!K37)","v":0},{"$f":"SUMIFS('4-Manager'!$F$3:$F$368,'4-Manager'!$G$3:$G$368,ALL!K37)","v":2869},{"$f":"SUMIFS('5-Manager'!$F$3:$F$368,'5-Manager'!$G$3:$G$368,ALL!K37)","v":0},2869]
["2020-02-05",{"$f":"'1-Manager'!B38+'2-Manager'!B38+'3-Manager'!B38+'4-Manager'!B38+'5-Manager'!B38","v":200},{"$f":"'1-Manager'!C38+'2-Manager'!C38+'3-Manager'!C38+'4-Manager'!C38+'5-Manager'!C38","v":126},{"$f":"'1-Manager'!D38+'2-Manager'!D38+'3-Manager'!D38+'4-Manager'!D38+'5-Manager'!D38","v":309},{"$f":"'1-Manager'!E38+'2-Manager'!E38+'3-Manager'!E38+'4-Manager'!E38+'5-Manager'!E38","v":110},745,null,3,2,null,"Rhode Island",{"$f":"SUMIFS('1-Manager'!$F$3:$F$368,'1-Manager'!$G$3:$G$368,ALL!K38)","v":0},{"$f":"SUMIFS('2-Manager'!$F$3:$F$368,'2-Manager'!$G$3:$G$368,ALL!K38)","v":0},{"$f":"SUMIFS('3-Manager'!$F$3:$F$368,'3-Manager'!$G$3:$G$368,ALL!K38)","v":0},{"$f":"SUMIFS('4-Manager'!$F$3:$F$368,'4-Manager'!$G$3:$G$368,ALL!K38)","v":2683},{"$f":"SUMIFS('5-Manager'!$F$3:$F$368,'5-Manager'!$G$3:$G$368,ALL!K38)","v":0},2683]
["2020-02-06",{"$f":"'1-Manager'!B39+'2-Manager'!B39+'3-Manager'!B39+'4-Manager'!B39+'5-Manager'!B39","v":190},{"$f":"'1-Manager'!C39+'2-Manager'!C39+'3-Manager'!C39+'4-Manager'!C39+'5-Manager'!C39","v":253},{"$f":"'1-Manager'!D39+'2-Manager'!D39+'3-Manager'!D39+'4-Manager'!D39+'5-Manager'!D39","v":285},{"$f":"'1-Manager'!E39+'2-Manager'!E39+'3-Manager'!E39+'4-Manager'!E39+'5-Manager'!E39","v":154},882,null,4,2,null,"South Carolina",{"$f":"SUMIFS('1-Manager'!$F$3:$F$368,'1-Manager'!$G$3:$G$368,ALL!K39)","v":0},{"$f":"SUMIFS('2-Manager'!$F$3:$F$368,'2-Manager'!$G$3:$G$368,ALL!K39)","v":0},{"$f":"SUMIFS('3-Manager'!$F$3:$F$368,'3-Manager'!$G$3:$G$368,ALL!K39)","v":0},{"$f":"SUMIFS('4-Manager'!$F$3:$F$368,'4-Manager'!$G$3:$G$368,ALL!K39)","v":2328},{"$f":"SUMIFS('5-Manager'!$F$3:$F$368,'5-Manager'!$G$3:$G$368,ALL!K39)","v":0},2328]
["2020-02-07",{"$f":"'1-Manager'!B40+'2-Manager'!B40+'3-Manager'!B40+'4-Manager'!B40+'5-Manager'!B40","v":170},{"$f":"'1-Manager'!C40+'2-Manager'!C40+'3-Manager'!C40+'4-Manager'!C40+'5-Manager'!C40","v":122},{"$f":"'1-Manager'!D40+'2-Manager'!D40+'3-Manager'!D40+'4-Manager'!D40+'5-Manager'!D40","v":181},{"$f":"'1-Manager'!E40+'2-Manager'!E40+'3-Manager'!E40+'4-Manager'!E40+'5-Manager'!E40","v":133},606,null,5,2,null,"South Dakota",{"$f":"SUMIFS('1-Manager'!$F$3:$F$368,'1-Manager'!$G$3:$G$368,ALL!K40)","v":0},{"$f":"SUMIFS('2-Manager'!$F$3:$F$368,'2-Manager'!$G$3:$G$368,ALL!K40)","v":0},{"$f":"SUMIFS('3-Manager'!$F$3:$F$368,'3-Manager'!$G$3:$G$368,ALL!K40)","v":0},{"$f":"SUMIFS('4-Manager'!$F$3:$F$368,'4-Manager'!$G$3:$G$368,ALL!K40)","v":2452},{"$f":"SUMIFS('5-Manager'!$F$3:$F$368,'5-Manager'!$G$3:$G$368,ALL!K40)","v":0},2452]
["2020-02-08",{"$f":"'1-Manager'!B41+'2-Manager'!B41+'3-Manager'!B41+'4-Manager'!B41+'5-Manager'!B41","v":139},{"$f":"'1-Manager'!C41+'2-Manager'!C41+'3-Manager'!C41+'4-Manager'!C41+'5-Manager'!C41","v":143},{"$f":"'1-Manager'!D41+'2-Manager'!D41+'3-Manager'!D41+'4-Manager'!D41+'5-Manager'!D41","v":321},{"$f":"'1-Manager'!E41+'2-Manager'!E41+'3-Manager'!E41+'4-Manager'!E41+'5-Manager'!E41","v":124},727,null,6,2,null,"Tennessee",{"$f":"SUMIFS('1-Manager'!$F$3:$F$368,'1-Manager'!$G$3:$G$368,ALL!K41)","v":0},{"$f":"SUMIFS('2-Manager'!$F$3:$F$368,'2-Manager'!$G$3:$G$368,ALL!K41)","v":0},{"$f":"SUMIFS('3-Manager'!$F$3:$F$368,'3-Manager'!$G$3:$G$368,ALL!K41)","v":0},{"$f":"SUMIFS('4-Manager'!$F$3:$F$368,'4-Manager'!$G$3:$G$368,ALL!K41)","v":2641},{"$f":"SUMIFS('5-Manager'!$F$3:$F$368,'5-Manager'!$G$3:$G$368,ALL!K41)","v":0},2641]
["2020-02-09",{"$f":"'1-Manager'!B42+'2-Manager'!B42+'3-Manager'!B42+'4-Manager'!B42+'5-Manager'!B42","v":94},{"$f":"'1-Manager'!C42+'2-Manager'!C42+'3-Manager'!C42+'4-Manager'!C42+'5-Manager'!C42","v":66},{"$f":"'1-Manager'!D42+'2-Manager'!D42+'3-Manager'!D42+'4-Manager'!D42+'5-Manager'!D42","v":70},{"$f":"'1-Manager'!E42+'2-Manager'!E42+'3-Manager'!E42+'4-Manager'!E42+'5-Manager'!E42","v":42},272,null,7,2,null,"Texas",{"$f":"SUMIFS('1-Manager'!$F$3:$F$368,'1-Manager'!$G$3:$G$368,ALL!K42)","v":0},{"$f":"SUMIFS('2-Manager'!$F$3:$F$368,'2-Manager'!$G$3:$G$368,ALL!K42)","v":0},{"$f":"SUMIFS('3-Manager'!$F$3:$F$368,'3-Manager'!$G$3:$G$368,ALL!K42)","v":0},{"$f":"SUMIFS('4-Manager'!$F$3:$F$368,'4-Manager'!$G$3:$G$368,ALL!K42)","v":0},{"$f":"SUMIFS('5-Manager'!$F$3:$F$368,'5-Manager'!$G$3:$G$368,ALL!K42)","v":5010},5010]
["2020-02-10",{"$f":"'1-Manager'!B43+'2-Manager'!B43+'3-Manager'!B43+'4-Manager'!B43+'5-Manager'!B43","v":183},{"$f":"'1-Manager'!C43+'2-Manager'!C43+'3-Manager'!C43+'4-Manager'!C43+'5-Manager'!C43","v":101},{"$f":"'1-Manager'!D43+'2-Manager'!D43+'3-Manager'!D43+'4-Manager'!D43+'5-Manager'!D43","v":252},{"$f":"'1-Manager'!E43+'2-Manager'!E43+'3-Manager'!E43+'4-Manager'!E43+'5-Manager'!E43","v":158},694,null,1,2,null,"Utah",{"$f":"SUMIFS('1-Manager'!$F$3:$F$368,'1-Manager'!$G$3:$G$368,ALL!K43)","v":0},{"$f":"SUMIFS('2-Manager'!$F$3:$F$368,'2-Manager'!$G$3:$G$368,ALL!K43)","v":0},{"$f":"SUMIFS('3-Manager'!$F$3:$F$368,'3-Manager'!$G$3:$G$368,ALL!K43)","v":0},{"$f":"SUMIFS('4-Manager'!$F$3:$F$368,'4-Manager'!$G$3:$G$368,ALL!K43)","v":0},{"$f":"SUMIFS('5-Manager'!$F$3:$F$368,'5-Manager'!$G$3:$G$368,ALL!K43)","v":4858},4858]
["2020-02-11",{"$f":"'1-Manager'!B44+'2-Manager'!B44+'3-Manager'!B44+'4-Manager'!B44+'5-Manager'!B44","v":254},{"$f":"'1-Manager'!C44+'2-Manager'!C44+'3-Manager'!C44+'4-Manager'!C44+'5-Manager'!C44","v":74},{"$f":"'1-Manager'!D44+'2-Manager'!D44+'3-Manager'!D44+'4-Manager'!D44+'5-Manager'!D44","v":192},{"$f":"'1-Manager'!E44+'2-Manager'!E44+'3-Manager'!E44+'4-Manager'!E44+'5-Manager'!E44","v":163},683,null,2,2,null,"Vermont",{"$f":"SUMIFS('1-Manager'!$F$3:$F$368,'1-Manager'!$G$3:$G$368,ALL!K44)","v":0},{"$f":"SUMIFS('2-Manager'!$F$3:$F$368,'2-Manager'!$G$3:$G$368,ALL!K44)","v":0},{"$f":"SUMIFS('3-Manager'!$F$3:$F$368,'3-Manager'!$G$3:$G$368,ALL!K44)","v":0},{"$f":"SUMIFS('4-Manager'!$F$3:$F$368,'4-Manager'!$G$3:$G$368,ALL!K44)","v":0},{"$f":"SUMIFS('5-Manager'!$F$3:$F$368,'5-Manager'!$G$3:$G$368,ALL!K44)","v":5100},5100]
["2020-02-12",{"$f":"'1-Manager'!B45+'2-Manager'!B45+'3-Manager'!B45+'4-Manager'!B45+'5-Manager'!B45","v":232},{"$f":"'1-Manager'!C45+'2-Manager'!C45+'3-Manager'!C45+'4-Manager'!C45+'5-Manager'!C45","v":160},{"$f":"'1-Manager'!D45+'2-Manager'!D45+'3-Manager'!D45+'4-Manager'!D45+'5-Manager'!D45","v":158},{"$f":"'1-Manager'!E45+'2-Manager'!E45+'3-Manager'!E45+'4-Manager'!E45+'5-Manager'!E45","v":142},692,null,3,2,null,"Virginia",{"$f":"SUMIFS('1-Manager'!$F$3:$F$368,'1-Manager'!$G$3:$G$368,ALL!K45)","v":0},{"$f":"SUMIFS('2-Manager'!$F$3:$F$368,'2-Manager'!$G$3:$G$368,ALL!K45)","v":0},{"$f":"SUMIFS('3-Manager'!$F$3:$F$368,'3-Manager'!$G$3:$G$368,ALL!K45)","v":0},{"$f":"SUMIFS('4-Manager'!$F$3:$F$368,'4-Manager'!$G$3:$G$368,ALL!K45)","v":0},{"$f":"SUMIFS('5-Manager'!$F$3:$F$368,'5-Manager'!$G$3:$G$368,ALL!K45)","v":4880},4880]
["2020-02-13",{"$f":"'1-Manager'!B46+'2-Manager'!B46+'3-Manager'!B46+'4-Manager'!B46+'5-Manager'!B46","v":417},{"$f":"'1-Manager'!C46+'2-Manager'!C46+'3-Manager'!C46+'4-Manager'!C46+'5-Manager'!C46","v":92},{"$f":"'1-Manager'!D46+'2-Manager'!D46+'3-Manager'!D46+'4-Manager'!D46+'5-Manager'!D46","v":246},{"$f":"'1-Manager'!E46+'2-Manager'!E46+'3-Manager'!E46+'4-Manager'!E46+'5-Manager'!E46","v":92},847,null,4,2,null,"Washington",{"$f":"SUMIFS('1-Manager'!$F$3:$F$368,'1-Manager'!$G$3:$G$368,ALL!K46)","v":0},{"$f":"SUMIFS('2-Manager'!$F$3:$F$368,'2-Manager'!$G$3:$G$368,ALL!K46)","v":0},{"$f":"SUMIFS('3-Manager'!$F$3:$F$368,'3-Manager'!$G$3:$G$368,ALL!K46)","v":0},{"$f":"SUMIFS('4-Manager'!$F$3:$F$368,'4-Manager'!$G$3:$G$368,ALL!K46)","v":0},{"$f":"SUMIFS('5-Manager'!$F$3:$F$368,'5-Manager'!$G$3:$G$368,ALL!K46)","v":2165},2165]
["2020-02-14",{"$f":"'1-Manager'!B47+'2-Manager'!B47+'3-Manager'!B47+'4-Manager'!B47+'5-Manager'!B47","v":315},{"$f":"'1-Manager'!C47+'2-Manager'!C47+'3-Manager'!C47+'4-Manager'!C47+'5-Manager'!C47","v":97},{"$f":"'1-Manager'!D47+'2-Manager'!D47+'3-Manager'!D47+'4-Manager'!D47+'5-Manager'!D47","v":243},{"$f":"'1-Manager'!E47+'2-Manager'!E47+'3-Manager'!E47+'4-Manager'!E47+'5-Manager'!E47","v":209},864,null,5,2,null,"West Virginia",{"$f":"SUMIFS('1-Manager'!$F$3:$F$368,'1-Manager'!$G$3:$G$368,ALL!K47)","v":0},{"$f":"SUMIFS('2-Manager'!$F$3:$F$368,'2-Manager'!$G$3:$G$368,ALL!K47)","v":0},{"$f":"SUMIFS('3-Manager'!$F$3:$F$368,'3-Manager'!$G$3:$G$368,ALL!K47)","v":0},{"$f":"SUMIFS('4-Manager'!$F$3:$F$368,'4-Manager'!$G$3:$G$368,ALL!K47)","v":0},{"$f":"SUMIFS('5-Manager'!$F$3:$F$368,'5-Manager'!$G$3:$G$368,ALL!K47)","v":2587},2587]
["2020-02-15",{"$f":"'1-Manager'!B48+'2-Manager'!B48+'3-Manager'!B48+'4-Manager'!B48+'5-Manager'!B48","v":301},{"$f":"'1-Manager'!C48+'2-Manager'!C48+'3-Manager'!C48+'4-Manager'!C48+'5-Manager'!C48","v":165},{"$f":"'1-Manager'!D48+'2-Manager'!D48+'3-Manager'!D48+'4-Manager'!D48+'5-Manager'!D48","v":249},{"$f":"'1-Manager'!E48+'2-Manager'!E48+'3-Manager'!E48+'4-Manager'!E48+'5-Manager'!E48","v":119},834,null,6,2,null,"Wisconsin",{"$f":"SUMIFS('1-Manager'!$F$3:$F$368,'1-Manager'!$G$3:$G$368,ALL!K48)","v":0},{"$f":"SUMIFS('2-Manager'!$F$3:$F$368,'2-Manager'!$G$3:$G$368,ALL!K48)","v":0},{"$f":"SUMIFS('3-Manager'!$F$3:$F$368,'3-Manager'!$G$3:$G$368,ALL!K48)","v":0},{"$f":"SUMIFS('4-Manager'!$F$3:$F$368,'4-Manager'!$G$3:$G$368,ALL!K48)","v":0},{"$f":"SUMIFS('5-Manager'!$F$3:$F$368,'5-Manager'!$G$3:$G$368,ALL!K48)","v":2730},2730]
["2020-02-16",{"$f":"'1-Manager'!B49+'2-Manager'!B49+'3-Manager'!B49+'4-Manager'!B49+'5-Manager'!B49","v":81},{"$f":"'1-Manager'!C49+'2-Manager'!C49+'3-Manager'!C49+'4-Manager'!C49+'5-Manager'!C49","v":83},{"$f":"'1-Manager'!D49+'2-Manager'!D49+'3-Manager'!D49+'4-Manager'!D49+'5-Manager'!D49","v":82},{"$f":"'1-Manager'!E49+'2-Manager'!E49+'3-Manager'!E49+'4-Manager'!E49+'5-Manager'!E49","v":59},305,null,7,2,null,"Wyoming",{"$f":"SUMIFS('1-Manager'!$F$3:$F$368,'1-Manager'!$G$3:$G$368,ALL!K49)","v":0},{"$f":"SUMIFS('2-Manager'!$F$3:$F$368,'2-Manager'!$G$3:$G$368,ALL!K49)","v":0},{"$f":"SUMIFS('3-Manager'!$F$3:$F$368,'3-Manager'!$G$3:$G$368,ALL!K49)","v":0},{"$f":"SUMIFS('4-Manager'!$F$3:$F$368,'4-Manager'!$G$3:$G$368,ALL!K49)","v":0},{"$f":"SUMIFS('5-Manager'!$F$3:$F$368,'5-Manager'!$G$3:$G$368,ALL!K49)","v":2602},2602]
["2020-02-17",{"$f":"'1-Manager'!B50+'2-Manager'!B50+'3-Manager'!B50+'4-Manager'!B50+'5-Manager'!B50","v":265},{"$f":"'1-Manager'!C50+'2-Manager'!C50+'3-Manager'!C50+'4-Manager'!C50+'5-Manager'!C50","v":95},{"$f":"'1-Manager'!D50+'2-Manager'!D50+'3-Manager'!D50+'4-Manager'!D50+'5-Manager'!D50","v":209},{"$f":"'1-Manager'!E50+'2-Manager'!E50+'3-Manager'!E50+'4-Manager'!E50+'5-Manager'!E50","v":57},626,null,1,2]
["2020-02-18",{"$f":"'1-Manager'!B51+'2-Manager'!B51+'3-Manager'!B51+'4-Manager'!B51+'5-Manager'!B51","v":336},{"$f":"'1-Manager'!C51+'2-Manager'!C51+'3-Manager'!C51+'4-Manager'!C51+'5-Manager'!C51","v":175},{"$f":"'1-Manager'!D51+'2-Manager'!D51+'3-Manager'!D51+'4-Manager'!D51+'5-Manager'!D51","v":195},{"$f":"'1-Manager'!E51+'2-Manager'!E51+'3-Manager'!E51+'4-Manager'!E51+'5-Manager'!E51","v":170},876,null,2,2]
["2020-02-19",{"$f":"'1-Manager'!B52+'2-Manager'!B52+'3-Manager'!B52+'4-Manager'!B52+'5-Manager'!B52","v":275},{"$f":"'1-Manager'!C52+'2-Manager'!C52+'3-Manager'!C52+'4-Manager'!C52+'5-Manager'!C52","v":130},{"$f":"'1-Manager'!D52+'2-Manager'!D52+'3-Manager'!D52+'4-Manager'!D52+'5-Manager'!D52","v":240},{"$f":"'1-Manager'!E52+'2-Manager'!E52+'3-Manager'!E52+'4-Manager'!E52+'5-Manager'!E52","v":137},782,null,3,2]
["2020-02-20",{"$f":"'1-Manager'!B53+'2-Manager'!B53+'3-Manager'!B53+'4-Manager'!B53+'5-Manager'!B53","v":246},{"$f":"'1-Manager'!C53+'2-Manager'!C53+'3-Manager'!C53+'4-Manager'!C53+'5-Manager'!C53","v":114},{"$f":"'1-Manager'!D53+'2-Manager'!D53+'3-Manager'!D53+'4-Manager'!D53+'5-Manager'!D53","v":221},{"$f":"'1-Manager'!E53+'2-Manager'!E53+'3-Manager'!E53+'4-Manager'!E53+'5-Manager'!E53","v":139},720,null,4,2]
["2020-02-21",{"$f":"'1-Manager'!B54+'2-Manager'!B54+'3-Manager'!B54+'4-Manager'!B54+'5-Manager'!B54","v":197},{"$f":"'1-Manager'!C54+'2-Manager'!C54+'3-Manager'!C54+'4-Manager'!C54+'5-Manager'!C54","v":180},{"$f":"'1-Manager'!D54+'2-Manager'!D54+'3-Manager'!D54+'4-Manager'!D54+'5-Manager'!D54","v":320},{"$f":"'1-Manager'!E54+'2-Manager'!E54+'3-Manager'!E54+'4-Manager'!E54+'5-Manager'!E54","v":188},885,null,5,2]
["2020-02-22",{"$f":"'1-Manager'!B55+'2-Manager'!B55+'3-Manager'!B55+'4-Manager'!B55+'5-Manager'!B55","v":275},{"$f":"'1-Manager'!C55+'2-Manager'!C55+'3-Manager'!C55+'4-Manager'!C55+'5-Manager'!C55","v":169},{"$f":"'1-Manager'!D55+'2-Manager'!D55+'3-Manager'!D55+'4-Manager'!D55+'5-Manager'!D55","v":99},{"$f":"'1-Manager'!E55+'2-Manager'!E55+'3-Manager'!E55+'4-Manager'!E55+'5-Manager'!E55","v":97},640,null,6,2]
["2020-02-23",{"$f":"'1-Manager'!B56+'2-Manager'!B56+'3-Manager'!B56+'4-Manager'!B56+'5-Manager'!B56","v":49},{"$f":"'1-Manager'!C56+'2-Manager'!C56+'3-Manager'!C56+'4-Manager'!C56+'5-Manager'!C56","v":70},{"$f":"'1-Manager'!D56+'2-Manager'!D56+'3-Manager'!D56+'4-Manager'!D56+'5-Manager'!D56","v":79},{"$f":"'1-Manager'!E56+'2-Manager'!E56+'3-Manager'!E56+'4-Manager'!E56+'5-Manager'!E56","v":50},248,null,7,2]
["2020-02-24",{"$f":"'1-Manager'!B57+'2-Manager'!B57+'3-Manager'!B57+'4-Manager'!B57+'5-Manager'!B57","v":166},{"$f":"'1-Manager'!C57+'2-Manager'!C57+'3-Manager'!C57+'4-Manager'!C57+'5-Manager'!C57","v":155},{"$f":"'1-Manager'!D57+'2-Manager'!D57+'3-Manager'!D57+'4-Manager'!D57+'5-Manager'!D57","v":327},{"$f":"'1-Manager'!E57+'2-Manager'!E57+'3-Manager'!E57+'4-Manager'!E57+'5-Manager'!E57","v":156},804,null,1,2]
["2020-02-25",{"$f":"'1-Manager'!B58+'2-Manager'!B58+'3-Manager'!B58+'4-Manager'!B58+'5-Manager'!B58","v":181},{"$f":"'1-Manager'!C58+'2-Manager'!C58+'3-Manager'!C58+'4-Manager'!C58+'5-Manager'!C58","v":115},{"$f":"'1-Manager'!D58+'2-Manager'!D58+'3-Manager'!D58+'4-Manager'!D58+'5-Manager'!D58","v":277},{"$f":"'1-Manager'!E58+'2-Manager'!E58+'3-Manager'!E58+'4-Manager'!E58+'5-Manager'!E58","v":124},697,null,2,2]
["2020-02-26",{"$f":"'1-Manager'!B59+'2-Manager'!B59+'3-Manager'!B59+'4-Manager'!B59+'5-Manager'!B59","v":184},{"$f":"'1-Manager'!C59+'2-Manager'!C59+'3-Manager'!C59+'4-Manager'!C59+'5-Manager'!C59","v":227},{"$f":"'1-Manager'!D59+'2-Manager'!D59+'3-Manager'!D59+'4-Manager'!D59+'5-Manager'!D59","v":308},{"$f":"'1-Manager'!E59+'2-Manager'!E59+'3-Manager'!E59+'4-Manager'!E59+'5-Manager'!E59","v":164},883,null,3,2]
["2020-02-27",{"$f":"'1-Manager'!B60+'2-Manager'!B60+'3-Manager'!B60+'4-Manager'!B60+'5-Manager'!B60","v":229},{"$f":"'1-Manager'!C60+'2-Manager'!C60+'3-Manager'!C60+'4-Manager'!C60+'5-Manager'!C60","v":138},{"$f":"'1-Manager'!D60+'2-Manager'!D60+'3-Manager'!D60+'4-Manager'!D60+'5-Manager'!D60","v":174},{"$f":"'1-Manager'!E60+'2-Manager'!E60+'3-Manager'!E60+'4-Manager'!E60+'5-Manager'!E60","v":129},670,null,4,2]
["2020-02-28",{"$f":"'1-Manager'!B61+'2-Manager'!B61+'3-Manager'!B61+'4-Manager'!B61+'5-Manager'!B61","v":282},{"$f":"'1-Manager'!C61+'2-Manager'!C61+'3-Manager'!C61+'4-Manager'!C61+'5-Manager'!C61","v":120},{"$f":"'1-Manager'!D61+'2-Manager'!D61+'3-Manager'!D61+'4-Manager'!D61+'5-Manager'!D61","v":150},{"$f":"'1-Manager'!E61+'2-Manager'!E61+'3-Manager'!E61+'4-Manager'!E61+'5-Manager'!E61","v":139},691,null,5,2]
["2020-02-29",{"$f":"'1-Manager'!B62+'2-Manager'!B62+'3-Manager'!B62+'4-Manager'!B62+'5-Manager'!B62","v":303},{"$f":"'1-Manager'!C62+'2-Manager'!C62+'3-Manager'!C62+'4-Manager'!C62+'5-Manager'!C62","v":67},{"$f":"'1-Manager'!D62+'2-Manager'!D62+'3-Manager'!D62+'4-Manager'!D62+'5-Manager'!D62","v":276},{"$f":"'1-Manager'!E62+'2-Manager'!E62+'3-Manager'!E62+'4-Manager'!E62+'5-Manager'!E62","v":146},792,null,6,2]
["2020-03-01",{"$f":"'1-Manager'!B63+'2-Manager'!B63+'3-Manager'!B63+'4-Manager'!B63+'5-Manager'!B63","v":37},{"$f":"'1-Manager'!C63+'2-Manager'!C63+'3-Manager'!C63+'4-Manager'!C63+'5-Manager'!C63","v":56},{"$f":"'1-Manager'!D63+'2-Manager'!D63+'3-Manager'!D63+'4-Manager'!D63+'5-Manager'!D63","v":96},{"$f":"'1-Manager'!E63+'2-Manager'!E63+'3-Manager'!E63+'4-Manager'!E63+'5-Manager'!E63","v":53},242,null,7,3]
["2020-03-02",{"$f":"'1-Manager'!B64+'2-Manager'!B64+'3-Manager'!B64+'4-Manager'!B64+'5-Manager'!B64","v":174},{"$f":"'1-Manager'!C64+'2-Manager'!C64+'3-Manager'!C64+'4-Manager'!C64+'5-Manager'!C64","v":147},{"$f":"'1-Manager'!D64+'2-Manager'!D64+'3-Manager'!D64+'4-Manager'!D64+'5-Manager'!D64","v":183},{"$f":"'1-Manager'!E64+'2-Manager'!E64+'3-Manager'!E64+'4-Manager'!E64+'5-Manager'!E64","v":153},657,null,1,3]
["2020-03-03",{"$f":"'1-Manager'!B65+'2-Manager'!B65+'3-Manager'!B65+'4-Manager'!B65+'5-Manager'!B65","v":301},{"$f":"'1-Manager'!C65+'2-Manager'!C65+'3-Manager'!C65+'4-Manager'!C65+'5-Manager'!C65","v":65},{"$f":"'1-Manager'!D65+'2-Manager'!D65+'3-Manager'!D65+'4-Manager'!D65+'5-Manager'!D65","v":306},{"$f":"'1-Manager'!E65+'2-Manager'!E65+'3-Manager'!E65+'4-Manager'!E65+'5-Manager'!E65","v":85},757,null,2,3]
["2020-03-04",{"$f":"'1-Manager'!B66+'2-Manager'!B66+'3-Manager'!B66+'4-Manager'!B66+'5-Manager'!B66","v":246},{"$f":"'1-Manager'!C66+'2-Manager'!C66+'3-Manager'!C66+'4-Manager'!C66+'5-Manager'!C66","v":141},{"$f":"'1-Manager'!D66+'2-Manager'!D66+'3-Manager'!D66+'4-Manager'!D66+'5-Manager'!D66","v":354},{"$f":"'1-Manager'!E66+'2-Manager'!E66+'3-Manager'!E66+'4-Manager'!E66+'5-Manager'!E66","v":164},905,null,3,3]
["2020-03-05",{"$f":"'1-Manager'!B67+'2-Manager'!B67+'3-Manager'!B67+'4-Manager'!B67+'5-Manager'!B67","v":236},{"$f":"'1-Manager'!C67+'2-Manager'!C67+'3-Manager'!C67+'4-Manager'!C67+'5-Manager'!C67","v":130},{"$f":"'1-Manager'!D67+'2-Manager'!D67+'3-Manager'!D67+'4-Manager'!D67+'5-Manager'!D67","v":261},{"$f":"'1-Manager'!E67+'2-Manager'!E67+'3-Manager'!E67+'4-Manager'!E67+'5-Manager'!E67","v":159},786,null,4,3]
["2020-03-06",{"$f":"'1-Manager'!B68+'2-Manager'!B68+'3-Manager'!B68+'4-Manager'!B68+'5-Manager'!B68","v":403},{"$f":"'1-Manager'!C68+'2-Manager'!C68+'3-Manager'!C68+'4-Manager'!C68+'5-Manager'!C68","v":196},{"$f":"'1-Manager'!D68+'2-Manager'!D68+'3-Manager'!D68+'4-Manager'!D68+'5-Manager'!D68","v":342},{"$f":"'1-Manager'!E68+'2-Manager'!E68+'3-Manager'!E68+'4-Manager'!E68+'5-Manager'!E68","v":124},{"$f":"SUM(B68:E68)","v":1065},null,{"$f":"WEEKDAY(A68,2)","v":5},{"$f":"MONTH(A68)","v":3}]
["2020-03-07",{"$f":"'1-Manager'!B69+'2-Manager'!B69+'3-Manager'!B69+'4-Manager'!B69+'5-Manager'!B69","v":361},{"$f":"'1-Manager'!C69+'2-Manager'!C69+'3-Manager'!C69+'4-Manager'!C69+'5-Manager'!C69","v":146},{"$f":"'1-Manager'!D69+'2-Manager'!D69+'3-Manager'!D69+'4-Manager'!D69+'5-Manager'!D69","v":310},{"$f":"'1-Manager'!E69+'2-Manager'!E69+'3-Manager'!E69+'4-Manager'!E69+'5-Manager'!E69","v":71},888,null,6,3]
["2020-03-08",{"$f":"'1-Manager'!B70+'2-Manager'!B70+'3-Manager'!B70+'4-Manager'!B70+'5-Manager'!B70","v":100},{"$f":"'1-Manager'!C70+'2-Manager'!C70+'3-Manager'!C70+'4-Manager'!C70+'5-Manager'!C70","v":49},{"$f":"'1-Manager'!D70+'2-Manager'!D70+'3-Manager'!D70+'4-Manager'!D70+'5-Manager'!D70","v":83},{"$f":"'1-Manager'!E70+'2-Manager'!E70+'3-Manager'!E70+'4-Manager'!E70+'5-Manager'!E70","v":63},295,null,7,3]
["2020-03-09",{"$f":"'1-Manager'!B71+'2-Manager'!B71+'3-Manager'!B71+'4-Manager'!B71+'5-Manager'!B71","v":222},{"$f":"'1-Manager'!C71+'2-Manager'!C71+'3-Manager'!C71+'4-Manager'!C71+'5-Manager'!C71","v":181},{"$f":"'1-Manager'!D71+'2-Manager'!D71+'3-Manager'!D71+'4-Manager'!D71+'5-Manager'!D71","v":341},{"$f":"'1-Manager'!E71+'2-Manager'!E71+'3-Manager'!E71+'4-Manager'!E71+'5-Manager'!E71","v":120},864,null,1,3]
["2020-03-10",{"$f":"'1-Manager'!B72+'2-Manager'!B72+'3-Manager'!B72+'4-Manager'!B72+'5-Manager'!B72","v":301},{"$f":"'1-Manager'!C72+'2-Manager'!C72+'3-Manager'!C72+'4-Manager'!C72+'5-Manager'!C72","v":120},{"$f":"'1-Manager'!D72+'2-Manager'!D72+'3-Manager'!D72+'4-Manager'!D72+'5-Manager'!D72","v":179},{"$f":"'1-Manager'!E72+'2-Manager'!E72+'3-Manager'!E72+'4-Manager'!E72+'5-Manager'!E72","v":137},737,null,2,3]
["2020-03-11",{"$f":"'1-Manager'!B73+'2-Manager'!B73+'3-Manager'!B73+'4-Manager'!B73+'5-Manager'!B73","v":161},{"$f":"'1-Manager'!C73+'2-Manager'!C73+'3-Manager'!C73+'4-Manager'!C73+'5-Manager'!C73","v":90},{"$f":"'1-Manager'!D73+'2-Manager'!D73+'3-Manager'!D73+'4-Manager'!D73+'5-Manager'!D73","v":244},{"$f":"'1-Manager'!E73+'2-Manager'!E73+'3-Manager'!E73+'4-Manager'!E73+'5-Manager'!E73","v":97},592,null,3,3]
["2020-03-12",{"$f":"'1-Manager'!B74+'2-Manager'!B74+'3-Manager'!B74+'4-Manager'!B74+'5-Manager'!B74","v":355},{"$f":"'1-Manager'!C74+'2-Manager'!C74+'3-Manager'!C74+'4-Manager'!C74+'5-Manager'!C74","v":164},{"$f":"'1-Manager'!D74+'2-Manager'!D74+'3-Manager'!D74+'4-Manager'!D74+'5-Manager'!D74","v":169},{"$f":"'1-Manager'!E74+'2-Manager'!E74+'3-Manager'!E74+'4-Manager'!E74+'5-Manager'!E74","v":179},867,null,4,3]
["2020-03-13",{"$f":"'1-Manager'!B75+'2-Manager'!B75+'3-Manager'!B75+'4-Manager'!B75+'5-Manager'!B75","v":354},{"$f":"'1-Manager'!C75+'2-Manager'!C75+'3-Manager'!C75+'4-Manager'!C75+'5-Manager'!C75","v":215},{"$f":"'1-Manager'!D75+'2-Manager'!D75+'3-Manager'!D75+'4-Manager'!D75+'5-Manager'!D75","v":250},{"$f":"'1-Manager'!E75+'2-Manager'!E75+'3-Manager'!E75+'4-Manager'!E75+'5-Manager'!E75","v":197},1016,null,5,3]
["2020-03-14",{"$f":"'1-Manager'!B76+'2-Manager'!B76+'3-Manager'!B76+'4-Manager'!B76+'5-Manager'!B76","v":145},{"$f":"'1-Manager'!C76+'2-Manager'!C76+'3-Manager'!C76+'4-Manager'!C76+'5-Manager'!C76","v":190},{"$f":"'1-Manager'!D76+'2-Manager'!D76+'3-Manager'!D76+'4-Manager'!D76+'5-Manager'!D76","v":151},{"$f":"'1-Manager'!E76+'2-Manager'!E76+'3-Manager'!E76+'4-Manager'!E76+'5-Manager'!E76","v":162},648,null,6,3]
["2020-03-15",{"$f":"'1-Manager'!B77+'2-Manager'!B77+'3-Manager'!B77+'4-Manager'!B77+'5-Manager'!B77","v":75},{"$f":"'1-Manager'!C77+'2-Manager'!C77+'3-Manager'!C77+'4-Manager'!C77+'5-Manager'!C77","v":65},{"$f":"'1-Manager'!D77+'2-Manager'!D77+'3-Manager'!D77+'4-Manager'!D77+'5-Manager'!D77","v":110},{"$f":"'1-Manager'!E77+'2-Manager'!E77+'3-Manager'!E77+'4-Manager'!E77+'5-Manager'!E77","v":38},288,null,7,3]
["2020-03-16",{"$f":"'1-Manager'!B78+'2-Manager'!B78+'3-Manager'!B78+'4-Manager'!B78+'5-Manager'!B78","v":219},{"$f":"'1-Manager'!C78+'2-Manager'!C78+'3-Manager'!C78+'4-Manager'!C78+'5-Manager'!C78","v":98},{"$f":"'1-Manager'!D78+'2-Manager'!D78+'3-Manager'!D78+'4-Manager'!D78+'5-Manager'!D78","v":238},{"$f":"'1-Manager'!E78+'2-Manager'!E78+'3-Manager'!E78+'4-Manager'!E78+'5-Manager'!E78","v":151},706,null,1,3]
["2020-03-17",{"$f":"'1-Manager'!B79+'2-Manager'!B79+'3-Manager'!B79+'4-Manager'!B79+'5-Manager'!B79","v":267},{"$f":"'1-Manager'!C79+'2-Manager'!C79+'3-Manager'!C79+'4-Manager'!C79+'5-Manager'!C79","v":109},{"$f":"'1-Manager'!D79+'2-Manager'!D79+'3-Manager'!D79+'4-Manager'!D79+'5-Manager'!D79","v":226},{"$f":"'1-Manager'!E79+'2-Manager'!E79+'3-Manager'!E79+'4-Manager'!E79+'5-Manager'!E79","v":130},732,null,2,3]
["2020-03-18",{"$f":"'1-Manager'!B80+'2-Manager'!B80+'3-Manager'!B80+'4-Manager'!B80+'5-Manager'!B80","v":181},{"$f":"'1-Manager'!C80+'2-Manager'!C80+'3-Manager'!C80+'4-Manager'!C80+'5-Manager'!C80","v":153},{"$f":"'1-Manager'!D80+'2-Manager'!D80+'3-Manager'!D80+'4-Manager'!D80+'5-Manager'!D80","v":392},{"$f":"'1-Manager'!E80+'2-Manager'!E80+'3-Manager'!E80+'4-Manager'!E80+'5-Manager'!E80","v":62},788,null,3,3]
["2020-03-19",{"$f":"'1-Manager'!B81+'2-Manager'!B81+'3-Manager'!B81+'4-Manager'!B81+'5-Manager'!B81","v":284},{"$f":"'1-Manager'!C81+'2-Manager'!C81+'3-Manager'!C81+'4-Manager'!C81+'5-Manager'!C81","v":102},{"$f":"'1-Manager'!D81+'2-Manager'!D81+'3-Manager'!D81+'4-Manager'!D81+'5-Manager'!D81","v":231},{"$f":"'1-Manager'!E81+'2-Manager'!E81+'3-Manager'!E81+'4-Manager'!E81+'5-Manager'!E81","v":114},731,null,4,3]
["2020-03-20",{"$f":"'1-Manager'!B82+'2-Manager'!B82+'3-Manager'!B82+'4-Manager'!B82+'5-Manager'!B82","v":355},{"$f":"'1-Manager'!C82+'2-Manager'!C82+'3-Manager'!C82+'4-Manager'!C82+'5-Manager'!C82","v":115},{"$f":"'1-Manager'!D82+'2-Manager'!D82+'3-Manager'!D82+'4-Manager'!D82+'5-Manager'!D82","v":259},{"$f":"'1-Manager'!E82+'2-Manager'!E82+'3-Manager'!E82+'4-Manager'!E82+'5-Manager'!E82","v":178},907,null,5,3]
["2020-03-21",{"$f":"'1-Manager'!B83+'2-Manager'!B83+'3-Manager'!B83+'4-Manager'!B83+'5-Manager'!B83","v":178},{"$f":"'1-Manager'!C83+'2-Manager'!C83+'3-Manager'!C83+'4-Manager'!C83+'5-Manager'!C83","v":176},{"$f":"'1-Manager'!D83+'2-Manager'!D83+'3-Manager'!D83+'4-Manager'!D83+'5-Manager'!D83","v":226},{"$f":"'1-Manager'!E83+'2-Manager'!E83+'3-Manager'!E83+'4-Manager'!E83+'5-Manager'!E83","v":127},707,null,6,3]
["2020-03-22",{"$f":"'1-Manager'!B84+'2-Manager'!B84+'3-Manager'!B84+'4-Manager'!B84+'5-Manager'!B84","v":130},{"$f":"'1-Manager'!C84+'2-Manager'!C84+'3-Manager'!C84+'4-Manager'!C84+'5-Manager'!C84","v":57},{"$f":"'1-Manager'!D84+'2-Manager'!D84+'3-Manager'!D84+'4-Manager'!D84+'5-Manager'!D84","v":89},{"$f":"'1-Manager'!E84+'2-Manager'!E84+'3-Manager'!E84+'4-Manager'!E84+'5-Manager'!E84","v":56},332,null,7,3]
["2020-03-23",{"$f":"'1-Manager'!B85+'2-Manager'!B85+'3-Manager'!B85+'4-Manager'!B85+'5-Manager'!B85","v":167},{"$f":"'1-Manager'!C85+'2-Manager'!C85+'3-Manager'!C85+'4-Manager'!C85+'5-Manager'!C85","v":162},{"$f":"'1-Manager'!D85+'2-Manager'!D85+'3-Manager'!D85+'4-Manager'!D85+'5-Manager'!D85","v":288},{"$f":"'1-Manager'!E85+'2-Manager'!E85+'3-Manager'!E85+'4-Manager'!E85+'5-Manager'!E85","v":190},807,null,1,3]
["2020-03-24",{"$f":"'1-Manager'!B86+'2-Manager'!B86+'3-Manager'!B86+'4-Manager'!B86+'5-Manager'!B86","v":294},{"$f":"'1-Manager'!C86+'2-Manager'!C86+'3-Manager'!C86+'4-Manager'!C86+'5-Manager'!C86","v":99},{"$f":"'1-Manager'!D86+'2-Manager'!D86+'3-Manager'!D86+'4-Manager'!D86+'5-Manager'!D86","v":343},{"$f":"'1-Manager'!E86+'2-Manager'!E86+'3-Manager'!E86+'4-Manager'!E86+'5-Manager'!E86","v":77},813,null,2,3]
["2020-03-25",{"$f":"'1-Manager'!B87+'2-Manager'!B87+'3-Manager'!B87+'4-Manager'!B87+'5-Manager'!B87","v":275},{"$f":"'1-Manager'!C87+'2-Manager'!C87+'3-Manager'!C87+'4-Manager'!C87+'5-Manager'!C87","v":193},{"$f":"'1-Manager'!D87+'2-Manager'!D87+'3-Manager'!D87+'4-Manager'!D87+'5-Manager'!D87","v":371},{"$f":"'1-Manager'!E87+'2-Manager'!E87+'3-Manager'!E87+'4-Manager'!E87+'5-Manager'!E87","v":112},951,null,3,3]
["2020-03-26",{"$f":"'1-Manager'!B88+'2-Manager'!B88+'3-Manager'!B88+'4-Manager'!B88+'5-Manager'!B88","v":233},{"$f":"'1-Manager'!C88+'2-Manager'!C88+'3-Manager'!C88+'4-Manager'!C88+'5-Manager'!C88","v":149},{"$f":"'1-Manager'!D88+'2-Manager'!D88+'3-Manager'!D88+'4-Manager'!D88+'5-Manager'!D88","v":159},{"$f":"'1-Manager'!E88+'2-Manager'!E88+'3-Manager'!E88+'4-Manager'!E88+'5-Manager'!E88","v":133},674,null,4,3]
["2020-03-27",{"$f":"'1-Manager'!B89+'2-Manager'!B89+'3-Manager'!B89+'4-Manager'!B89+'5-Manager'!B89","v":264},{"$f":"'1-Manager'!C89+'2-Manager'!C89+'3-Manager'!C89+'4-Manager'!C89+'5-Manager'!C89","v":155},{"$f":"'1-Manager'!D89+'2-Manager'!D89+'3-Manager'!D89+'4-Manager'!D89+'5-Manager'!D89","v":384},{"$f":"'1-Manager'!E89+'2-Manager'!E89+'3-Manager'!E89+'4-Manager'!E89+'5-Manager'!E89","v":214},1017,null,5,3]
["2020-03-28",{"$f":"'1-Manager'!B90+'2-Manager'!B90+'3-Manager'!B90+'4-Manager'!B90+'5-Manager'!B90","v":261},{"$f":"'1-Manager'!C90+'2-Manager'!C90+'3-Manager'!C90+'4-Manager'!C90+'5-Manager'!C90","v":171},{"$f":"'1-Manager'!D90+'2-Manager'!D90+'3-Manager'!D90+'4-Manager'!D90+'5-Manager'!D90","v":185},{"$f":"'1-Manager'!E90+'2-Manager'!E90+'3-Manager'!E90+'4-Manager'!E90+'5-Manager'!E90","v":153},770,null,6,3]
["2020-03-29",{"$f":"'1-Manager'!B91+'2-Manager'!B91+'3-Manager'!B91+'4-Manager'!B91+'5-Manager'!B91","v":152},{"$f":"'1-Manager'!C91+'2-Manager'!C91+'3-Manager'!C91+'4-Manager'!C91+'5-Manager'!C91","v":52},{"$f":"'1-Manager'!D91+'2-Manager'!D91+'3-Manager'!D91+'4-Manager'!D91+'5-Manager'!D91","v":82},{"$f":"'1-Manager'!E91+'2-Manager'!E91+'3-Manager'!E91+'4-Manager'!E91+'5-Manager'!E91","v":58},344,null,7,3]
["2020-03-30",{"$f":"'1-Manager'!B92+'2-Manager'!B92+'3-Manager'!B92+'4-Manager'!B92+'5-Manager'!B92","v":295},{"$f":"'1-Manager'!C92+'2-Manager'!C92+'3-Manager'!C92+'4-Manager'!C92+'5-Manager'!C92","v":133},{"$f":"'1-Manager'!D92+'2-Manager'!D92+'3-Manager'!D92+'4-Manager'!D92+'5-Manager'!D92","v":171},{"$f":"'1-Manager'!E92+'2-Manager'!E92+'3-Manager'!E92+'4-Manager'!E92+'5-Manager'!E92","v":148},747,null,1,3]
["2020-03-31",{"$f":"'1-Manager'!B93+'2-Manager'!B93+'3-Manager'!B93+'4-Manager'!B93+'5-Manager'!B93","v":273},{"$f":"'1-Manager'!C93+'2-Manager'!C93+'3-Manager'!C93+'4-Manager'!C93+'5-Manager'!C93","v":90},{"$f":"'1-Manager'!D93+'2-Manager'!D93+'3-Manager'!D93+'4-Manager'!D93+'5-Manager'!D93","v":221},{"$f":"'1-Manager'!E93+'2-Manager'!E93+'3-Manager'!E93+'4-Manager'!E93+'5-Manager'!E93","v":183},767,null,2,3]
["2020-04-01",{"$f":"'1-Manager'!B94+'2-Manager'!B94+'3-Manager'!B94+'4-Manager'!B94+'5-Manager'!B94","v":288},{"$f":"'1-Manager'!C94+'2-Manager'!C94+'3-Manager'!C94+'4-Manager'!C94+'5-Manager'!C94","v":172},{"$f":"'1-Manager'!D94+'2-Manager'!D94+'3-Manager'!D94+'4-Manager'!D94+'5-Manager'!D94","v":334},{"$f":"'1-Manager'!E94+'2-Manager'!E94+'3-Manager'!E94+'4-Manager'!E94+'5-Manager'!E94","v":146},940,null,3,4]
["2020-04-02",{"$f":"'1-Manager'!B95+'2-Manager'!B95+'3-Manager'!B95+'4-Manager'!B95+'5-Manager'!B95","v":255},{"$f":"'1-Manager'!C95+'2-Manager'!C95+'3-Manager'!C95+'4-Manager'!C95+'5-Manager'!C95","v":194},{"$f":"'1-Manager'!D95+'2-Manager'!D95+'3-Manager'!D95+'4-Manager'!D95+'5-Manager'!D95","v":226},{"$f":"'1-Manager'!E95+'2-Manager'!E95+'3-Manager'!E95+'4-Manager'!E95+'5-Manager'!E95","v":148},823,null,4,4]
["2020-04-03",{"$f":"'1-Manager'!B96+'2-Manager'!B96+'3-Manager'!B96+'4-Manager'!B96+'5-Manager'!B96","v":214},{"$f":"'1-Manager'!C96+'2-Manager'!C96+'3-Manager'!C96+'4-Manager'!C96+'5-Manager'!C96","v":182},{"$f":"'1-Manager'!D96+'2-Manager'!D96+'3-Manager'!D96+'4-Manager'!D96+'5-Manager'!D96","v":245},{"$f":"'1-Manager'!E96+'2-Manager'!E96+'3-Manager'!E96+'4-Manager'!E96+'5-Manager'!E96","v":162},803,null,5,4]
["2020-04-04",{"$f":"'1-Manager'!B97+'2-Manager'!B97+'3-Manager'!B97+'4-Manager'!B97+'5-Manager'!B97","v":275},{"$f":"'1-Manager'!C97+'2-Manager'!C97+'3-Manager'!C97+'4-Manager'!C97+'5-Manager'!C97","v":162},{"$f":"'1-Manager'!D97+'2-Manager'!D97+'3-Manager'!D97+'4-Manager'!D97+'5-Manager'!D97","v":282},{"$f":"'1-Manager'!E97+'2-Manager'!E97+'3-Manager'!E97+'4-Manager'!E97+'5-Manager'!E97","v":127},846,null,6,4]
["2020-04-05",{"$f":"'1-Manager'!B98+'2-Manager'!B98+'3-Manager'!B98+'4-Manager'!B98+'5-Manager'!B98","v":73},{"$f":"'1-Manager'!C98+'2-Manager'!C98+'3-Manager'!C98+'4-Manager'!C98+'5-Manager'!C98","v":37},{"$f":"'1-Manager'!D98+'2-Manager'!D98+'3-Manager'!D98+'4-Manager'!D98+'5-Manager'!D98","v":115},{"$f":"'1-Manager'!E98+'2-Manager'!E98+'3-Manager'!E98+'4-Manager'!E98+'5-Manager'!E98","v":50},275,null,7,4]
["2020-04-06",{"$f":"'1-Manager'!B99+'2-Manager'!B99+'3-Manager'!B99+'4-Manager'!B99+'5-Manager'!B99","v":180},{"$f":"'1-Manager'!C99+'2-Manager'!C99+'3-Manager'!C99+'4-Manager'!C99+'5-Manager'!C99","v":106},{"$f":"'1-Manager'!D99+'2-Manager'!D99+'3-Manager'!D99+'4-Manager'!D99+'5-Manager'!D99","v":164},{"$f":"'1-Manager'!E99+'2-Manager'!E99+'3-Manager'!E99+'4-Manager'!E99+'5-Manager'!E99","v":137},587,null,1,4]
["2020-04-07",{"$f":"'1-Manager'!B100+'2-Manager'!B100+'3-Manager'!B100+'4-Manager'!B100+'5-Manager'!B100","v":259},{"$f":"'1-Manager'!C100+'2-Manager'!C100+'3-Manager'!C100+'4-Manager'!C100+'5-Manager'!C100","v":84},{"$f":"'1-Manager'!D100+'2-Manager'!D100+'3-Manager'!D100+'4-Manager'!D100+'5-Manager'!D100","v":306},{"$f":"'1-Manager'!E100+'2-Manager'!E100+'3-Manager'!E100+'4-Manager'!E100+'5-Manager'!E100","v":117},766,null,2,4]
["2020-04-08",{"$f":"'1-Manager'!B101+'2-Manager'!B101+'3-Manager'!B101+'4-Manager'!B101+'5-Manager'!B101","v":345},{"$f":"'1-Manager'!C101+'2-Manager'!C101+'3-Manager'!C101+'4-Manager'!C101+'5-Manager'!C101","v":152},{"$f":"'1-Manager'!D101+'2-Manager'!D101+'3-Manager'!D101+'4-Manager'!D101+'5-Manager'!D101","v":252},{"$f":"'1-Manager'!E101+'2-Manager'!E101+'3-Manager'!E101+'4-Manager'!E101+'5-Manager'!E101","v":186},935,null,3,4]
["2020-04-09",{"$f":"'1-Manager'!B102+'2-Manager'!B102+'3-Manager'!B102+'4-Manager'!B102+'5-Manager'!B102","v":302},{"$f":"'1-Manager'!C102+'2-Manager'!C102+'3-Manager'!C102+'4-Manager'!C102+'5-Manager'!C102","v":164},{"$f":"'1-Manager'!D102+'2-Manager'!D102+'3-Manager'!D102+'4-Manager'!D102+'5-Manager'!D102","v":243},{"$f":"'1-Manager'!E102+'2-Manager'!E102+'3-Manager'!E102+'4-Manager'!E102+'5-Manager'!E102","v":81},790,null,4,4]
["2020-04-10",{"$f":"'1-Manager'!B103+'2-Manager'!B103+'3-Manager'!B103+'4-Manager'!B103+'5-Manager'!B103","v":181},{"$f":"'1-Manager'!C103+'2-Manager'!C103+'3-Manager'!C103+'4-Manager'!C103+'5-Manager'!C103","v":192},{"$f":"'1-Manager'!D103+'2-Manager'!D103+'3-Manager'!D103+'4-Manager'!D103+'5-Manager'!D103","v":247},{"$f":"'1-Manager'!E103+'2-Manager'!E103+'3-Manager'!E103+'4-Manager'!E103+'5-Manager'!E103","v":104},724,null,5,4]
["2020-04-11",{"$f":"'1-Manager'!B104+'2-Manager'!B104+'3-Manager'!B104+'4-Manager'!B104+'5-Manager'!B104","v":363},{"$f":"'1-Manager'!C104+'2-Manager'!C104+'3-Manager'!C104+'4-Manager'!C104+'5-Manager'!C104","v":156},{"$f":"'1-Manager'!D104+'2-Manager'!D104+'3-Manager'!D104+'4-Manager'!D104+'5-Manager'!D104","v":249},{"$f":"'1-Manager'!E104+'2-Manager'!E104+'3-Manager'!E104+'4-Manager'!E104+'5-Manager'!E104","v":146},914,null,6,4]
["2020-04-12",{"$f":"'1-Manager'!B105+'2-Manager'!B105+'3-Manager'!B105+'4-Manager'!B105+'5-Manager'!B105","v":137},{"$f":"'1-Manager'!C105+'2-Manager'!C105+'3-Manager'!C105+'4-Manager'!C105+'5-Manager'!C105","v":39},{"$f":"'1-Manager'!D105+'2-Manager'!D105+'3-Manager'!D105+'4-Manager'!D105+'5-Manager'!D105","v":91},{"$f":"'1-Manager'!E105+'2-Manager'!E105+'3-Manager'!E105+'4-Manager'!E105+'5-Manager'!E105","v":67},334,null,7,4]
["2020-04-13",{"$f":"'1-Manager'!B106+'2-Manager'!B106+'3-Manager'!B106+'4-Manager'!B106+'5-Manager'!B106","v":201},{"$f":"'1-Manager'!C106+'2-Manager'!C106+'3-Manager'!C106+'4-Manager'!C106+'5-Manager'!C106","v":107},{"$f":"'1-Manager'!D106+'2-Manager'!D106+'3-Manager'!D106+'4-Manager'!D106+'5-Manager'!D106","v":198},{"$f":"'1-Manager'!E106+'2-Manager'!E106+'3-Manager'!E106+'4-Manager'!E106+'5-Manager'!E106","v":120},626,null,1,4]
["2020-04-14",{"$f":"'1-Manager'!B107+'2-Manager'!B107+'3-Manager'!B107+'4-Manager'!B107+'5-Manager'!B107","v":223},{"$f":"'1-Manager'!C107+'2-Manager'!C107+'3-Manager'!C107+'4-Manager'!C107+'5-Manager'!C107","v":134},{"$f":"'1-Manager'!D107+'2-Manager'!D107+'3-Manager'!D107+'4-Manager'!D107+'5-Manager'!D107","v":233},{"$f":"'1-Manager'!E107+'2-Manager'!E107+'3-Manager'!E107+'4-Manager'!E107+'5-Manager'!E107","v":130},720,null,2,4]
["2020-04-15",{"$f":"'1-Manager'!B108+'2-Manager'!B108+'3-Manager'!B108+'4-Manager'!B108+'5-Manager'!B108","v":273},{"$f":"'1-Manager'!C108+'2-Manager'!C108+'3-Manager'!C108+'4-Manager'!C108+'5-Manager'!C108","v":65},{"$f":"'1-Manager'!D108+'2-Manager'!D108+'3-Manager'!D108+'4-Manager'!D108+'5-Manager'!D108","v":238},{"$f":"'1-Manager'!E108+'2-Manager'!E108+'3-Manager'!E108+'4-Manager'!E108+'5-Manager'!E108","v":142},718,null,3,4]
["2020-04-16",{"$f":"'1-Manager'!B109+'2-Manager'!B109+'3-Manager'!B109+'4-Manager'!B109+'5-Manager'!B109","v":318},{"$f":"'1-Manager'!C109+'2-Manager'!C109+'3-Manager'!C109+'4-Manager'!C109+'5-Manager'!C109","v":137},{"$f":"'1-Manager'!D109+'2-Manager'!D109+'3-Manager'!D109+'4-Manager'!D109+'5-Manager'!D109","v":201},{"$f":"'1-Manager'!E109+'2-Manager'!E109+'3-Manager'!E109+'4-Manager'!E109+'5-Manager'!E109","v":181},837,null,4,4]
["2020-04-17",{"$f":"'1-Manager'!B110+'2-Manager'!B110+'3-Manager'!B110+'4-Manager'!B110+'5-Manager'!B110","v":248},{"$f":"'1-Manager'!C110+'2-Manager'!C110+'3-Manager'!C110+'4-Manager'!C110+'5-Manager'!C110","v":183},{"$f":"'1-Manager'!D110+'2-Manager'!D110+'3-Manager'!D110+'4-Manager'!D110+'5-Manager'!D110","v":389},{"$f":"'1-Manager'!E110+'2-Manager'!E110+'3-Manager'!E110+'4-Manager'!E110+'5-Manager'!E110","v":183},1003,null,5,4]
["2020-04-18",{"$f":"'1-Manager'!B111+'2-Manager'!B111+'3-Manager'!B111+'4-Manager'!B111+'5-Manager'!B111","v":196},{"$f":"'1-Manager'!C111+'2-Manager'!C111+'3-Manager'!C111+'4-Manager'!C111+'5-Manager'!C111","v":136},{"$f":"'1-Manager'!D111+'2-Manager'!D111+'3-Manager'!D111+'4-Manager'!D111+'5-Manager'!D111","v":334},{"$f":"'1-Manager'!E111+'2-Manager'!E111+'3-Manager'!E111+'4-Manager'!E111+'5-Manager'!E111","v":48},714,null,6,4]
["2020-04-19",{"$f":"'1-Manager'!B112+'2-Manager'!B112+'3-Manager'!B112+'4-Manager'!B112+'5-Manager'!B112","v":112},{"$f":"'1-Manager'!C112+'2-Manager'!C112+'3-Manager'!C112+'4-Manager'!C112+'5-Manager'!C112","v":49},{"$f":"'1-Manager'!D112+'2-Manager'!D112+'3-Manager'!D112+'4-Manager'!D112+'5-Manager'!D112","v":77},{"$f":"'1-Manager'!E112+'2-Manager'!E112+'3-Manager'!E112+'4-Manager'!E112+'5-Manager'!E112","v":41},279,null,7,4]
["2020-04-20",{"$f":"'1-Manager'!B113+'2-Manager'!B113+'3-Manager'!B113+'4-Manager'!B113+'5-Manager'!B113","v":223},{"$f":"'1-Manager'!C113+'2-Manager'!C113+'3-Manager'!C113+'4-Manager'!C113+'5-Manager'!C113","v":110},{"$f":"'1-Manager'!D113+'2-Manager'!D113+'3-Manager'!D113+'4-Manager'!D113+'5-Manager'!D113","v":90},{"$f":"'1-Manager'!E113+'2-Manager'!E113+'3-Manager'!E113+'4-Manager'!E113+'5-Manager'!E113","v":118},541,null,1,4]
["2020-04-21",{"$f":"'1-Manager'!B114+'2-Manager'!B114+'3-Manager'!B114+'4-Manager'!B114+'5-Manager'!B114","v":283},{"$f":"'1-Manager'!C114+'2-Manager'!C114+'3-Manager'!C114+'4-Manager'!C114+'5-Manager'!C114","v":94},{"$f":"'1-Manager'!D114+'2-Manager'!D114+'3-Manager'!D114+'4-Manager'!D114+'5-Manager'!D114","v":185},{"$f":"'1-Manager'!E114+'2-Manager'!E114+'3-Manager'!E114+'4-Manager'!E114+'5-Manager'!E114","v":137},699,null,2,4]
["2020-04-22",{"$f":"'1-Manager'!B115+'2-Manager'!B115+'3-Manager'!B115+'4-Manager'!B115+'5-Manager'!B115","v":171},{"$f":"'1-Manager'!C115+'2-Manager'!C115+'3-Manager'!C115+'4-Manager'!C115+'5-Manager'!C115","v":83},{"$f":"'1-Manager'!D115+'2-Manager'!D115+'3-Manager'!D115+'4-Manager'!D115+'5-Manager'!D115","v":293},{"$f":"'1-Manager'!E115+'2-Manager'!E115+'3-Manager'!E115+'4-Manager'!E115+'5-Manager'!E115","v":175},722,null,3,4]
["2020-04-23",{"$f":"'1-Manager'!B116+'2-Manager'!B116+'3-Manager'!B116+'4-Manager'!B116+'5-Manager'!B116","v":250},{"$f":"'1-Manager'!C116+'2-Manager'!C116+'3-Manager'!C116+'4-Manager'!C116+'5-Manager'!C116","v":169},{"$f":"'1-Manager'!D116+'2-Manager'!D116+'3-Manager'!D116+'4-Manager'!D116+'5-Manager'!D116","v":349},{"$f":"'1-Manager'!E116+'2-Manager'!E116+'3-Manager'!E116+'4-Manager'!E116+'5-Manager'!E116","v":133},901,null,4,4]
["2020-04-24",{"$f":"'1-Manager'!B117+'2-Manager'!B117+'3-Manager'!B117+'4-Manager'!B117+'5-Manager'!B117","v":232},{"$f":"'1-Manager'!C117+'2-Manager'!C117+'3-Manager'!C117+'4-Manager'!C117+'5-Manager'!C117","v":132},{"$f":"'1-Manager'!D117+'2-Manager'!D117+'3-Manager'!D117+'4-Manager'!D117+'5-Manager'!D117","v":200},{"$f":"'1-Manager'!E117+'2-Manager'!E117+'3-Manager'!E117+'4-Manager'!E117+'5-Manager'!E117","v":175},739,null,5,4]
["2020-04-25",{"$f":"'1-Manager'!B118+'2-Manager'!B118+'3-Manager'!B118+'4-Manager'!B118+'5-Manager'!B118","v":303},{"$f":"'1-Manager'!C118+'2-Manager'!C118+'3-Manager'!C118+'4-Manager'!C118+'5-Manager'!C118","v":212},{"$f":"'1-Manager'!D118+'2-Manager'!D118+'3-Manager'!D118+'4-Manager'!D118+'5-Manager'!D118","v":243},{"$f":"'1-Manager'!E118+'2-Manager'!E118+'3-Manager'!E118+'4-Manager'!E118+'5-Manager'!E118","v":143},901,null,6,4]
["2020-04-26",{"$f":"'1-Manager'!B119+'2-Manager'!B119+'3-Manager'!B119+'4-Manager'!B119+'5-Manager'!B119","v":65},{"$f":"'1-Manager'!C119+'2-Manager'!C119+'3-Manager'!C119+'4-Manager'!C119+'5-Manager'!C119","v":47},{"$f":"'1-Manager'!D119+'2-Manager'!D119+'3-Manager'!D119+'4-Manager'!D119+'5-Manager'!D119","v":83},{"$f":"'1-Manager'!E119+'2-Manager'!E119+'3-Manager'!E119+'4-Manager'!E119+'5-Manager'!E119","v":62},257,null,7,4]
["2020-04-27",{"$f":"'1-Manager'!B120+'2-Manager'!B120+'3-Manager'!B120+'4-Manager'!B120+'5-Manager'!B120","v":215},{"$f":"'1-Manager'!C120+'2-Manager'!C120+'3-Manager'!C120+'4-Manager'!C120+'5-Manager'!C120","v":175},{"$f":"'1-Manager'!D120+'2-Manager'!D120+'3-Manager'!D120+'4-Manager'!D120+'5-Manager'!D120","v":312},{"$f":"'1-Manager'!E120+'2-Manager'!E120+'3-Manager'!E120+'4-Manager'!E120+'5-Manager'!E120","v":146},848,null,1,4]
["2020-04-28",{"$f":"'1-Manager'!B121+'2-Manager'!B121+'3-Manager'!B121+'4-Manager'!B121+'5-Manager'!B121","v":292},{"$f":"'1-Manager'!C121+'2-Manager'!C121+'3-Manager'!C121+'4-Manager'!C121+'5-Manager'!C121","v":80},{"$f":"'1-Manager'!D121+'2-Manager'!D121+'3-Manager'!D121+'4-Manager'!D121+'5-Manager'!D121","v":258},{"$f":"'1-Manager'!E121+'2-Manager'!E121+'3-Manager'!E121+'4-Manager'!E121+'5-Manager'!E121","v":140},770,null,2,4]
["2020-04-29",{"$f":"'1-Manager'!B122+'2-Manager'!B122+'3-Manager'!B122+'4-Manager'!B122+'5-Manager'!B122","v":261},{"$f":"'1-Manager'!C122+'2-Manager'!C122+'3-Manager'!C122+'4-Manager'!C122+'5-Manager'!C122","v":186},{"$f":"'1-Manager'!D122+'2-Manager'!D122+'3-Manager'!D122+'4-Manager'!D122+'5-Manager'!D122","v":285},{"$f":"'1-Manager'!E122+'2-Manager'!E122+'3-Manager'!E122+'4-Manager'!E122+'5-Manager'!E122","v":104},836,null,3,4]
["2020-04-30",{"$f":"'1-Manager'!B123+'2-Manager'!B123+'3-Manager'!B123+'4-Manager'!B123+'5-Manager'!B123","v":332},{"$f":"'1-Manager'!C123+'2-Manager'!C123+'3-Manager'!C123+'4-Manager'!C123+'5-Manager'!C123","v":97},{"$f":"'1-Manager'!D123+'2-Manager'!D123+'3-Manager'!D123+'4-Manager'!D123+'5-Manager'!D123","v":270},{"$f":"'1-Manager'!E123+'2-Manager'!E123+'3-Manager'!E123+'4-Manager'!E123+'5-Manager'!E123","v":198},897,null,4,4]
["2020-05-01",{"$f":"'1-Manager'!B124+'2-Manager'!B124+'3-Manager'!B124+'4-Manager'!B124+'5-Manager'!B124","v":333},{"$f":"'1-Manager'!C124+'2-Manager'!C124+'3-Manager'!C124+'4-Manager'!C124+'5-Manager'!C124","v":247},{"$f":"'1-Manager'!D124+'2-Manager'!D124+'3-Manager'!D124+'4-Manager'!D124+'5-Manager'!D124","v":346},{"$f":"'1-Manager'!E124+'2-Manager'!E124+'3-Manager'!E124+'4-Manager'!E124+'5-Manager'!E124","v":160},1086,null,5,5]
["2020-05-02",{"$f":"'1-Manager'!B125+'2-Manager'!B125+'3-Manager'!B125+'4-Manager'!B125+'5-Manager'!B125","v":308},{"$f":"'1-Manager'!C125+'2-Manager'!C125+'3-Manager'!C125+'4-Manager'!C125+'5-Manager'!C125","v":87},{"$f":"'1-Manager'!D125+'2-Manager'!D125+'3-Manager'!D125+'4-Manager'!D125+'5-Manager'!D125","v":213},{"$f":"'1-Manager'!E125+'2-Manager'!E125+'3-Manager'!E125+'4-Manager'!E125+'5-Manager'!E125","v":143},751,null,6,5]
["2020-05-03",{"$f":"'1-Manager'!B126+'2-Manager'!B126+'3-Manager'!B126+'4-Manager'!B126+'5-Manager'!B126","v":95},{"$f":"'1-Manager'!C126+'2-Manager'!C126+'3-Manager'!C126+'4-Manager'!C126+'5-Manager'!C126","v":51},{"$f":"'1-Manager'!D126+'2-Manager'!D126+'3-Manager'!D126+'4-Manager'!D126+'5-Manager'!D126","v":87},{"$f":"'1-Manager'!E126+'2-Manager'!E126+'3-Manager'!E126+'4-Manager'!E126+'5-Manager'!E126","v":57},290,null,7,5]
["2020-05-04",{"$f":"'1-Manager'!B127+'2-Manager'!B127+'3-Manager'!B127+'4-Manager'!B127+'5-Manager'!B127","v":243},{"$f":"'1-Manager'!C127+'2-Manager'!C127+'3-Manager'!C127+'4-Manager'!C127+'5-Manager'!C127","v":119},{"$f":"'1-Manager'!D127+'2-Manager'!D127+'3-Manager'!D127+'4-Manager'!D127+'5-Manager'!D127","v":200},{"$f":"'1-Manager'!E127+'2-Manager'!E127+'3-Manager'!E127+'4-Manager'!E127+'5-Manager'!E127","v":127},689,null,1,5]
["2020-05-05",{"$f":"'1-Manager'!B128+'2-Manager'!B128+'3-Manager'!B128+'4-Manager'!B128+'5-Manager'!B128","v":224},{"$f":"'1-Manager'!C128+'2-Manager'!C128+'3-Manager'!C128+'4-Manager'!C128+'5-Manager'!C128","v":128},{"$f":"'1-Manager'!D128+'2-Manager'!D128+'3-Manager'!D128+'4-Manager'!D128+'5-Manager'!D128","v":163},{"$f":"'1-Manager'!E128+'2-Manager'!E128+'3-Manager'!E128+'4-Manager'!E128+'5-Manager'!E128","v":157},672,null,2,5]
["2020-05-06",{"$f":"'1-Manager'!B129+'2-Manager'!B129+'3-Manager'!B129+'4-Manager'!B129+'5-Manager'!B129","v":197},{"$f":"'1-Manager'!C129+'2-Manager'!C129+'3-Manager'!C129+'4-Manager'!C129+'5-Manager'!C129","v":85},{"$f":"'1-Manager'!D129+'2-Manager'!D129+'3-Manager'!D129+'4-Manager'!D129+'5-Manager'!D129","v":154},{"$f":"'1-Manager'!E129+'2-Manager'!E129+'3-Manager'!E129+'4-Manager'!E129+'5-Manager'!E129","v":107},543,null,3,5]
["2020-05-07",{"$f":"'1-Manager'!B130+'2-Manager'!B130+'3-Manager'!B130+'4-Manager'!B130+'5-Manager'!B130","v":217},{"$f":"'1-Manager'!C130+'2-Manager'!C130+'3-Manager'!C130+'4-Manager'!C130+'5-Manager'!C130","v":155},{"$f":"'1-Manager'!D130+'2-Manager'!D130+'3-Manager'!D130+'4-Manager'!D130+'5-Manager'!D130","v":256},{"$f":"'1-Manager'!E130+'2-Manager'!E130+'3-Manager'!E130+'4-Manager'!E130+'5-Manager'!E130","v":113},741,null,4,5]
["2020-05-08",{"$f":"'1-Manager'!B131+'2-Manager'!B131+'3-Manager'!B131+'4-Manager'!B131+'5-Manager'!B131","v":257},{"$f":"'1-Manager'!C131+'2-Manager'!C131+'3-Manager'!C131+'4-Manager'!C131+'5-Manager'!C131","v":193},{"$f":"'1-Manager'!D131+'2-Manager'!D131+'3-Manager'!D131+'4-Manager'!D131+'5-Manager'!D131","v":266},{"$f":"'1-Manager'!E131+'2-Manager'!E131+'3-Manager'!E131+'4-Manager'!E131+'5-Manager'!E131","v":128},844,null,5,5]
["2020-05-09",{"$f":"'1-Manager'!B132+'2-Manager'!B132+'3-Manager'!B132+'4-Manager'!B132+'5-Manager'!B132","v":182},{"$f":"'1-Manager'!C132+'2-Manager'!C132+'3-Manager'!C132+'4-Manager'!C132+'5-Manager'!C132","v":149},{"$f":"'1-Manager'!D132+'2-Manager'!D132+'3-Manager'!D132+'4-Manager'!D132+'5-Manager'!D132","v":156},{"$f":"'1-Manager'!E132+'2-Manager'!E132+'3-Manager'!E132+'4-Manager'!E132+'5-Manager'!E132","v":158},{"$f":"SUM(B132:E132)","v":645},null,{"$f":"WEEKDAY(A132,2)","v":6},{"$f":"MONTH(A132)","v":5}]
["2020-05-10",{"$f":"'1-Manager'!B133+'2-Manager'!B133+'3-Manager'!B133+'4-Manager'!B133+'5-Manager'!B133","v":83},{"$f":"'1-Manager'!C133+'2-Manager'!C133+'3-Manager'!C133+'4-Manager'!C133+'5-Manager'!C133","v":40},{"$f":"'1-Manager'!D133+'2-Manager'!D133+'3-Manager'!D133+'4-Manager'!D133+'5-Manager'!D133","v":82},{"$f":"'1-Manager'!E133+'2-Manager'!E133+'3-Manager'!E133+'4-Manager'!E133+'5-Manager'!E133","v":36},241,null,7,5]
["2020-05-11",{"$f":"'1-Manager'!B134+'2-Manager'!B134+'3-Manager'!B134+'4-Manager'!B134+'5-Manager'!B134","v":226},{"$f":"'1-Manager'!C134+'2-Manager'!C134+'3-Manager'!C134+'4-Manager'!C134+'5-Manager'!C134","v":140},{"$f":"'1-Manager'!D134+'2-Manager'!D134+'3-Manager'!D134+'4-Manager'!D134+'5-Manager'!D134","v":149},{"$f":"'1-Manager'!E134+'2-Manager'!E134+'3-Manager'!E134+'4-Manager'!E134+'5-Manager'!E134","v":149},664,null,1,5]
["2020-05-12",{"$f":"'1-Manager'!B135+'2-Manager'!B135+'3-Manager'!B135+'4-Manager'!B135+'5-Manager'!B135","v":231},{"$f":"'1-Manager'!C135+'2-Manager'!C135+'3-Manager'!C135+'4-Manager'!C135+'5-Manager'!C135","v":157},{"$f":"'1-Manager'!D135+'2-Manager'!D135+'3-Manager'!D135+'4-Manager'!D135+'5-Manager'!D135","v":186},{"$f":"'1-Manager'!E135+'2-Manager'!E135+'3-Manager'!E135+'4-Manager'!E135+'5-Manager'!E135","v":180},754,null,2,5]
["2020-05-13",{"$f":"'1-Manager'!B136+'2-Manager'!B136+'3-Manager'!B136+'4-Manager'!B136+'5-Manager'!B136","v":350},{"$f":"'1-Manager'!C136+'2-Manager'!C136+'3-Manager'!C136+'4-Manager'!C136+'5-Manager'!C136","v":222},{"$f":"'1-Manager'!D136+'2-Manager'!D136+'3-Manager'!D136+'4-Manager'!D136+'5-Manager'!D136","v":219},{"$f":"'1-Manager'!E136+'2-Manager'!E136+'3-Manager'!E136+'4-Manager'!E136+'5-Manager'!E136","v":127},918,null,3,5]
["2020-05-14",{"$f":"'1-Manager'!B137+'2-Manager'!B137+'3-Manager'!B137+'4-Manager'!B137+'5-Manager'!B137","v":194},{"$f":"'1-Manager'!C137+'2-Manager'!C137+'3-Manager'!C137+'4-Manager'!C137+'5-Manager'!C137","v":163},{"$f":"'1-Manager'!D137+'2-Manager'!D137+'3-Manager'!D137+'4-Manager'!D137+'5-Manager'!D137","v":117},{"$f":"'1-Manager'!E137+'2-Manager'!E137+'3-Manager'!E137+'4-Manager'!E137+'5-Manager'!E137","v":141},615,null,4,5]
["2020-05-15",{"$f":"'1-Manager'!B138+'2-Manager'!B138+'3-Manager'!B138+'4-Manager'!B138+'5-Manager'!B138","v":324},{"$f":"'1-Manager'!C138+'2-Manager'!C138+'3-Manager'!C138+'4-Manager'!C138+'5-Manager'!C138","v":105},{"$f":"'1-Manager'!D138+'2-Manager'!D138+'3-Manager'!D138+'4-Manager'!D138+'5-Manager'!D138","v":311},{"$f":"'1-Manager'!E138+'2-Manager'!E138+'3-Manager'!E138+'4-Manager'!E138+'5-Manager'!E138","v":208},948,null,5,5]
["2020-05-16",{"$f":"'1-Manager'!B139+'2-Manager'!B139+'3-Manager'!B139+'4-Manager'!B139+'5-Manager'!B139","v":422},{"$f":"'1-Manager'!C139+'2-Manager'!C139+'3-Manager'!C139+'4-Manager'!C139+'5-Manager'!C139","v":166},{"$f":"'1-Manager'!D139+'2-Manager'!D139+'3-Manager'!D139+'4-Manager'!D139+'5-Manager'!D139","v":163},{"$f":"'1-Manager'!E139+'2-Manager'!E139+'3-Manager'!E139+'4-Manager'!E139+'5-Manager'!E139","v":124},875,null,6,5]
["2020-05-17",{"$f":"'1-Manager'!B140+'2-Manager'!B140+'3-Manager'!B140+'4-Manager'!B140+'5-Manager'!B140","v":83},{"$f":"'1-Manager'!C140+'2-Manager'!C140+'3-Manager'!C140+'4-Manager'!C140+'5-Manager'!C140","v":49},{"$f":"'1-Manager'!D140+'2-Manager'!D140+'3-Manager'!D140+'4-Manager'!D140+'5-Manager'!D140","v":79},{"$f":"'1-Manager'!E140+'2-Manager'!E140+'3-Manager'!E140+'4-Manager'!E140+'5-Manager'!E140","v":53},264,null,7,5]
["2020-05-18",{"$f":"'1-Manager'!B141+'2-Manager'!B141+'3-Manager'!B141+'4-Manager'!B141+'5-Manager'!B141","v":179},{"$f":"'1-Manager'!C141+'2-Manager'!C141+'3-Manager'!C141+'4-Manager'!C141+'5-Manager'!C141","v":97},{"$f":"'1-Manager'!D141+'2-Manager'!D141+'3-Manager'!D141+'4-Manager'!D141+'5-Manager'!D141","v":189},{"$f":"'1-Manager'!E141+'2-Manager'!E141+'3-Manager'!E141+'4-Manager'!E141+'5-Manager'!E141","v":156},621,null,1,5]
["2020-05-19",{"$f":"'1-Manager'!B142+'2-Manager'!B142+'3-Manager'!B142+'4-Manager'!B142+'5-Manager'!B142","v":332},{"$f":"'1-Manager'!C142+'2-Manager'!C142+'3-Manager'!C142+'4-Manager'!C142+'5-Manager'!C142","v":116},{"$f":"'1-Manager'!D142+'2-Manager'!D142+'3-Manager'!D142+'4-Manager'!D142+'5-Manager'!D142","v":243},{"$f":"'1-Manager'!E142+'2-Manager'!E142+'3-Manager'!E142+'4-Manager'!E142+'5-Manager'!E142","v":86},777,null,2,5]
["2020-05-20",{"$f":"'1-Manager'!B143+'2-Manager'!B143+'3-Manager'!B143+'4-Manager'!B143+'5-Manager'!B143","v":189},{"$f":"'1-Manager'!C143+'2-Manager'!C143+'3-Manager'!C143+'4-Manager'!C143+'5-Manager'!C143","v":96},{"$f":"'1-Manager'!D143+'2-Manager'!D143+'3-Manager'!D143+'4-Manager'!D143+'5-Manager'!D143","v":309},{"$f":"'1-Manager'!E143+'2-Manager'!E143+'3-Manager'!E143+'4-Manager'!E143+'5-Manager'!E143","v":153},747,null,3,5]
["2020-05-21",{"$f":"'1-Manager'!B144+'2-Manager'!B144+'3-Manager'!B144+'4-Manager'!B144+'5-Manager'!B144","v":358},{"$f":"'1-Manager'!C144+'2-Manager'!C144+'3-Manager'!C144+'4-Manager'!C144+'5-Manager'!C144","v":189},{"$f":"'1-Manager'!D144+'2-Manager'!D144+'3-Manager'!D144+'4-Manager'!D144+'5-Manager'!D144","v":196},{"$f":"'1-Manager'!E144+'2-Manager'!E144+'3-Manager'!E144+'4-Manager'!E144+'5-Manager'!E144","v":133},876,null,4,5]
["2020-05-22",{"$f":"'1-Manager'!B145+'2-Manager'!B145+'3-Manager'!B145+'4-Manager'!B145+'5-Manager'!B145","v":117},{"$f":"'1-Manager'!C145+'2-Manager'!C145+'3-Manager'!C145+'4-Manager'!C145+'5-Manager'!C145","v":195},{"$f":"'1-Manager'!D145+'2-Manager'!D145+'3-Manager'!D145+'4-Manager'!D145+'5-Manager'!D145","v":279},{"$f":"'1-Manager'!E145+'2-Manager'!E145+'3-Manager'!E145+'4-Manager'!E145+'5-Manager'!E145","v":125},716,null,5,5]
["2020-05-23",{"$f":"'1-Manager'!B146+'2-Manager'!B146+'3-Manager'!B146+'4-Manager'!B146+'5-Manager'!B146","v":186},{"$f":"'1-Manager'!C146+'2-Manager'!C146+'3-Manager'!C146+'4-Manager'!C146+'5-Manager'!C146","v":183},{"$f":"'1-Manager'!D146+'2-Manager'!D146+'3-Manager'!D146+'4-Manager'!D146+'5-Manager'!D146","v":313},{"$f":"'1-Manager'!E146+'2-Manager'!E146+'3-Manager'!E146+'4-Manager'!E146+'5-Manager'!E146","v":96},778,null,6,5]
["2020-05-24",{"$f":"'1-Manager'!B147+'2-Manager'!B147+'3-Manager'!B147+'4-Manager'!B147+'5-Manager'!B147","v":116},{"$f":"'1-Manager'!C147+'2-Manager'!C147+'3-Manager'!C147+'4-Manager'!C147+'5-Manager'!C147","v":54},{"$f":"'1-Manager'!D147+'2-Manager'!D147+'3-Manager'!D147+'4-Manager'!D147+'5-Manager'!D147","v":109},{"$f":"'1-Manager'!E147+'2-Manager'!E147+'3-Manager'!E147+'4-Manager'!E147+'5-Manager'!E147","v":37},316,null,7,5]
["2020-05-25",{"$f":"'1-Manager'!B148+'2-Manager'!B148+'3-Manager'!B148+'4-Manager'!B148+'5-Manager'!B148","v":238},{"$f":"'1-Manager'!C148+'2-Manager'!C148+'3-Manager'!C148+'4-Manager'!C148+'5-Manager'!C148","v":186},{"$f":"'1-Manager'!D148+'2-Manager'!D148+'3-Manager'!D148+'4-Manager'!D148+'5-Manager'!D148","v":164},{"$f":"'1-Manager'!E148+'2-Manager'!E148+'3-Manager'!E148+'4-Manager'!E148+'5-Manager'!E148","v":125},713,null,1,5]
["2020-05-26",{"$f":"'1-Manager'!B149+'2-Manager'!B149+'3-Manager'!B149+'4-Manager'!B149+'5-Manager'!B149","v":335},{"$f":"'1-Manager'!C149+'2-Manager'!C149+'3-Manager'!C149+'4-Manager'!C149+'5-Manager'!C149","v":121},{"$f":"'1-Manager'!D149+'2-Manager'!D149+'3-Manager'!D149+'4-Manager'!D149+'5-Manager'!D149","v":253},{"$f":"'1-Manager'!E149+'2-Manager'!E149+'3-Manager'!E149+'4-Manager'!E149+'5-Manager'!E149","v":67},776,null,2,5]
["2020-05-27",{"$f":"'1-Manager'!B150+'2-Manager'!B150+'3-Manager'!B150+'4-Manager'!B150+'5-Manager'!B150","v":189},{"$f":"'1-Manager'!C150+'2-Manager'!C150+'3-Manager'!C150+'4-Manager'!C150+'5-Manager'!C150","v":198},{"$f":"'1-Manager'!D150+'2-Manager'!D150+'3-Manager'!D150+'4-Manager'!D150+'5-Manager'!D150","v":384},{"$f":"'1-Manager'!E150+'2-Manager'!E150+'3-Manager'!E150+'4-Manager'!E150+'5-Manager'!E150","v":119},890,null,3,5]
["2020-05-28",{"$f":"'1-Manager'!B151+'2-Manager'!B151+'3-Manager'!B151+'4-Manager'!B151+'5-Manager'!B151","v":203},{"$f":"'1-Manager'!C151+'2-Manager'!C151+'3-Manager'!C151+'4-Manager'!C151+'5-Manager'!C151","v":160},{"$f":"'1-Manager'!D151+'2-Manager'!D151+'3-Manager'!D151+'4-Manager'!D151+'5-Manager'!D151","v":265},{"$f":"'1-Manager'!E151+'2-Manager'!E151+'3-Manager'!E151+'4-Manager'!E151+'5-Manager'!E151","v":177},805,null,4,5]
["2020-05-29",{"$f":"'1-Manager'!B152+'2-Manager'!B152+'3-Manager'!B152+'4-Manager'!B152+'5-Manager'!B152","v":328},{"$f":"'1-Manager'!C152+'2-Manager'!C152+'3-Manager'!C152+'4-Manager'!C152+'5-Manager'!C152","v":113},{"$f":"'1-Manager'!D152+'2-Manager'!D152+'3-Manager'!D152+'4-Manager'!D152+'5-Manager'!D152","v":314},{"$f":"'1-Manager'!E152+'2-Manager'!E152+'3-Manager'!E152+'4-Manager'!E152+'5-Manager'!E152","v":196},951,null,5,5]
["2020-05-30",{"$f":"'1-Manager'!B153+'2-Manager'!B153+'3-Manager'!B153+'4-Manager'!B153+'5-Manager'!B153","v":266},{"$f":"'1-Manager'!C153+'2-Manager'!C153+'3-Manager'!C153+'4-Manager'!C153+'5-Manager'!C153","v":160},{"$f":"'1-Manager'!D153+'2-Manager'!D153+'3-Manager'!D153+'4-Manager'!D153+'5-Manager'!D153","v":213},{"$f":"'1-Manager'!E153+'2-Manager'!E153+'3-Manager'!E153+'4-Manager'!E153+'5-Manager'!E153","v":145},784,null,6,5]
["2020-05-31",{"$f":"'1-Manager'!B154+'2-Manager'!B154+'3-Manager'!B154+'4-Manager'!B154+'5-Manager'!B154","v":86},{"$f":"'1-Manager'!C154+'2-Manager'!C154+'3-Manager'!C154+'4-Manager'!C154+'5-Manager'!C154","v":35},{"$f":"'1-Manager'!D154+'2-Manager'!D154+'3-Manager'!D154+'4-Manager'!D154+'5-Manager'!D154","v":66},{"$f":"'1-Manager'!E154+'2-Manager'!E154+'3-Manager'!E154+'4-Manager'!E154+'5-Manager'!E154","v":54},241,null,7,5]
["2020-06-01",{"$f":"'1-Manager'!B155+'2-Manager'!B155+'3-Manager'!B155+'4-Manager'!B155+'5-Manager'!B155","v":164},{"$f":"'1-Manager'!C155+'2-Manager'!C155+'3-Manager'!C155+'4-Manager'!C155+'5-Manager'!C155","v":133},{"$f":"'1-Manager'!D155+'2-Manager'!D155+'3-Manager'!D155+'4-Manager'!D155+'5-Manager'!D155","v":236},{"$f":"'1-Manager'!E155+'2-Manager'!E155+'3-Manager'!E155+'4-Manager'!E155+'5-Manager'!E155","v":103},636,null,1,6]
["2020-06-02",{"$f":"'1-Manager'!B156+'2-Manager'!B156+'3-Manager'!B156+'4-Manager'!B156+'5-Manager'!B156","v":220},{"$f":"'1-Manager'!C156+'2-Manager'!C156+'3-Manager'!C156+'4-Manager'!C156+'5-Manager'!C156","v":172},{"$f":"'1-Manager'!D156+'2-Manager'!D156+'3-Manager'!D156+'4-Manager'!D156+'5-Manager'!D156","v":322},{"$f":"'1-Manager'!E156+'2-Manager'!E156+'3-Manager'!E156+'4-Manager'!E156+'5-Manager'!E156","v":210},924,null,2,6]
["2020-06-03",{"$f":"'1-Manager'!B157+'2-Manager'!B157+'3-Manager'!B157+'4-Manager'!B157+'5-Manager'!B157","v":262},{"$f":"'1-Manager'!C157+'2-Manager'!C157+'3-Manager'!C157+'4-Manager'!C157+'5-Manager'!C157","v":176},{"$f":"'1-Manager'!D157+'2-Manager'!D157+'3-Manager'!D157+'4-Manager'!D157+'5-Manager'!D157","v":362},{"$f":"'1-Manager'!E157+'2-Manager'!E157+'3-Manager'!E157+'4-Manager'!E157+'5-Manager'!E157","v":156},956,null,3,6]
["2020-06-04",{"$f":"'1-Manager'!B158+'2-Manager'!B158+'3-Manager'!B158+'4-Manager'!B158+'5-Manager'!B158","v":313},{"$f":"'1-Manager'!C158+'2-Manager'!C158+'3-Manager'!C158+'4-Manager'!C158+'5-Manager'!C158","v":173},{"$f":"'1-Manager'!D158+'2-Manager'!D158+'3-Manager'!D158+'4-Manager'!D158+'5-Manager'!D158","v":303},{"$f":"'1-Manager'!E158+'2-Manager'!E158+'3-Manager'!E158+'4-Manager'!E158+'5-Manager'!E158","v":154},943,null,4,6]
["2020-06-05",{"$f":"'1-Manager'!B159+'2-Manager'!B159+'3-Manager'!B159+'4-Manager'!B159+'5-Manager'!B159","v":163},{"$f":"'1-Manager'!C159+'2-Manager'!C159+'3-Manager'!C159+'4-Manager'!C159+'5-Manager'!C159","v":195},{"$f":"'1-Manager'!D159+'2-Manager'!D159+'3-Manager'!D159+'4-Manager'!D159+'5-Manager'!D159","v":416},{"$f":"'1-Manager'!E159+'2-Manager'!E159+'3-Manager'!E159+'4-Manager'!E159+'5-Manager'!E159","v":175},949,null,5,6]
["2020-06-06",{"$f":"'1-Manager'!B160+'2-Manager'!B160+'3-Manager'!B160+'4-Manager'!B160+'5-Manager'!B160","v":258},{"$f":"'1-Manager'!C160+'2-Manager'!C160+'3-Manager'!C160+'4-Manager'!C160+'5-Manager'!C160","v":197},{"$f":"'1-Manager'!D160+'2-Manager'!D160+'3-Manager'!D160+'4-Manager'!D160+'5-Manager'!D160","v":194},{"$f":"'1-Manager'!E160+'2-Manager'!E160+'3-Manager'!E160+'4-Manager'!E160+'5-Manager'!E160","v":139},788,null,6,6]
["2020-06-07",{"$f":"'1-Manager'!B161+'2-Manager'!B161+'3-Manager'!B161+'4-Manager'!B161+'5-Manager'!B161","v":96},{"$f":"'1-Manager'!C161+'2-Manager'!C161+'3-Manager'!C161+'4-Manager'!C161+'5-Manager'!C161","v":40},{"$f":"'1-Manager'!D161+'2-Manager'!D161+'3-Manager'!D161+'4-Manager'!D161+'5-Manager'!D161","v":63},{"$f":"'1-Manager'!E161+'2-Manager'!E161+'3-Manager'!E161+'4-Manager'!E161+'5-Manager'!E161","v":51},250,null,7,6]
["2020-06-08",{"$f":"'1-Manager'!B162+'2-Manager'!B162+'3-Manager'!B162+'4-Manager'!B162+'5-Manager'!B162","v":182},{"$f":"'1-Manager'!C162+'2-Manager'!C162+'3-Manager'!C162+'4-Manager'!C162+'5-Manager'!C162","v":136},{"$f":"'1-Manager'!D162+'2-Manager'!D162+'3-Manager'!D162+'4-Manager'!D162+'5-Manager'!D162","v":261},{"$f":"'1-Manager'!E162+'2-Manager'!E162+'3-Manager'!E162+'4-Manager'!E162+'5-Manager'!E162","v":182},761,null,1,6]
["2020-06-09",{"$f":"'1-Manager'!B163+'2-Manager'!B163+'3-Manager'!B163+'4-Manager'!B163+'5-Manager'!B163","v":154},{"$f":"'1-Manager'!C163+'2-Manager'!C163+'3-Manager'!C163+'4-Manager'!C163+'5-Manager'!C163","v":177},{"$f":"'1-Manager'!D163+'2-Manager'!D163+'3-Manager'!D163+'4-Manager'!D163+'5-Manager'!D163","v":291},{"$f":"'1-Manager'!E163+'2-Manager'!E163+'3-Manager'!E163+'4-Manager'!E163+'5-Manager'!E163","v":150},772,null,2,6]
["2020-06-10",{"$f":"'1-Manager'!B164+'2-Manager'!B164+'3-Manager'!B164+'4-Manager'!B164+'5-Manager'!B164","v":155},{"$f":"'1-Manager'!C164+'2-Manager'!C164+'3-Manager'!C164+'4-Manager'!C164+'5-Manager'!C164","v":137},{"$f":"'1-Manager'!D164+'2-Manager'!D164+'3-Manager'!D164+'4-Manager'!D164+'5-Manager'!D164","v":214},{"$f":"'1-Manager'!E164+'2-Manager'!E164+'3-Manager'!E164+'4-Manager'!E164+'5-Manager'!E164","v":103},609,null,3,6]
["2020-06-11",{"$f":"'1-Manager'!B165+'2-Manager'!B165+'3-Manager'!B165+'4-Manager'!B165+'5-Manager'!B165","v":359},{"$f":"'1-Manager'!C165+'2-Manager'!C165+'3-Manager'!C165+'4-Manager'!C165+'5-Manager'!C165","v":146},{"$f":"'1-Manager'!D165+'2-Manager'!D165+'3-Manager'!D165+'4-Manager'!D165+'5-Manager'!D165","v":296},{"$f":"'1-Manager'!E165+'2-Manager'!E165+'3-Manager'!E165+'4-Manager'!E165+'5-Manager'!E165","v":136},937,null,4,6]
["2020-06-12",{"$f":"'1-Manager'!B166+'2-Manager'!B166+'3-Manager'!B166+'4-Manager'!B166+'5-Manager'!B166","v":322},{"$f":"'1-Manager'!C166+'2-Manager'!C166+'3-Manager'!C166+'4-Manager'!C166+'5-Manager'!C166","v":207},{"$f":"'1-Manager'!D166+'2-Manager'!D166+'3-Manager'!D166+'4-Manager'!D166+'5-Manager'!D166","v":281},{"$f":"'1-Manager'!E166+'2-Manager'!E166+'3-Manager'!E166+'4-Manager'!E166+'5-Manager'!E166","v":86},896,null,5,6]
["2020-06-13",{"$f":"'1-Manager'!B167+'2-Manager'!B167+'3-Manager'!B167+'4-Manager'!B167+'5-Manager'!B167","v":249},{"$f":"'1-Manager'!C167+'2-Manager'!C167+'3-Manager'!C167+'4-Manager'!C167+'5-Manager'!C167","v":100},{"$f":"'1-Manager'!D167+'2-Manager'!D167+'3-Manager'!D167+'4-Manager'!D167+'5-Manager'!D167","v":354},{"$f":"'1-Manager'!E167+'2-Manager'!E167+'3-Manager'!E167+'4-Manager'!E167+'5-Manager'!E167","v":213},916,null,6,6]
["2020-06-14",{"$f":"'1-Manager'!B168+'2-Manager'!B168+'3-Manager'!B168+'4-Manager'!B168+'5-Manager'!B168","v":98},{"$f":"'1-Manager'!C168+'2-Manager'!C168+'3-Manager'!C168+'4-Manager'!C168+'5-Manager'!C168","v":55},{"$f":"'1-Manager'!D168+'2-Manager'!D168+'3-Manager'!D168+'4-Manager'!D168+'5-Manager'!D168","v":121},{"$f":"'1-Manager'!E168+'2-Manager'!E168+'3-Manager'!E168+'4-Manager'!E168+'5-Manager'!E168","v":57},331,null,7,6]
["2020-06-15",{"$f":"'1-Manager'!B169+'2-Manager'!B169+'3-Manager'!B169+'4-Manager'!B169+'5-Manager'!B169","v":250},{"$f":"'1-Manager'!C169+'2-Manager'!C169+'3-Manager'!C169+'4-Manager'!C169+'5-Manager'!C169","v":118},{"$f":"'1-Manager'!D169+'2-Manager'!D169+'3-Manager'!D169+'4-Manager'!D169+'5-Manager'!D169","v":321},{"$f":"'1-Manager'!E169+'2-Manager'!E169+'3-Manager'!E169+'4-Manager'!E169+'5-Manager'!E169","v":127},816,null,1,6]
["2020-06-16",{"$f":"'1-Manager'!B170+'2-Manager'!B170+'3-Manager'!B170+'4-Manager'!B170+'5-Manager'!B170","v":263},{"$f":"'1-Manager'!C170+'2-Manager'!C170+'3-Manager'!C170+'4-Manager'!C170+'5-Manager'!C170","v":112},{"$f":"'1-Manager'!D170+'2-Manager'!D170+'3-Manager'!D170+'4-Manager'!D170+'5-Manager'!D170","v":233},{"$f":"'1-Manager'!E170+'2-Manager'!E170+'3-Manager'!E170+'4-Manager'!E170+'5-Manager'!E170","v":112},720,null,2,6]
["2020-06-17",{"$f":"'1-Manager'!B171+'2-Manager'!B171+'3-Manager'!B171+'4-Manager'!B171+'5-Manager'!B171","v":306},{"$f":"'1-Manager'!C171+'2-Manager'!C171+'3-Manager'!C171+'4-Manager'!C171+'5-Manager'!C171","v":109},{"$f":"'1-Manager'!D171+'2-Manager'!D171+'3-Manager'!D171+'4-Manager'!D171+'5-Manager'!D171","v":270},{"$f":"'1-Manager'!E171+'2-Manager'!E171+'3-Manager'!E171+'4-Manager'!E171+'5-Manager'!E171","v":133},818,null,3,6]
["2020-06-18",{"$f":"'1-Manager'!B172+'2-Manager'!B172+'3-Manager'!B172+'4-Manager'!B172+'5-Manager'!B172","v":380},{"$f":"'1-Manager'!C172+'2-Manager'!C172+'3-Manager'!C172+'4-Manager'!C172+'5-Manager'!C172","v":196},{"$f":"'1-Manager'!D172+'2-Manager'!D172+'3-Manager'!D172+'4-Manager'!D172+'5-Manager'!D172","v":250},{"$f":"'1-Manager'!E172+'2-Manager'!E172+'3-Manager'!E172+'4-Manager'!E172+'5-Manager'!E172","v":117},943,null,4,6]
["2020-06-19",{"$f":"'1-Manager'!B173+'2-Manager'!B173+'3-Manager'!B173+'4-Manager'!B173+'5-Manager'!B173","v":244},{"$f":"'1-Manager'!C173+'2-Manager'!C173+'3-Manager'!C173+'4-Manager'!C173+'5-Manager'!C173","v":200},{"$f":"'1-Manager'!D173+'2-Manager'!D173+'3-Manager'!D173+'4-Manager'!D173+'5-Manager'!D173","v":176},{"$f":"'1-Manager'!E173+'2-Manager'!E173+'3-Manager'!E173+'4-Manager'!E173+'5-Manager'!E173","v":199},819,null,5,6]
["2020-06-20",{"$f":"'1-Manager'!B174+'2-Manager'!B174+'3-Manager'!B174+'4-Manager'!B174+'5-Manager'!B174","v":197},{"$f":"'1-Manager'!C174+'2-Manager'!C174+'3-Manager'!C174+'4-Manager'!C174+'5-Manager'!C174","v":189},{"$f":"'1-Manager'!D174+'2-Manager'!D174+'3-Manager'!D174+'4-Manager'!D174+'5-Manager'!D174","v":213},{"$f":"'1-Manager'!E174+'2-Manager'!E174+'3-Manager'!E174+'4-Manager'!E174+'5-Manager'!E174","v":102},701,null,6,6]
["2020-06-21",{"$f":"'1-Manager'!B175+'2-Manager'!B175+'3-Manager'!B175+'4-Manager'!B175+'5-Manager'!B175","v":88},{"$f":"'1-Manager'!C175+'2-Manager'!C175+'3-Manager'!C175+'4-Manager'!C175+'5-Manager'!C175","v":75},{"$f":"'1-Manager'!D175+'2-Manager'!D175+'3-Manager'!D175+'4-Manager'!D175+'5-Manager'!D175","v":81},{"$f":"'1-Manager'!E175+'2-Manager'!E175+'3-Manager'!E175+'4-Manager'!E175+'5-Manager'!E175","v":56},300,null,7,6]
["2020-06-22",{"$f":"'1-Manager'!B176+'2-Manager'!B176+'3-Manager'!B176+'4-Manager'!B176+'5-Manager'!B176","v":314},{"$f":"'1-Manager'!C176+'2-Manager'!C176+'3-Manager'!C176+'4-Manager'!C176+'5-Manager'!C176","v":111},{"$f":"'1-Manager'!D176+'2-Manager'!D176+'3-Manager'!D176+'4-Manager'!D176+'5-Manager'!D176","v":192},{"$f":"'1-Manager'!E176+'2-Manager'!E176+'3-Manager'!E176+'4-Manager'!E176+'5-Manager'!E176","v":106},723,null,1,6]
["2020-06-23",{"$f":"'1-Manager'!B177+'2-Manager'!B177+'3-Manager'!B177+'4-Manager'!B177+'5-Manager'!B177","v":239},{"$f":"'1-Manager'!C177+'2-Manager'!C177+'3-Manager'!C177+'4-Manager'!C177+'5-Manager'!C177","v":151},{"$f":"'1-Manager'!D177+'2-Manager'!D177+'3-Manager'!D177+'4-Manager'!D177+'5-Manager'!D177","v":144},{"$f":"'1-Manager'!E177+'2-Manager'!E177+'3-Manager'!E177+'4-Manager'!E177+'5-Manager'!E177","v":95},629,null,2,6]
["2020-06-24",{"$f":"'1-Manager'!B178+'2-Manager'!B178+'3-Manager'!B178+'4-Manager'!B178+'5-Manager'!B178","v":200},{"$f":"'1-Manager'!C178+'2-Manager'!C178+'3-Manager'!C178+'4-Manager'!C178+'5-Manager'!C178","v":121},{"$f":"'1-Manager'!D178+'2-Manager'!D178+'3-Manager'!D178+'4-Manager'!D178+'5-Manager'!D178","v":352},{"$f":"'1-Manager'!E178+'2-Manager'!E178+'3-Manager'!E178+'4-Manager'!E178+'5-Manager'!E178","v":157},830,null,3,6]
["2020-06-25",{"$f":"'1-Manager'!B179+'2-Manager'!B179+'3-Manager'!B179+'4-Manager'!B179+'5-Manager'!B179","v":344},{"$f":"'1-Manager'!C179+'2-Manager'!C179+'3-Manager'!C179+'4-Manager'!C179+'5-Manager'!C179","v":108},{"$f":"'1-Manager'!D179+'2-Manager'!D179+'3-Manager'!D179+'4-Manager'!D179+'5-Manager'!D179","v":197},{"$f":"'1-Manager'!E179+'2-Manager'!E179+'3-Manager'!E179+'4-Manager'!E179+'5-Manager'!E179","v":209},858,null,4,6]
["2020-06-26",{"$f":"'1-Manager'!B180+'2-Manager'!B180+'3-Manager'!B180+'4-Manager'!B180+'5-Manager'!B180","v":309},{"$f":"'1-Manager'!C180+'2-Manager'!C180+'3-Manager'!C180+'4-Manager'!C180+'5-Manager'!C180","v":213},{"$f":"'1-Manager'!D180+'2-Manager'!D180+'3-Manager'!D180+'4-Manager'!D180+'5-Manager'!D180","v":361},{"$f":"'1-Manager'!E180+'2-Manager'!E180+'3-Manager'!E180+'4-Manager'!E180+'5-Manager'!E180","v":86},969,null,5,6]
["2020-06-27",{"$f":"'1-Manager'!B181+'2-Manager'!B181+'3-Manager'!B181+'4-Manager'!B181+'5-Manager'!B181","v":308},{"$f":"'1-Manager'!C181+'2-Manager'!C181+'3-Manager'!C181+'4-Manager'!C181+'5-Manager'!C181","v":146},{"$f":"'1-Manager'!D181+'2-Manager'!D181+'3-Manager'!D181+'4-Manager'!D181+'5-Manager'!D181","v":254},{"$f":"'1-Manager'!E181+'2-Manager'!E181+'3-Manager'!E181+'4-Manager'!E181+'5-Manager'!E181","v":158},866,null,6,6]
["2020-06-28",{"$f":"'1-Manager'!B182+'2-Manager'!B182+'3-Manager'!B182+'4-Manager'!B182+'5-Manager'!B182","v":86},{"$f":"'1-Manager'!C182+'2-Manager'!C182+'3-Manager'!C182+'4-Manager'!C182+'5-Manager'!C182","v":37},{"$f":"'1-Manager'!D182+'2-Manager'!D182+'3-Manager'!D182+'4-Manager'!D182+'5-Manager'!D182","v":112},{"$f":"'1-Manager'!E182+'2-Manager'!E182+'3-Manager'!E182+'4-Manager'!E182+'5-Manager'!E182","v":44},279,null,7,6]
["2020-06-29",{"$f":"'1-Manager'!B183+'2-Manager'!B183+'3-Manager'!B183+'4-Manager'!B183+'5-Manager'!B183","v":160},{"$f":"'1-Manager'!C183+'2-Manager'!C183+'3-Manager'!C183+'4-Manager'!C183+'5-Manager'!C183","v":202},{"$f":"'1-Manager'!D183+'2-Manager'!D183+'3-Manager'!D183+'4-Manager'!D183+'5-Manager'!D183","v":240},{"$f":"'1-Manager'!E183+'2-Manager'!E183+'3-Manager'!E183+'4-Manager'!E183+'5-Manager'!E183","v":169},771,null,1,6]
["2020-06-30",{"$f":"'1-Manager'!B184+'2-Manager'!B184+'3-Manager'!B184+'4-Manager'!B184+'5-Manager'!B184","v":220},{"$f":"'1-Manager'!C184+'2-Manager'!C184+'3-Manager'!C184+'4-Manager'!C184+'5-Manager'!C184","v":178},{"$f":"'1-Manager'!D184+'2-Manager'!D184+'3-Manager'!D184+'4-Manager'!D184+'5-Manager'!D184","v":237},{"$f":"'1-Manager'!E184+'2-Manager'!E184+'3-Manager'!E184+'4-Manager'!E184+'5-Manager'!E184","v":165},800,null,2,6]
["2020-07-01",{"$f":"'1-Manager'!B185+'2-Manager'!B185+'3-Manager'!B185+'4-Manager'!B185+'5-Manager'!B185","v":204},{"$f":"'1-Manager'!C185+'2-Manager'!C185+'3-Manager'!C185+'4-Manager'!C185+'5-Manager'!C185","v":226},{"$f":"'1-Manager'!D185+'2-Manager'!D185+'3-Manager'!D185+'4-Manager'!D185+'5-Manager'!D185","v":257},{"$f":"'1-Manager'!E185+'2-Manager'!E185+'3-Manager'!E185+'4-Manager'!E185+'5-Manager'!E185","v":169},856,null,3,7]
["2020-07-02",{"$f":"'1-Manager'!B186+'2-Manager'!B186+'3-Manager'!B186+'4-Manager'!B186+'5-Manager'!B186","v":254},{"$f":"'1-Manager'!C186+'2-Manager'!C186+'3-Manager'!C186+'4-Manager'!C186+'5-Manager'!C186","v":180},{"$f":"'1-Manager'!D186+'2-Manager'!D186+'3-Manager'!D186+'4-Manager'!D186+'5-Manager'!D186","v":320},{"$f":"'1-Manager'!E186+'2-Manager'!E186+'3-Manager'!E186+'4-Manager'!E186+'5-Manager'!E186","v":132},886,null,4,7]
["2020-07-03",{"$f":"'1-Manager'!B187+'2-Manager'!B187+'3-Manager'!B187+'4-Manager'!B187+'5-Manager'!B187","v":313},{"$f":"'1-Manager'!C187+'2-Manager'!C187+'3-Manager'!C187+'4-Manager'!C187+'5-Manager'!C187","v":193},{"$f":"'1-Manager'!D187+'2-Manager'!D187+'3-Manager'!D187+'4-Manager'!D187+'5-Manager'!D187","v":239},{"$f":"'1-Manager'!E187+'2-Manager'!E187+'3-Manager'!E187+'4-Manager'!E187+'5-Manager'!E187","v":188},933,null,5,7]
["2020-07-04",{"$f":"'1-Manager'!B188+'2-Manager'!B188+'3-Manager'!B188+'4-Manager'!B188+'5-Manager'!B188","v":241},{"$f":"'1-Manager'!C188+'2-Manager'!C188+'3-Manager'!C188+'4-Manager'!C188+'5-Manager'!C188","v":183},{"$f":"'1-Manager'!D188+'2-Manager'!D188+'3-Manager'!D188+'4-Manager'!D188+'5-Manager'!D188","v":394},{"$f":"'1-Manager'!E188+'2-Manager'!E188+'3-Manager'!E188+'4-Manager'!E188+'5-Manager'!E188","v":152},970,null,6,7]
["2020-07-05",{"$f":"'1-Manager'!B189+'2-Manager'!B189+'3-Manager'!B189+'4-Manager'!B189+'5-Manager'!B189","v":73},{"$f":"'1-Manager'!C189+'2-Manager'!C189+'3-Manager'!C189+'4-Manager'!C189+'5-Manager'!C189","v":61},{"$f":"'1-Manager'!D189+'2-Manager'!D189+'3-Manager'!D189+'4-Manager'!D189+'5-Manager'!D189","v":117},{"$f":"'1-Manager'!E189+'2-Manager'!E189+'3-Manager'!E189+'4-Manager'!E189+'5-Manager'!E189","v":28},279,null,7,7]
["2020-07-06",{"$f":"'1-Manager'!B190+'2-Manager'!B190+'3-Manager'!B190+'4-Manager'!B190+'5-Manager'!B190","v":213},{"$f":"'1-Manager'!C190+'2-Manager'!C190+'3-Manager'!C190+'4-Manager'!C190+'5-Manager'!C190","v":151},{"$f":"'1-Manager'!D190+'2-Manager'!D190+'3-Manager'!D190+'4-Manager'!D190+'5-Manager'!D190","v":125},{"$f":"'1-Manager'!E190+'2-Manager'!E190+'3-Manager'!E190+'4-Manager'!E190+'5-Manager'!E190","v":183},672,null,1,7]
["2020-07-07",{"$f":"'1-Manager'!B191+'2-Manager'!B191+'3-Manager'!B191+'4-Manager'!B191+'5-Manager'!B191","v":207},{"$f":"'1-Manager'!C191+'2-Manager'!C191+'3-Manager'!C191+'4-Manager'!C191+'5-Manager'!C191","v":162},{"$f":"'1-Manager'!D191+'2-Manager'!D191+'3-Manager'!D191+'4-Manager'!D191+'5-Manager'!D191","v":199},{"$f":"'1-Manager'!E191+'2-Manager'!E191+'3-Manager'!E191+'4-Manager'!E191+'5-Manager'!E191","v":119},687,null,2,7]
["2020-07-08",{"$f":"'1-Manager'!B192+'2-Manager'!B192+'3-Manager'!B192+'4-Manager'!B192+'5-Manager'!B192","v":163},{"$f":"'1-Manager'!C192+'2-Manager'!C192+'3-Manager'!C192+'4-Manager'!C192+'5-Manager'!C192","v":141},{"$f":"'1-Manager'!D192+'2-Manager'!D192+'3-Manager'!D192+'4-Manager'!D192+'5-Manager'!D192","v":243},{"$f":"'1-Manager'!E192+'2-Manager'!E192+'3-Manager'!E192+'4-Manager'!E192+'5-Manager'!E192","v":147},694,null,3,7]
["2020-07-09",{"$f":"'1-Manager'!B193+'2-Manager'!B193+'3-Manager'!B193+'4-Manager'!B193+'5-Manager'!B193","v":140},{"$f":"'1-Manager'!C193+'2-Manager'!C193+'3-Manager'!C193+'4-Manager'!C193+'5-Manager'!C193","v":127},{"$f":"'1-Manager'!D193+'2-Manager'!D193+'3-Manager'!D193+'4-Manager'!D193+'5-Manager'!D193","v":256},{"$f":"'1-Manager'!E193+'2-Manager'!E193+'3-Manager'!E193+'4-Manager'!E193+'5-Manager'!E193","v":191},714,null,4,7]
["2020-07-10",{"$f":"'1-Manager'!B194+'2-Manager'!B194+'3-Manager'!B194+'4-Manager'!B194+'5-Manager'!B194","v":214},{"$f":"'1-Manager'!C194+'2-Manager'!C194+'3-Manager'!C194+'4-Manager'!C194+'5-Manager'!C194","v":171},{"$f":"'1-Manager'!D194+'2-Manager'!D194+'3-Manager'!D194+'4-Manager'!D194+'5-Manager'!D194","v":306},{"$f":"'1-Manager'!E194+'2-Manager'!E194+'3-Manager'!E194+'4-Manager'!E194+'5-Manager'!E194","v":117},808,null,5,7]
["2020-07-11",{"$f":"'1-Manager'!B195+'2-Manager'!B195+'3-Manager'!B195+'4-Manager'!B195+'5-Manager'!B195","v":224},{"$f":"'1-Manager'!C195+'2-Manager'!C195+'3-Manager'!C195+'4-Manager'!C195+'5-Manager'!C195","v":212},{"$f":"'1-Manager'!D195+'2-Manager'!D195+'3-Manager'!D195+'4-Manager'!D195+'5-Manager'!D195","v":368},{"$f":"'1-Manager'!E195+'2-Manager'!E195+'3-Manager'!E195+'4-Manager'!E195+'5-Manager'!E195","v":128},932,null,6,7]
["2020-07-12",{"$f":"'1-Manager'!B196+'2-Manager'!B196+'3-Manager'!B196+'4-Manager'!B196+'5-Manager'!B196","v":113},{"$f":"'1-Manager'!C196+'2-Manager'!C196+'3-Manager'!C196+'4-Manager'!C196+'5-Manager'!C196","v":44},{"$f":"'1-Manager'!D196+'2-Manager'!D196+'3-Manager'!D196+'4-Manager'!D196+'5-Manager'!D196","v":98},{"$f":"'1-Manager'!E196+'2-Manager'!E196+'3-Manager'!E196+'4-Manager'!E196+'5-Manager'!E196","v":65},{"$f":"SUM(B196:E196)","v":320},null,{"$f":"WEEKDAY(A196,2)","v":7},{"$f":"MONTH(A196)","v":7}]
["2020-07-13",{"$f":"'1-Manager'!B197+'2-Manager'!B197+'3-Manager'!B197+'4-Manager'!B197+'5-Manager'!B197","v":224},{"$f":"'1-Manager'!C197+'2-Manager'!C197+'3-Manager'!C197+'4-Manager'!C197+'5-Manager'!C197","v":191},{"$f":"'1-Manager'!D197+'2-Manager'!D197+'3-Manager'!D197+'4-Manager'!D197+'5-Manager'!D197","v":175},{"$f":"'1-Manager'!E197+'2-Manager'!E197+'3-Manager'!E197+'4-Manager'!E197+'5-Manager'!E197","v":117},707,null,1,7]
["2020-07-14",{"$f":"'1-Manager'!B198+'2-Manager'!B198+'3-Manager'!B198+'4-Manager'!B198+'5-Manager'!B198","v":315},{"$f":"'1-Manager'!C198+'2-Manager'!C198+'3-Manager'!C198+'4-Manager'!C198+'5-Manager'!C198","v":171},{"$f":"'1-Manager'!D198+'2-Manager'!D198+'3-Manager'!D198+'4-Manager'!D198+'5-Manager'!D198","v":185},{"$f":"'1-Manager'!E198+'2-Manager'!E198+'3-Manager'!E198+'4-Manager'!E198+'5-Manager'!E198","v":84},755,null,2,7]
["2020-07-15",{"$f":"'1-Manager'!B199+'2-Manager'!B199+'3-Manager'!B199+'4-Manager'!B199+'5-Manager'!B199","v":224},{"$f":"'1-Manager'!C199+'2-Manager'!C199+'3-Manager'!C199+'4-Manager'!C199+'5-Manager'!C199","v":121},{"$f":"'1-Manager'!D199+'2-Manager'!D199+'3-Manager'!D199+'4-Manager'!D199+'5-Manager'!D199","v":370},{"$f":"'1-Manager'!E199+'2-Manager'!E199+'3-Manager'!E199+'4-Manager'!E199+'5-Manager'!E199","v":163},878,null,3,7]
["2020-07-16",{"$f":"'1-Manager'!B200+'2-Manager'!B200+'3-Manager'!B200+'4-Manager'!B200+'5-Manager'!B200","v":220},{"$f":"'1-Manager'!C200+'2-Manager'!C200+'3-Manager'!C200+'4-Manager'!C200+'5-Manager'!C200","v":216},{"$f":"'1-Manager'!D200+'2-Manager'!D200+'3-Manager'!D200+'4-Manager'!D200+'5-Manager'!D200","v":161},{"$f":"'1-Manager'!E200+'2-Manager'!E200+'3-Manager'!E200+'4-Manager'!E200+'5-Manager'!E200","v":189},786,null,4,7]
["2020-07-17",{"$f":"'1-Manager'!B201+'2-Manager'!B201+'3-Manager'!B201+'4-Manager'!B201+'5-Manager'!B201","v":135},{"$f":"'1-Manager'!C201+'2-Manager'!C201+'3-Manager'!C201+'4-Manager'!C201+'5-Manager'!C201","v":153},{"$f":"'1-Manager'!D201+'2-Manager'!D201+'3-Manager'!D201+'4-Manager'!D201+'5-Manager'!D201","v":345},{"$f":"'1-Manager'!E201+'2-Manager'!E201+'3-Manager'!E201+'4-Manager'!E201+'5-Manager'!E201","v":160},793,null,5,7]
["2020-07-18",{"$f":"'1-Manager'!B202+'2-Manager'!B202+'3-Manager'!B202+'4-Manager'!B202+'5-Manager'!B202","v":308},{"$f":"'1-Manager'!C202+'2-Manager'!C202+'3-Manager'!C202+'4-Manager'!C202+'5-Manager'!C202","v":163},{"$f":"'1-Manager'!D202+'2-Manager'!D202+'3-Manager'!D202+'4-Manager'!D202+'5-Manager'!D202","v":213},{"$f":"'1-Manager'!E202+'2-Manager'!E202+'3-Manager'!E202+'4-Manager'!E202+'5-Manager'!E202","v":103},787,null,6,7]
["2020-07-19",{"$f":"'1-Manager'!B203+'2-Manager'!B203+'3-Manager'!B203+'4-Manager'!B203+'5-Manager'!B203","v":100},{"$f":"'1-Manager'!C203+'2-Manager'!C203+'3-Manager'!C203+'4-Manager'!C203+'5-Manager'!C203","v":35},{"$f":"'1-Manager'!D203+'2-Manager'!D203+'3-Manager'!D203+'4-Manager'!D203+'5-Manager'!D203","v":107},{"$f":"'1-Manager'!E203+'2-Manager'!E203+'3-Manager'!E203+'4-Manager'!E203+'5-Manager'!E203","v":53},295,null,7,7]
["2020-07-20",{"$f":"'1-Manager'!B204+'2-Manager'!B204+'3-Manager'!B204+'4-Manager'!B204+'5-Manager'!B204","v":217},{"$f":"'1-Manager'!C204+'2-Manager'!C204+'3-Manager'!C204+'4-Manager'!C204+'5-Manager'!C204","v":144},{"$f":"'1-Manager'!D204+'2-Manager'!D204+'3-Manager'!D204+'4-Manager'!D204+'5-Manager'!D204","v":289},{"$f":"'1-Manager'!E204+'2-Manager'!E204+'3-Manager'!E204+'4-Manager'!E204+'5-Manager'!E204","v":170},820,null,1,7]
["2020-07-21",{"$f":"'1-Manager'!B205+'2-Manager'!B205+'3-Manager'!B205+'4-Manager'!B205+'5-Manager'!B205","v":293},{"$f":"'1-Manager'!C205+'2-Manager'!C205+'3-Manager'!C205+'4-Manager'!C205+'5-Manager'!C205","v":119},{"$f":"'1-Manager'!D205+'2-Manager'!D205+'3-Manager'!D205+'4-Manager'!D205+'5-Manager'!D205","v":355},{"$f":"'1-Manager'!E205+'2-Manager'!E205+'3-Manager'!E205+'4-Manager'!E205+'5-Manager'!E205","v":171},938,null,2,7]
["2020-07-22",{"$f":"'1-Manager'!B206+'2-Manager'!B206+'3-Manager'!B206+'4-Manager'!B206+'5-Manager'!B206","v":234},{"$f":"'1-Manager'!C206+'2-Manager'!C206+'3-Manager'!C206+'4-Manager'!C206+'5-Manager'!C206","v":120},{"$f":"'1-Manager'!D206+'2-Manager'!D206+'3-Manager'!D206+'4-Manager'!D206+'5-Manager'!D206","v":328},{"$f":"'1-Manager'!E206+'2-Manager'!E206+'3-Manager'!E206+'4-Manager'!E206+'5-Manager'!E206","v":96},778,null,3,7]
["2020-07-23",{"$f":"'1-Manager'!B207+'2-Manager'!B207+'3-Manager'!B207+'4-Manager'!B207+'5-Manager'!B207","v":323},{"$f":"'1-Manager'!C207+'2-Manager'!C207+'3-Manager'!C207+'4-Manager'!C207+'5-Manager'!C207","v":202},{"$f":"'1-Manager'!D207+'2-Manager'!D207+'3-Manager'!D207+'4-Manager'!D207+'5-Manager'!D207","v":181},{"$f":"'1-Manager'!E207+'2-Manager'!E207+'3-Manager'!E207+'4-Manager'!E207+'5-Manager'!E207","v":115},821,null,4,7]
["2020-07-24",{"$f":"'1-Manager'!B208+'2-Manager'!B208+'3-Manager'!B208+'4-Manager'!B208+'5-Manager'!B208","v":290},{"$f":"'1-Manager'!C208+'2-Manager'!C208+'3-Manager'!C208+'4-Manager'!C208+'5-Manager'!C208","v":190},{"$f":"'1-Manager'!D208+'2-Manager'!D208+'3-Manager'!D208+'4-Manager'!D208+'5-Manager'!D208","v":328},{"$f":"'1-Manager'!E208+'2-Manager'!E208+'3-Manager'!E208+'4-Manager'!E208+'5-Manager'!E208","v":216},1024,null,5,7]
["2020-07-25",{"$f":"'1-Manager'!B209+'2-Manager'!B209+'3-Manager'!B209+'4-Manager'!B209+'5-Manager'!B209","v":261},{"$f":"'1-Manager'!C209+'2-Manager'!C209+'3-Manager'!C209+'4-Manager'!C209+'5-Manager'!C209","v":88},{"$f":"'1-Manager'!D209+'2-Manager'!D209+'3-Manager'!D209+'4-Manager'!D209+'5-Manager'!D209","v":345},{"$f":"'1-Manager'!E209+'2-Manager'!E209+'3-Manager'!E209+'4-Manager'!E209+'5-Manager'!E209","v":101},795,null,6,7]
["2020-07-26",{"$f":"'1-Manager'!B210+'2-Manager'!B210+'3-Manager'!B210+'4-Manager'!B210+'5-Manager'!B210","v":77},{"$f":"'1-Manager'!C210+'2-Manager'!C210+'3-Manager'!C210+'4-Manager'!C210+'5-Manager'!C210","v":53},{"$f":"'1-Manager'!D210+'2-Manager'!D210+'3-Manager'!D210+'4-Manager'!D210+'5-Manager'!D210","v":64},{"$f":"'1-Manager'!E210+'2-Manager'!E210+'3-Manager'!E210+'4-Manager'!E210+'5-Manager'!E210","v":63},257,null,7,7]
["2020-07-27",{"$f":"'1-Manager'!B211+'2-Manager'!B211+'3-Manager'!B211+'4-Manager'!B211+'5-Manager'!B211","v":132},{"$f":"'1-Manager'!C211+'2-Manager'!C211+'3-Manager'!C211+'4-Manager'!C211+'5-Manager'!C211","v":162},{"$f":"'1-Manager'!D211+'2-Manager'!D211+'3-Manager'!D211+'4-Manager'!D211+'5-Manager'!D211","v":220},{"$f":"'1-Manager'!E211+'2-Manager'!E211+'3-Manager'!E211+'4-Manager'!E211+'5-Manager'!E211","v":171},685,null,1,7]
["2020-07-28",{"$f":"'1-Manager'!B212+'2-Manager'!B212+'3-Manager'!B212+'4-Manager'!B212+'5-Manager'!B212","v":371},{"$f":"'1-Manager'!C212+'2-Manager'!C212+'3-Manager'!C212+'4-Manager'!C212+'5-Manager'!C212","v":154},{"$f":"'1-Manager'!D212+'2-Manager'!D212+'3-Manager'!D212+'4-Manager'!D212+'5-Manager'!D212","v":216},{"$f":"'1-Manager'!E212+'2-Manager'!E212+'3-Manager'!E212+'4-Manager'!E212+'5-Manager'!E212","v":99},840,null,2,7]
["2020-07-29",{"$f":"'1-Manager'!B213+'2-Manager'!B213+'3-Manager'!B213+'4-Manager'!B213+'5-Manager'!B213","v":256},{"$f":"'1-Manager'!C213+'2-Manager'!C213+'3-Manager'!C213+'4-Manager'!C213+'5-Manager'!C213","v":149},{"$f":"'1-Manager'!D213+'2-Manager'!D213+'3-Manager'!D213+'4-Manager'!D213+'5-Manager'!D213","v":265},{"$f":"'1-Manager'!E213+'2-Manager'!E213+'3-Manager'!E213+'4-Manager'!E213+'5-Manager'!E213","v":134},804,null,3,7]
["2020-07-30",{"$f":"'1-Manager'!B214+'2-Manager'!B214+'3-Manager'!B214+'4-Manager'!B214+'5-Manager'!B214","v":257},{"$f":"'1-Manager'!C214+'2-Manager'!C214+'3-Manager'!C214+'4-Manager'!C214+'5-Manager'!C214","v":128},{"$f":"'1-Manager'!D214+'2-Manager'!D214+'3-Manager'!D214+'4-Manager'!D214+'5-Manager'!D214","v":208},{"$f":"'1-Manager'!E214+'2-Manager'!E214+'3-Manager'!E214+'4-Manager'!E214+'5-Manager'!E214","v":116},709,null,4,7]
["2020-07-31",{"$f":"'1-Manager'!B215+'2-Manager'!B215+'3-Manager'!B215+'4-Manager'!B215+'5-Manager'!B215","v":278},{"$f":"'1-Manager'!C215+'2-Manager'!C215+'3-Manager'!C215+'4-Manager'!C215+'5-Manager'!C215","v":181},{"$f":"'1-Manager'!D215+'2-Manager'!D215+'3-Manager'!D215+'4-Manager'!D215+'5-Manager'!D215","v":301},{"$f":"'1-Manager'!E215+'2-Manager'!E215+'3-Manager'!E215+'4-Manager'!E215+'5-Manager'!E215","v":203},963,null,5,7]
["2020-08-01",{"$f":"'1-Manager'!B216+'2-Manager'!B216+'3-Manager'!B216+'4-Manager'!B216+'5-Manager'!B216","v":213},{"$f":"'1-Manager'!C216+'2-Manager'!C216+'3-Manager'!C216+'4-Manager'!C216+'5-Manager'!C216","v":167},{"$f":"'1-Manager'!D216+'2-Manager'!D216+'3-Manager'!D216+'4-Manager'!D216+'5-Manager'!D216","v":244},{"$f":"'1-Manager'!E216+'2-Manager'!E216+'3-Manager'!E216+'4-Manager'!E216+'5-Manager'!E216","v":139},763,null,6,8]
["2020-08-02",{"$f":"'1-Manager'!B217+'2-Manager'!B217+'3-Manager'!B217+'4-Manager'!B217+'5-Manager'!B217","v":141},{"$f":"'1-Manager'!C217+'2-Manager'!C217+'3-Manager'!C217+'4-Manager'!C217+'5-Manager'!C217","v":72},{"$f":"'1-Manager'!D217+'2-Manager'!D217+'3-Manager'!D217+'4-Manager'!D217+'5-Manager'!D217","v":95},{"$f":"'1-Manager'!E217+'2-Manager'!E217+'3-Manager'!E217+'4-Manager'!E217+'5-Manager'!E217","v":55},363,null,7,8]
["2020-08-03",{"$f":"'1-Manager'!B218+'2-Manager'!B218+'3-Manager'!B218+'4-Manager'!B218+'5-Manager'!B218","v":327},{"$f":"'1-Manager'!C218+'2-Manager'!C218+'3-Manager'!C218+'4-Manager'!C218+'5-Manager'!C218","v":180},{"$f":"'1-Manager'!D218+'2-Manager'!D218+'3-Manager'!D218+'4-Manager'!D218+'5-Manager'!D218","v":184},{"$f":"'1-Manager'!E218+'2-Manager'!E218+'3-Manager'!E218+'4-Manager'!E218+'5-Manager'!E218","v":155},846,null,1,8]
["2020-08-04",{"$f":"'1-Manager'!B219+'2-Manager'!B219+'3-Manager'!B219+'4-Manager'!B219+'5-Manager'!B219","v":257},{"$f":"'1-Manager'!C219+'2-Manager'!C219+'3-Manager'!C219+'4-Manager'!C219+'5-Manager'!C219","v":199},{"$f":"'1-Manager'!D219+'2-Manager'!D219+'3-Manager'!D219+'4-Manager'!D219+'5-Manager'!D219","v":155},{"$f":"'1-Manager'!E219+'2-Manager'!E219+'3-Manager'!E219+'4-Manager'!E219+'5-Manager'!E219","v":140},751,null,2,8]
["2020-08-05",{"$f":"'1-Manager'!B220+'2-Manager'!B220+'3-Manager'!B220+'4-Manager'!B220+'5-Manager'!B220","v":130},{"$f":"'1-Manager'!C220+'2-Manager'!C220+'3-Manager'!C220+'4-Manager'!C220+'5-Manager'!C220","v":130},{"$f":"'1-Manager'!D220+'2-Manager'!D220+'3-Manager'!D220+'4-Manager'!D220+'5-Manager'!D220","v":258},{"$f":"'1-Manager'!E220+'2-Manager'!E220+'3-Manager'!E220+'4-Manager'!E220+'5-Manager'!E220","v":126},644,null,3,8]
["2020-08-06",{"$f":"'1-Manager'!B221+'2-Manager'!B221+'3-Manager'!B221+'4-Manager'!B221+'5-Manager'!B221","v":163},{"$f":"'1-Manager'!C221+'2-Manager'!C221+'3-Manager'!C221+'4-Manager'!C221+'5-Manager'!C221","v":89},{"$f":"'1-Manager'!D221+'2-Manager'!D221+'3-Manager'!D221+'4-Manager'!D221+'5-Manager'!D221","v":315},{"$f":"'1-Manager'!E221+'2-Manager'!E221+'3-Manager'!E221+'4-Manager'!E221+'5-Manager'!E221","v":121},688,null,4,8]
["2020-08-07",{"$f":"'1-Manager'!B222+'2-Manager'!B222+'3-Manager'!B222+'4-Manager'!B222+'5-Manager'!B222","v":184},{"$f":"'1-Manager'!C222+'2-Manager'!C222+'3-Manager'!C222+'4-Manager'!C222+'5-Manager'!C222","v":183},{"$f":"'1-Manager'!D222+'2-Manager'!D222+'3-Manager'!D222+'4-Manager'!D222+'5-Manager'!D222","v":251},{"$f":"'1-Manager'!E222+'2-Manager'!E222+'3-Manager'!E222+'4-Manager'!E222+'5-Manager'!E222","v":199},817,null,5,8]
["2020-08-08",{"$f":"'1-Manager'!B223+'2-Manager'!B223+'3-Manager'!B223+'4-Manager'!B223+'5-Manager'!B223","v":328},{"$f":"'1-Manager'!C223+'2-Manager'!C223+'3-Manager'!C223+'4-Manager'!C223+'5-Manager'!C223","v":200},{"$f":"'1-Manager'!D223+'2-Manager'!D223+'3-Manager'!D223+'4-Manager'!D223+'5-Manager'!D223","v":311},{"$f":"'1-Manager'!E223+'2-Manager'!E223+'3-Manager'!E223+'4-Manager'!E223+'5-Manager'!E223","v":112},951,null,6,8]
["2020-08-09",{"$f":"'1-Manager'!B224+'2-Manager'!B224+'3-Manager'!B224+'4-Manager'!B224+'5-Manager'!B224","v":93},{"$f":"'1-Manager'!C224+'2-Manager'!C224+'3-Manager'!C224+'4-Manager'!C224+'5-Manager'!C224","v":44},{"$f":"'1-Manager'!D224+'2-Manager'!D224+'3-Manager'!D224+'4-Manager'!D224+'5-Manager'!D224","v":101},{"$f":"'1-Manager'!E224+'2-Manager'!E224+'3-Manager'!E224+'4-Manager'!E224+'5-Manager'!E224","v":58},296,null,7,8]
["2020-08-10",{"$f":"'1-Manager'!B225+'2-Manager'!B225+'3-Manager'!B225+'4-Manager'!B225+'5-Manager'!B225","v":274},{"$f":"'1-Manager'!C225+'2-Manager'!C225+'3-Manager'!C225+'4-Manager'!C225+'5-Manager'!C225","v":151},{"$f":"'1-Manager'!D225+'2-Manager'!D225+'3-Manager'!D225+'4-Manager'!D225+'5-Manager'!D225","v":160},{"$f":"'1-Manager'!E225+'2-Manager'!E225+'3-Manager'!E225+'4-Manager'!E225+'5-Manager'!E225","v":187},772,null,1,8]
["2020-08-11",{"$f":"'1-Manager'!B226+'2-Manager'!B226+'3-Manager'!B226+'4-Manager'!B226+'5-Manager'!B226","v":182},{"$f":"'1-Manager'!C226+'2-Manager'!C226+'3-Manager'!C226+'4-Manager'!C226+'5-Manager'!C226","v":155},{"$f":"'1-Manager'!D226+'2-Manager'!D226+'3-Manager'!D226+'4-Manager'!D226+'5-Manager'!D226","v":256},{"$f":"'1-Manager'!E226+'2-Manager'!E226+'3-Manager'!E226+'4-Manager'!E226+'5-Manager'!E226","v":176},769,null,2,8]
["2020-08-12",{"$f":"'1-Manager'!B227+'2-Manager'!B227+'3-Manager'!B227+'4-Manager'!B227+'5-Manager'!B227","v":236},{"$f":"'1-Manager'!C227+'2-Manager'!C227+'3-Manager'!C227+'4-Manager'!C227+'5-Manager'!C227","v":205},{"$f":"'1-Manager'!D227+'2-Manager'!D227+'3-Manager'!D227+'4-Manager'!D227+'5-Manager'!D227","v":200},{"$f":"'1-Manager'!E227+'2-Manager'!E227+'3-Manager'!E227+'4-Manager'!E227+'5-Manager'!E227","v":151},792,null,3,8]
["2020-08-13",{"$f":"'1-Manager'!B228+'2-Manager'!B228+'3-Manager'!B228+'4-Manager'!B228+'5-Manager'!B228","v":325},{"$f":"'1-Manager'!C228+'2-Manager'!C228+'3-Manager'!C228+'4-Manager'!C228+'5-Manager'!C228","v":208},{"$f":"'1-Manager'!D228+'2-Manager'!D228+'3-Manager'!D228+'4-Manager'!D228+'5-Manager'!D228","v":256},{"$f":"'1-Manager'!E228+'2-Manager'!E228+'3-Manager'!E228+'4-Manager'!E228+'5-Manager'!E228","v":168},957,null,4,8]
["2020-08-14",{"$f":"'1-Manager'!B229+'2-Manager'!B229+'3-Manager'!B229+'4-Manager'!B229+'5-Manager'!B229","v":306},{"$f":"'1-Manager'!C229+'2-Manager'!C229+'3-Manager'!C229+'4-Manager'!C229+'5-Manager'!C229","v":215},{"$f":"'1-Manager'!D229+'2-Manager'!D229+'3-Manager'!D229+'4-Manager'!D229+'5-Manager'!D229","v":161},{"$f":"'1-Manager'!E229+'2-Manager'!E229+'3-Manager'!E229+'4-Manager'!E229+'5-Manager'!E229","v":186},868,null,5,8]
["2020-08-15",{"$f":"'1-Manager'!B230+'2-Manager'!B230+'3-Manager'!B230+'4-Manager'!B230+'5-Manager'!B230","v":161},{"$f":"'1-Manager'!C230+'2-Manager'!C230+'3-Manager'!C230+'4-Manager'!C230+'5-Manager'!C230","v":206},{"$f":"'1-Manager'!D230+'2-Manager'!D230+'3-Manager'!D230+'4-Manager'!D230+'5-Manager'!D230","v":322},{"$f":"'1-Manager'!E230+'2-Manager'!E230+'3-Manager'!E230+'4-Manager'!E230+'5-Manager'!E230","v":111},800,null,6,8]
["2020-08-16",{"$f":"'1-Manager'!B231+'2-Manager'!B231+'3-Manager'!B231+'4-Manager'!B231+'5-Manager'!B231","v":118},{"$f":"'1-Manager'!C231+'2-Manager'!C231+'3-Manager'!C231+'4-Manager'!C231+'5-Manager'!C231","v":53},{"$f":"'1-Manager'!D231+'2-Manager'!D231+'3-Manager'!D231+'4-Manager'!D231+'5-Manager'!D231","v":88},{"$f":"'1-Manager'!E231+'2-Manager'!E231+'3-Manager'!E231+'4-Manager'!E231+'5-Manager'!E231","v":42},301,null,7,8]
["2020-08-17",{"$f":"'1-Manager'!B232+'2-Manager'!B232+'3-Manager'!B232+'4-Manager'!B232+'5-Manager'!B232","v":167},{"$f":"'1-Manager'!C232+'2-Manager'!C232+'3-Manager'!C232+'4-Manager'!C232+'5-Manager'!C232","v":96},{"$f":"'1-Manager'!D232+'2-Manager'!D232+'3-Manager'!D232+'4-Manager'!D232+'5-Manager'!D232","v":241},{"$f":"'1-Manager'!E232+'2-Manager'!E232+'3-Manager'!E232+'4-Manager'!E232+'5-Manager'!E232","v":139},643,null,1,8]
["2020-08-18",{"$f":"'1-Manager'!B233+'2-Manager'!B233+'3-Manager'!B233+'4-Manager'!B233+'5-Manager'!B233","v":231},{"$f":"'1-Manager'!C233+'2-Manager'!C233+'3-Manager'!C233+'4-Manager'!C233+'5-Manager'!C233","v":176},{"$f":"'1-Manager'!D233+'2-Manager'!D233+'3-Manager'!D233+'4-Manager'!D233+'5-Manager'!D233","v":301},{"$f":"'1-Manager'!E233+'2-Manager'!E233+'3-Manager'!E233+'4-Manager'!E233+'5-Manager'!E233","v":108},816,null,2,8]
["2020-08-19",{"$f":"'1-Manager'!B234+'2-Manager'!B234+'3-Manager'!B234+'4-Manager'!B234+'5-Manager'!B234","v":174},{"$f":"'1-Manager'!C234+'2-Manager'!C234+'3-Manager'!C234+'4-Manager'!C234+'5-Manager'!C234","v":102},{"$f":"'1-Manager'!D234+'2-Manager'!D234+'3-Manager'!D234+'4-Manager'!D234+'5-Manager'!D234","v":203},{"$f":"'1-Manager'!E234+'2-Manager'!E234+'3-Manager'!E234+'4-Manager'!E234+'5-Manager'!E234","v":121},600,null,3,8]
["2020-08-20",{"$f":"'1-Manager'!B235+'2-Manager'!B235+'3-Manager'!B235+'4-Manager'!B235+'5-Manager'!B235","v":159},{"$f":"'1-Manager'!C235+'2-Manager'!C235+'3-Manager'!C235+'4-Manager'!C235+'5-Manager'!C235","v":135},{"$f":"'1-Manager'!D235+'2-Manager'!D235+'3-Manager'!D235+'4-Manager'!D235+'5-Manager'!D235","v":289},{"$f":"'1-Manager'!E235+'2-Manager'!E235+'3-Manager'!E235+'4-Manager'!E235+'5-Manager'!E235","v":122},705,null,4,8]
["2020-08-21",{"$f":"'1-Manager'!B236+'2-Manager'!B236+'3-Manager'!B236+'4-Manager'!B236+'5-Manager'!B236","v":294},{"$f":"'1-Manager'!C236+'2-Manager'!C236+'3-Manager'!C236+'4-Manager'!C236+'5-Manager'!C236","v":150},{"$f":"'1-Manager'!D236+'2-Manager'!D236+'3-Manager'!D236+'4-Manager'!D236+'5-Manager'!D236","v":272},{"$f":"'1-Manager'!E236+'2-Manager'!E236+'3-Manager'!E236+'4-Manager'!E236+'5-Manager'!E236","v":135},851,null,5,8]
["2020-08-22",{"$f":"'1-Manager'!B237+'2-Manager'!B237+'3-Manager'!B237+'4-Manager'!B237+'5-Manager'!B237","v":372},{"$f":"'1-Manager'!C237+'2-Manager'!C237+'3-Manager'!C237+'4-Manager'!C237+'5-Manager'!C237","v":101},{"$f":"'1-Manager'!D237+'2-Manager'!D237+'3-Manager'!D237+'4-Manager'!D237+'5-Manager'!D237","v":280},{"$f":"'1-Manager'!E237+'2-Manager'!E237+'3-Manager'!E237+'4-Manager'!E237+'5-Manager'!E237","v":158},911,null,6,8]
["2020-08-23",{"$f":"'1-Manager'!B238+'2-Manager'!B238+'3-Manager'!B238+'4-Manager'!B238+'5-Manager'!B238","v":99},{"$f":"'1-Manager'!C238+'2-Manager'!C238+'3-Manager'!C238+'4-Manager'!C238+'5-Manager'!C238","v":28},{"$f":"'1-Manager'!D238+'2-Manager'!D238+'3-Manager'!D238+'4-Manager'!D238+'5-Manager'!D238","v":96},{"$f":"'1-Manager'!E238+'2-Manager'!E238+'3-Manager'!E238+'4-Manager'!E238+'5-Manager'!E238","v":38},261,null,7,8]
["2020-08-24",{"$f":"'1-Manager'!B239+'2-Manager'!B239+'3-Manager'!B239+'4-Manager'!B239+'5-Manager'!B239","v":217},{"$f":"'1-Manager'!C239+'2-Manager'!C239+'3-Manager'!C239+'4-Manager'!C239+'5-Manager'!C239","v":104},{"$f":"'1-Manager'!D239+'2-Manager'!D239+'3-Manager'!D239+'4-Manager'!D239+'5-Manager'!D239","v":212},{"$f":"'1-Manager'!E239+'2-Manager'!E239+'3-Manager'!E239+'4-Manager'!E239+'5-Manager'!E239","v":189},722,null,1,8]
["2020-08-25",{"$f":"'1-Manager'!B240+'2-Manager'!B240+'3-Manager'!B240+'4-Manager'!B240+'5-Manager'!B240","v":300},{"$f":"'1-Manager'!C240+'2-Manager'!C240+'3-Manager'!C240+'4-Manager'!C240+'5-Manager'!C240","v":164},{"$f":"'1-Manager'!D240+'2-Manager'!D240+'3-Manager'!D240+'4-Manager'!D240+'5-Manager'!D240","v":206},{"$f":"'1-Manager'!E240+'2-Manager'!E240+'3-Manager'!E240+'4-Manager'!E240+'5-Manager'!E240","v":111},781,null,2,8]
["2020-08-26",{"$f":"'1-Manager'!B241+'2-Manager'!B241+'3-Manager'!B241+'4-Manager'!B241+'5-Manager'!B241","v":103},{"$f":"'1-Manager'!C241+'2-Manager'!C241+'3-Manager'!C241+'4-Manager'!C241+'5-Manager'!C241","v":83},{"$f":"'1-Manager'!D241+'2-Manager'!D241+'3-Manager'!D241+'4-Manager'!D241+'5-Manager'!D241","v":275},{"$f":"'1-Manager'!E241+'2-Manager'!E241+'3-Manager'!E241+'4-Manager'!E241+'5-Manager'!E241","v":191},652,null,3,8]
["2020-08-27",{"$f":"'1-Manager'!B242+'2-Manager'!B242+'3-Manager'!B242+'4-Manager'!B242+'5-Manager'!B242","v":298},{"$f":"'1-Manager'!C242+'2-Manager'!C242+'3-Manager'!C242+'4-Manager'!C242+'5-Manager'!C242","v":154},{"$f":"'1-Manager'!D242+'2-Manager'!D242+'3-Manager'!D242+'4-Manager'!D242+'5-Manager'!D242","v":223},{"$f":"'1-Manager'!E242+'2-Manager'!E242+'3-Manager'!E242+'4-Manager'!E242+'5-Manager'!E242","v":172},847,null,4,8]
["2020-08-28",{"$f":"'1-Manager'!B243+'2-Manager'!B243+'3-Manager'!B243+'4-Manager'!B243+'5-Manager'!B243","v":214},{"$f":"'1-Manager'!C243+'2-Manager'!C243+'3-Manager'!C243+'4-Manager'!C243+'5-Manager'!C243","v":102},{"$f":"'1-Manager'!D243+'2-Manager'!D243+'3-Manager'!D243+'4-Manager'!D243+'5-Manager'!D243","v":303},{"$f":"'1-Manager'!E243+'2-Manager'!E243+'3-Manager'!E243+'4-Manager'!E243+'5-Manager'!E243","v":108},727,null,5,8]
["2020-08-29",{"$f":"'1-Manager'!B244+'2-Manager'!B244+'3-Manager'!B244+'4-Manager'!B244+'5-Manager'!B244","v":143},{"$f":"'1-Manager'!C244+'2-Manager'!C244+'3-Manager'!C244+'4-Manager'!C244+'5-Manager'!C244","v":144},{"$f":"'1-Manager'!D244+'2-Manager'!D244+'3-Manager'!D244+'4-Manager'!D244+'5-Manager'!D244","v":240},{"$f":"'1-Manager'!E244+'2-Manager'!E244+'3-Manager'!E244+'4-Manager'!E244+'5-Manager'!E244","v":99},626,null,6,8]
["2020-08-30",{"$f":"'1-Manager'!B245+'2-Manager'!B245+'3-Manager'!B245+'4-Manager'!B245+'5-Manager'!B245","v":110},{"$f":"'1-Manager'!C245+'2-Manager'!C245+'3-Manager'!C245+'4-Manager'!C245+'5-Manager'!C245","v":38},{"$f":"'1-Manager'!D245+'2-Manager'!D245+'3-Manager'!D245+'4-Manager'!D245+'5-Manager'!D245","v":61},{"$f":"'1-Manager'!E245+'2-Manager'!E245+'3-Manager'!E245+'4-Manager'!E245+'5-Manager'!E245","v":53},262,null,7,8]
["2020-08-31",{"$f":"'1-Manager'!B246+'2-Manager'!B246+'3-Manager'!B246+'4-Manager'!B246+'5-Manager'!B246","v":264},{"$f":"'1-Manager'!C246+'2-Manager'!C246+'3-Manager'!C246+'4-Manager'!C246+'5-Manager'!C246","v":110},{"$f":"'1-Manager'!D246+'2-Manager'!D246+'3-Manager'!D246+'4-Manager'!D246+'5-Manager'!D246","v":201},{"$f":"'1-Manager'!E246+'2-Manager'!E246+'3-Manager'!E246+'4-Manager'!E246+'5-Manager'!E246","v":186},761,null,1,8]
["2020-09-01",{"$f":"'1-Manager'!B247+'2-Manager'!B247+'3-Manager'!B247+'4-Manager'!B247+'5-Manager'!B247","v":147},{"$f":"'1-Manager'!C247+'2-Manager'!C247+'3-Manager'!C247+'4-Manager'!C247+'5-Manager'!C247","v":151},{"$f":"'1-Manager'!D247+'2-Manager'!D247+'3-Manager'!D247+'4-Manager'!D247+'5-Manager'!D247","v":270},{"$f":"'1-Manager'!E247+'2-Manager'!E247+'3-Manager'!E247+'4-Manager'!E247+'5-Manager'!E247","v":117},685,null,2,9]
["2020-09-02",{"$f":"'1-Manager'!B248+'2-Manager'!B248+'3-Manager'!B248+'4-Manager'!B248+'5-Manager'!B248","v":280},{"$f":"'1-Manager'!C248+'2-Manager'!C248+'3-Manager'!C248+'4-Manager'!C248+'5-Manager'!C248","v":83},{"$f":"'1-Manager'!D248+'2-Manager'!D248+'3-Manager'!D248+'4-Manager'!D248+'5-Manager'!D248","v":286},{"$f":"'1-Manager'!E248+'2-Manager'!E248+'3-Manager'!E248+'4-Manager'!E248+'5-Manager'!E248","v":105},754,null,3,9]
["2020-09-03",{"$f":"'1-Manager'!B249+'2-Manager'!B249+'3-Manager'!B249+'4-Manager'!B249+'5-Manager'!B249","v":281},{"$f":"'1-Manager'!C249+'2-Manager'!C249+'3-Manager'!C249+'4-Manager'!C249+'5-Manager'!C249","v":252},{"$f":"'1-Manager'!D249+'2-Manager'!D249+'3-Manager'!D249+'4-Manager'!D249+'5-Manager'!D249","v":266},{"$f":"'1-Manager'!E249+'2-Manager'!E249+'3-Manager'!E249+'4-Manager'!E249+'5-Manager'!E249","v":142},941,null,4,9]
["2020-09-04",{"$f":"'1-Manager'!B250+'2-Manager'!B250+'3-Manager'!B250+'4-Manager'!B250+'5-Manager'!B250","v":402},{"$f":"'1-Manager'!C250+'2-Manager'!C250+'3-Manager'!C250+'4-Manager'!C250+'5-Manager'!C250","v":207},{"$f":"'1-Manager'!D250+'2-Manager'!D250+'3-Manager'!D250+'4-Manager'!D250+'5-Manager'!D250","v":359},{"$f":"'1-Manager'!E250+'2-Manager'!E250+'3-Manager'!E250+'4-Manager'!E250+'5-Manager'!E250","v":217},1185,null,5,9]
["2020-09-05",{"$f":"'1-Manager'!B251+'2-Manager'!B251+'3-Manager'!B251+'4-Manager'!B251+'5-Manager'!B251","v":315},{"$f":"'1-Manager'!C251+'2-Manager'!C251+'3-Manager'!C251+'4-Manager'!C251+'5-Manager'!C251","v":173},{"$f":"'1-Manager'!D251+'2-Manager'!D251+'3-Manager'!D251+'4-Manager'!D251+'5-Manager'!D251","v":385},{"$f":"'1-Manager'!E251+'2-Manager'!E251+'3-Manager'!E251+'4-Manager'!E251+'5-Manager'!E251","v":118},991,null,6,9]
["2020-09-06",{"$f":"'1-Manager'!B252+'2-Manager'!B252+'3-Manager'!B252+'4-Manager'!B252+'5-Manager'!B252","v":95},{"$f":"'1-Manager'!C252+'2-Manager'!C252+'3-Manager'!C252+'4-Manager'!C252+'5-Manager'!C252","v":29},{"$f":"'1-Manager'!D252+'2-Manager'!D252+'3-Manager'!D252+'4-Manager'!D252+'5-Manager'!D252","v":78},{"$f":"'1-Manager'!E252+'2-Manager'!E252+'3-Manager'!E252+'4-Manager'!E252+'5-Manager'!E252","v":49},251,null,7,9]
["2020-09-07",{"$f":"'1-Manager'!B253+'2-Manager'!B253+'3-Manager'!B253+'4-Manager'!B253+'5-Manager'!B253","v":251},{"$f":"'1-Manager'!C253+'2-Manager'!C253+'3-Manager'!C253+'4-Manager'!C253+'5-Manager'!C253","v":164},{"$f":"'1-Manager'!D253+'2-Manager'!D253+'3-Manager'!D253+'4-Manager'!D253+'5-Manager'!D253","v":231},{"$f":"'1-Manager'!E253+'2-Manager'!E253+'3-Manager'!E253+'4-Manager'!E253+'5-Manager'!E253","v":160},806,null,1,9]
["2020-09-08",{"$f":"'1-Manager'!B254+'2-Manager'!B254+'3-Manager'!B254+'4-Manager'!B254+'5-Manager'!B254","v":258},{"$f":"'1-Manager'!C254+'2-Manager'!C254+'3-Manager'!C254+'4-Manager'!C254+'5-Manager'!C254","v":129},{"$f":"'1-Manager'!D254+'2-Manager'!D254+'3-Manager'!D254+'4-Manager'!D254+'5-Manager'!D254","v":269},{"$f":"'1-Manager'!E254+'2-Manager'!E254+'3-Manager'!E254+'4-Manager'!E254+'5-Manager'!E254","v":116},772,null,2,9]
["2020-09-09",{"$f":"'1-Manager'!B255+'2-Manager'!B255+'3-Manager'!B255+'4-Manager'!B255+'5-Manager'!B255","v":158},{"$f":"'1-Manager'!C255+'2-Manager'!C255+'3-Manager'!C255+'4-Manager'!C255+'5-Manager'!C255","v":160},{"$f":"'1-Manager'!D255+'2-Manager'!D255+'3-Manager'!D255+'4-Manager'!D255+'5-Manager'!D255","v":275},{"$f":"'1-Manager'!E255+'2-Manager'!E255+'3-Manager'!E255+'4-Manager'!E255+'5-Manager'!E255","v":153},746,null,3,9]
["2020-09-10",{"$f":"'1-Manager'!B256+'2-Manager'!B256+'3-Manager'!B256+'4-Manager'!B256+'5-Manager'!B256","v":272},{"$f":"'1-Manager'!C256+'2-Manager'!C256+'3-Manager'!C256+'4-Manager'!C256+'5-Manager'!C256","v":197},{"$f":"'1-Manager'!D256+'2-Manager'!D256+'3-Manager'!D256+'4-Manager'!D256+'5-Manager'!D256","v":144},{"$f":"'1-Manager'!E256+'2-Manager'!E256+'3-Manager'!E256+'4-Manager'!E256+'5-Manager'!E256","v":142},755,null,4,9]
["2020-09-11",{"$f":"'1-Manager'!B257+'2-Manager'!B257+'3-Manager'!B257+'4-Manager'!B257+'5-Manager'!B257","v":369},{"$f":"'1-Manager'!C257+'2-Manager'!C257+'3-Manager'!C257+'4-Manager'!C257+'5-Manager'!C257","v":182},{"$f":"'1-Manager'!D257+'2-Manager'!D257+'3-Manager'!D257+'4-Manager'!D257+'5-Manager'!D257","v":227},{"$f":"'1-Manager'!E257+'2-Manager'!E257+'3-Manager'!E257+'4-Manager'!E257+'5-Manager'!E257","v":184},962,null,5,9]
["2020-09-12",{"$f":"'1-Manager'!B258+'2-Manager'!B258+'3-Manager'!B258+'4-Manager'!B258+'5-Manager'!B258","v":214},{"$f":"'1-Manager'!C258+'2-Manager'!C258+'3-Manager'!C258+'4-Manager'!C258+'5-Manager'!C258","v":65},{"$f":"'1-Manager'!D258+'2-Manager'!D258+'3-Manager'!D258+'4-Manager'!D258+'5-Manager'!D258","v":138},{"$f":"'1-Manager'!E258+'2-Manager'!E258+'3-Manager'!E258+'4-Manager'!E258+'5-Manager'!E258","v":129},546,null,6,9]
["2020-09-13",{"$f":"'1-Manager'!B259+'2-Manager'!B259+'3-Manager'!B259+'4-Manager'!B259+'5-Manager'!B259","v":36},{"$f":"'1-Manager'!C259+'2-Manager'!C259+'3-Manager'!C259+'4-Manager'!C259+'5-Manager'!C259","v":40},{"$f":"'1-Manager'!D259+'2-Manager'!D259+'3-Manager'!D259+'4-Manager'!D259+'5-Manager'!D259","v":115},{"$f":"'1-Manager'!E259+'2-Manager'!E259+'3-Manager'!E259+'4-Manager'!E259+'5-Manager'!E259","v":73},264,null,7,9]
["2020-09-14",{"$f":"'1-Manager'!B260+'2-Manager'!B260+'3-Manager'!B260+'4-Manager'!B260+'5-Manager'!B260","v":190},{"$f":"'1-Manager'!C260+'2-Manager'!C260+'3-Manager'!C260+'4-Manager'!C260+'5-Manager'!C260","v":113},{"$f":"'1-Manager'!D260+'2-Manager'!D260+'3-Manager'!D260+'4-Manager'!D260+'5-Manager'!D260","v":209},{"$f":"'1-Manager'!E260+'2-Manager'!E260+'3-Manager'!E260+'4-Manager'!E260+'5-Manager'!E260","v":119},{"$f":"SUM(B260:E260)","v":631},null,{"$f":"WEEKDAY(A260,2)","v":1},{"$f":"MONTH(A260)","v":9}]
["2020-09-15",{"$f":"'1-Manager'!B261+'2-Manager'!B261+'3-Manager'!B261+'4-Manager'!B261+'5-Manager'!B261","v":140},{"$f":"'1-Manager'!C261+'2-Manager'!C261+'3-Manager'!C261+'4-Manager'!C261+'5-Manager'!C261","v":109},{"$f":"'1-Manager'!D261+'2-Manager'!D261+'3-Manager'!D261+'4-Manager'!D261+'5-Manager'!D261","v":187},{"$f":"'1-Manager'!E261+'2-Manager'!E261+'3-Manager'!E261+'4-Manager'!E261+'5-Manager'!E261","v":78},514,null,2,9]
["2020-09-16",{"$f":"'1-Manager'!B262+'2-Manager'!B262+'3-Manager'!B262+'4-Manager'!B262+'5-Manager'!B262","v":267},{"$f":"'1-Manager'!C262+'2-Manager'!C262+'3-Manager'!C262+'4-Manager'!C262+'5-Manager'!C262","v":106},{"$f":"'1-Manager'!D262+'2-Manager'!D262+'3-Manager'!D262+'4-Manager'!D262+'5-Manager'!D262","v":244},{"$f":"'1-Manager'!E262+'2-Manager'!E262+'3-Manager'!E262+'4-Manager'!E262+'5-Manager'!E262","v":170},787,null,3,9]
["2020-09-17",{"$f":"'1-Manager'!B263+'2-Manager'!B263+'3-Manager'!B263+'4-Manager'!B263+'5-Manager'!B263","v":193},{"$f":"'1-Manager'!C263+'2-Manager'!C263+'3-Manager'!C263+'4-Manager'!C263+'5-Manager'!C263","v":108},{"$f":"'1-Manager'!D263+'2-Manager'!D263+'3-Manager'!D263+'4-Manager'!D263+'5-Manager'!D263","v":231},{"$f":"'1-Manager'!E263+'2-Manager'!E263+'3-Manager'!E263+'4-Manager'!E263+'5-Manager'!E263","v":123},655,null,4,9]
["2020-09-18",{"$f":"'1-Manager'!B264+'2-Manager'!B264+'3-Manager'!B264+'4-Manager'!B264+'5-Manager'!B264","v":397},{"$f":"'1-Manager'!C264+'2-Manager'!C264+'3-Manager'!C264+'4-Manager'!C264+'5-Manager'!C264","v":157},{"$f":"'1-Manager'!D264+'2-Manager'!D264+'3-Manager'!D264+'4-Manager'!D264+'5-Manager'!D264","v":323},{"$f":"'1-Manager'!E264+'2-Manager'!E264+'3-Manager'!E264+'4-Manager'!E264+'5-Manager'!E264","v":190},1067,null,5,9]
["2020-09-19",{"$f":"'1-Manager'!B265+'2-Manager'!B265+'3-Manager'!B265+'4-Manager'!B265+'5-Manager'!B265","v":160},{"$f":"'1-Manager'!C265+'2-Manager'!C265+'3-Manager'!C265+'4-Manager'!C265+'5-Manager'!C265","v":196},{"$f":"'1-Manager'!D265+'2-Manager'!D265+'3-Manager'!D265+'4-Manager'!D265+'5-Manager'!D265","v":113},{"$f":"'1-Manager'!E265+'2-Manager'!E265+'3-Manager'!E265+'4-Manager'!E265+'5-Manager'!E265","v":111},580,null,6,9]
["2020-09-20",{"$f":"'1-Manager'!B266+'2-Manager'!B266+'3-Manager'!B266+'4-Manager'!B266+'5-Manager'!B266","v":69},{"$f":"'1-Manager'!C266+'2-Manager'!C266+'3-Manager'!C266+'4-Manager'!C266+'5-Manager'!C266","v":52},{"$f":"'1-Manager'!D266+'2-Manager'!D266+'3-Manager'!D266+'4-Manager'!D266+'5-Manager'!D266","v":105},{"$f":"'1-Manager'!E266+'2-Manager'!E266+'3-Manager'!E266+'4-Manager'!E266+'5-Manager'!E266","v":72},298,null,7,9]
["2020-09-21",{"$f":"'1-Manager'!B267+'2-Manager'!B267+'3-Manager'!B267+'4-Manager'!B267+'5-Manager'!B267","v":132},{"$f":"'1-Manager'!C267+'2-Manager'!C267+'3-Manager'!C267+'4-Manager'!C267+'5-Manager'!C267","v":71},{"$f":"'1-Manager'!D267+'2-Manager'!D267+'3-Manager'!D267+'4-Manager'!D267+'5-Manager'!D267","v":258},{"$f":"'1-Manager'!E267+'2-Manager'!E267+'3-Manager'!E267+'4-Manager'!E267+'5-Manager'!E267","v":78},539,null,1,9]
["2020-09-22",{"$f":"'1-Manager'!B268+'2-Manager'!B268+'3-Manager'!B268+'4-Manager'!B268+'5-Manager'!B268","v":145},{"$f":"'1-Manager'!C268+'2-Manager'!C268+'3-Manager'!C268+'4-Manager'!C268+'5-Manager'!C268","v":118},{"$f":"'1-Manager'!D268+'2-Manager'!D268+'3-Manager'!D268+'4-Manager'!D268+'5-Manager'!D268","v":190},{"$f":"'1-Manager'!E268+'2-Manager'!E268+'3-Manager'!E268+'4-Manager'!E268+'5-Manager'!E268","v":149},602,null,2,9]
["2020-09-23",{"$f":"'1-Manager'!B269+'2-Manager'!B269+'3-Manager'!B269+'4-Manager'!B269+'5-Manager'!B269","v":301},{"$f":"'1-Manager'!C269+'2-Manager'!C269+'3-Manager'!C269+'4-Manager'!C269+'5-Manager'!C269","v":164},{"$f":"'1-Manager'!D269+'2-Manager'!D269+'3-Manager'!D269+'4-Manager'!D269+'5-Manager'!D269","v":316},{"$f":"'1-Manager'!E269+'2-Manager'!E269+'3-Manager'!E269+'4-Manager'!E269+'5-Manager'!E269","v":96},877,null,3,9]
["2020-09-24",{"$f":"'1-Manager'!B270+'2-Manager'!B270+'3-Manager'!B270+'4-Manager'!B270+'5-Manager'!B270","v":285},{"$f":"'1-Manager'!C270+'2-Manager'!C270+'3-Manager'!C270+'4-Manager'!C270+'5-Manager'!C270","v":100},{"$f":"'1-Manager'!D270+'2-Manager'!D270+'3-Manager'!D270+'4-Manager'!D270+'5-Manager'!D270","v":232},{"$f":"'1-Manager'!E270+'2-Manager'!E270+'3-Manager'!E270+'4-Manager'!E270+'5-Manager'!E270","v":165},782,null,4,9]
["2020-09-25",{"$f":"'1-Manager'!B271+'2-Manager'!B271+'3-Manager'!B271+'4-Manager'!B271+'5-Manager'!B271","v":311},{"$f":"'1-Manager'!C271+'2-Manager'!C271+'3-Manager'!C271+'4-Manager'!C271+'5-Manager'!C271","v":156},{"$f":"'1-Manager'!D271+'2-Manager'!D271+'3-Manager'!D271+'4-Manager'!D271+'5-Manager'!D271","v":230},{"$f":"'1-Manager'!E271+'2-Manager'!E271+'3-Manager'!E271+'4-Manager'!E271+'5-Manager'!E271","v":108},805,null,5,9]
["2020-09-26",{"$f":"'1-Manager'!B272+'2-Manager'!B272+'3-Manager'!B272+'4-Manager'!B272+'5-Manager'!B272","v":199},{"$f":"'1-Manager'!C272+'2-Manager'!C272+'3-Manager'!C272+'4-Manager'!C272+'5-Manager'!C272","v":180},{"$f":"'1-Manager'!D272+'2-Manager'!D272+'3-Manager'!D272+'4-Manager'!D272+'5-Manager'!D272","v":314},{"$f":"'1-Manager'!E272+'2-Manager'!E272+'3-Manager'!E272+'4-Manager'!E272+'5-Manager'!E272","v":154},847,null,6,9]
["2020-09-27",{"$f":"'1-Manager'!B273+'2-Manager'!B273+'3-Manager'!B273+'4-Manager'!B273+'5-Manager'!B273","v":77},{"$f":"'1-Manager'!C273+'2-Manager'!C273+'3-Manager'!C273+'4-Manager'!C273+'5-Manager'!C273","v":35},{"$f":"'1-Manager'!D273+'2-Manager'!D273+'3-Manager'!D273+'4-Manager'!D273+'5-Manager'!D273","v":99},{"$f":"'1-Manager'!E273+'2-Manager'!E273+'3-Manager'!E273+'4-Manager'!E273+'5-Manager'!E273","v":50},261,null,7,9]
["2020-09-28",{"$f":"'1-Manager'!B274+'2-Manager'!B274+'3-Manager'!B274+'4-Manager'!B274+'5-Manager'!B274","v":149},{"$f":"'1-Manager'!C274+'2-Manager'!C274+'3-Manager'!C274+'4-Manager'!C274+'5-Manager'!C274","v":80},{"$f":"'1-Manager'!D274+'2-Manager'!D274+'3-Manager'!D274+'4-Manager'!D274+'5-Manager'!D274","v":223},{"$f":"'1-Manager'!E274+'2-Manager'!E274+'3-Manager'!E274+'4-Manager'!E274+'5-Manager'!E274","v":176},628,null,1,9]
["2020-09-29",{"$f":"'1-Manager'!B275+'2-Manager'!B275+'3-Manager'!B275+'4-Manager'!B275+'5-Manager'!B275","v":217},{"$f":"'1-Manager'!C275+'2-Manager'!C275+'3-Manager'!C275+'4-Manager'!C275+'5-Manager'!C275","v":125},{"$f":"'1-Manager'!D275+'2-Manager'!D275+'3-Manager'!D275+'4-Manager'!D275+'5-Manager'!D275","v":339},{"$f":"'1-Manager'!E275+'2-Manager'!E275+'3-Manager'!E275+'4-Manager'!E275+'5-Manager'!E275","v":145},826,null,2,9]
["2020-09-30",{"$f":"'1-Manager'!B276+'2-Manager'!B276+'3-Manager'!B276+'4-Manager'!B276+'5-Manager'!B276","v":190},{"$f":"'1-Manager'!C276+'2-Manager'!C276+'3-Manager'!C276+'4-Manager'!C276+'5-Manager'!C276","v":202},{"$f":"'1-Manager'!D276+'2-Manager'!D276+'3-Manager'!D276+'4-Manager'!D276+'5-Manager'!D276","v":250},{"$f":"'1-Manager'!E276+'2-Manager'!E276+'3-Manager'!E276+'4-Manager'!E276+'5-Manager'!E276","v":135},777,null,3,9]
["2020-10-01",{"$f":"'1-Manager'!B277+'2-Manager'!B277+'3-Manager'!B277+'4-Manager'!B277+'5-Manager'!B277","v":229},{"$f":"'1-Manager'!C277+'2-Manager'!C277+'3-Manager'!C277+'4-Manager'!C277+'5-Manager'!C277","v":96},{"$f":"'1-Manager'!D277+'2-Manager'!D277+'3-Manager'!D277+'4-Manager'!D277+'5-Manager'!D277","v":262},{"$f":"'1-Manager'!E277+'2-Manager'!E277+'3-Manager'!E277+'4-Manager'!E277+'5-Manager'!E277","v":190},777,null,4,10]
["2020-10-02",{"$f":"'1-Manager'!B278+'2-Manager'!B278+'3-Manager'!B278+'4-Manager'!B278+'5-Manager'!B278","v":305},{"$f":"'1-Manager'!C278+'2-Manager'!C278+'3-Manager'!C278+'4-Manager'!C278+'5-Manager'!C278","v":201},{"$f":"'1-Manager'!D278+'2-Manager'!D278+'3-Manager'!D278+'4-Manager'!D278+'5-Manager'!D278","v":243},{"$f":"'1-Manager'!E278+'2-Manager'!E278+'3-Manager'!E278+'4-Manager'!E278+'5-Manager'!E278","v":211},960,null,5,10]
["2020-10-03",{"$f":"'1-Manager'!B279+'2-Manager'!B279+'3-Manager'!B279+'4-Manager'!B279+'5-Manager'!B279","v":153},{"$f":"'1-Manager'!C279+'2-Manager'!C279+'3-Manager'!C279+'4-Manager'!C279+'5-Manager'!C279","v":236},{"$f":"'1-Manager'!D279+'2-Manager'!D279+'3-Manager'!D279+'4-Manager'!D279+'5-Manager'!D279","v":175},{"$f":"'1-Manager'!E279+'2-Manager'!E279+'3-Manager'!E279+'4-Manager'!E279+'5-Manager'!E279","v":97},661,null,6,10]
["2020-10-04",{"$f":"'1-Manager'!B280+'2-Manager'!B280+'3-Manager'!B280+'4-Manager'!B280+'5-Manager'!B280","v":87},{"$f":"'1-Manager'!C280+'2-Manager'!C280+'3-Manager'!C280+'4-Manager'!C280+'5-Manager'!C280","v":48},{"$f":"'1-Manager'!D280+'2-Manager'!D280+'3-Manager'!D280+'4-Manager'!D280+'5-Manager'!D280","v":84},{"$f":"'1-Manager'!E280+'2-Manager'!E280+'3-Manager'!E280+'4-Manager'!E280+'5-Manager'!E280","v":63},282,null,7,10]
["2020-10-05",{"$f":"'1-Manager'!B281+'2-Manager'!B281+'3-Manager'!B281+'4-Manager'!B281+'5-Manager'!B281","v":269},{"$f":"'1-Manager'!C281+'2-Manager'!C281+'3-Manager'!C281+'4-Manager'!C281+'5-Manager'!C281","v":164},{"$f":"'1-Manager'!D281+'2-Manager'!D281+'3-Manager'!D281+'4-Manager'!D281+'5-Manager'!D281","v":250},{"$f":"'1-Manager'!E281+'2-Manager'!E281+'3-Manager'!E281+'4-Manager'!E281+'5-Manager'!E281","v":113},796,null,1,10]
["2020-10-06",{"$f":"'1-Manager'!B282+'2-Manager'!B282+'3-Manager'!B282+'4-Manager'!B282+'5-Manager'!B282","v":320},{"$f":"'1-Manager'!C282+'2-Manager'!C282+'3-Manager'!C282+'4-Manager'!C282+'5-Manager'!C282","v":75},{"$f":"'1-Manager'!D282+'2-Manager'!D282+'3-Manager'!D282+'4-Manager'!D282+'5-Manager'!D282","v":273},{"$f":"'1-Manager'!E282+'2-Manager'!E282+'3-Manager'!E282+'4-Manager'!E282+'5-Manager'!E282","v":144},812,null,2,10]
["2020-10-07",{"$f":"'1-Manager'!B283+'2-Manager'!B283+'3-Manager'!B283+'4-Manager'!B283+'5-Manager'!B283","v":207},{"$f":"'1-Manager'!C283+'2-Manager'!C283+'3-Manager'!C283+'4-Manager'!C283+'5-Manager'!C283","v":187},{"$f":"'1-Manager'!D283+'2-Manager'!D283+'3-Manager'!D283+'4-Manager'!D283+'5-Manager'!D283","v":190},{"$f":"'1-Manager'!E283+'2-Manager'!E283+'3-Manager'!E283+'4-Manager'!E283+'5-Manager'!E283","v":188},772,null,3,10]
["2020-10-08",{"$f":"'1-Manager'!B284+'2-Manager'!B284+'3-Manager'!B284+'4-Manager'!B284+'5-Manager'!B284","v":265},{"$f":"'1-Manager'!C284+'2-Manager'!C284+'3-Manager'!C284+'4-Manager'!C284+'5-Manager'!C284","v":91},{"$f":"'1-Manager'!D284+'2-Manager'!D284+'3-Manager'!D284+'4-Manager'!D284+'5-Manager'!D284","v":186},{"$f":"'1-Manager'!E284+'2-Manager'!E284+'3-Manager'!E284+'4-Manager'!E284+'5-Manager'!E284","v":134},676,null,4,10]
["2020-10-09",{"$f":"'1-Manager'!B285+'2-Manager'!B285+'3-Manager'!B285+'4-Manager'!B285+'5-Manager'!B285","v":349},{"$f":"'1-Manager'!C285+'2-Manager'!C285+'3-Manager'!C285+'4-Manager'!C285+'5-Manager'!C285","v":120},{"$f":"'1-Manager'!D285+'2-Manager'!D285+'3-Manager'!D285+'4-Manager'!D285+'5-Manager'!D285","v":336},{"$f":"'1-Manager'!E285+'2-Manager'!E285+'3-Manager'!E285+'4-Manager'!E285+'5-Manager'!E285","v":152},957,null,5,10]
["2020-10-10",{"$f":"'1-Manager'!B286+'2-Manager'!B286+'3-Manager'!B286+'4-Manager'!B286+'5-Manager'!B286","v":413},{"$f":"'1-Manager'!C286+'2-Manager'!C286+'3-Manager'!C286+'4-Manager'!C286+'5-Manager'!C286","v":184},{"$f":"'1-Manager'!D286+'2-Manager'!D286+'3-Manager'!D286+'4-Manager'!D286+'5-Manager'!D286","v":293},{"$f":"'1-Manager'!E286+'2-Manager'!E286+'3-Manager'!E286+'4-Manager'!E286+'5-Manager'!E286","v":128},1018,null,6,10]
["2020-10-11",{"$f":"'1-Manager'!B287+'2-Manager'!B287+'3-Manager'!B287+'4-Manager'!B287+'5-Manager'!B287","v":93},{"$f":"'1-Manager'!C287+'2-Manager'!C287+'3-Manager'!C287+'4-Manager'!C287+'5-Manager'!C287","v":38},{"$f":"'1-Manager'!D287+'2-Manager'!D287+'3-Manager'!D287+'4-Manager'!D287+'5-Manager'!D287","v":111},{"$f":"'1-Manager'!E287+'2-Manager'!E287+'3-Manager'!E287+'4-Manager'!E287+'5-Manager'!E287","v":27},269,null,7,10]
["2020-10-12",{"$f":"'1-Manager'!B288+'2-Manager'!B288+'3-Manager'!B288+'4-Manager'!B288+'5-Manager'!B288","v":229},{"$f":"'1-Manager'!C288+'2-Manager'!C288+'3-Manager'!C288+'4-Manager'!C288+'5-Manager'!C288","v":93},{"$f":"'1-Manager'!D288+'2-Manager'!D288+'3-Manager'!D288+'4-Manager'!D288+'5-Manager'!D288","v":221},{"$f":"'1-Manager'!E288+'2-Manager'!E288+'3-Manager'!E288+'4-Manager'!E288+'5-Manager'!E288","v":202},745,null,1,10]
["2020-10-13",{"$f":"'1-Manager'!B289+'2-Manager'!B289+'3-Manager'!B289+'4-Manager'!B289+'5-Manager'!B289","v":97},{"$f":"'1-Manager'!C289+'2-Manager'!C289+'3-Manager'!C289+'4-Manager'!C289+'5-Manager'!C289","v":158},{"$f":"'1-Manager'!D289+'2-Manager'!D289+'3-Manager'!D289+'4-Manager'!D289+'5-Manager'!D289","v":240},{"$f":"'1-Manager'!E289+'2-Manager'!E289+'3-Manager'!E289+'4-Manager'!E289+'5-Manager'!E289","v":166},661,null,2,10]
["2020-10-14",{"$f":"'1-Manager'!B290+'2-Manager'!B290+'3-Manager'!B290+'4-Manager'!B290+'5-Manager'!B290","v":248},{"$f":"'1-Manager'!C290+'2-Manager'!C290+'3-Manager'!C290+'4-Manager'!C290+'5-Manager'!C290","v":200},{"$f":"'1-Manager'!D290+'2-Manager'!D290+'3-Manager'!D290+'4-Manager'!D290+'5-Manager'!D290","v":320},{"$f":"'1-Manager'!E290+'2-Manager'!E290+'3-Manager'!E290+'4-Manager'!E290+'5-Manager'!E290","v":158},926,null,3,10]
["2020-10-15",{"$f":"'1-Manager'!B291+'2-Manager'!B291+'3-Manager'!B291+'4-Manager'!B291+'5-Manager'!B291","v":240},{"$f":"'1-Manager'!C291+'2-Manager'!C291+'3-Manager'!C291+'4-Manager'!C291+'5-Manager'!C291","v":197},{"$f":"'1-Manager'!D291+'2-Manager'!D291+'3-Manager'!D291+'4-Manager'!D291+'5-Manager'!D291","v":192},{"$f":"'1-Manager'!E291+'2-Manager'!E291+'3-Manager'!E291+'4-Manager'!E291+'5-Manager'!E291","v":201},830,null,4,10]
["2020-10-16",{"$f":"'1-Manager'!B292+'2-Manager'!B292+'3-Manager'!B292+'4-Manager'!B292+'5-Manager'!B292","v":328},{"$f":"'1-Manager'!C292+'2-Manager'!C292+'3-Manager'!C292+'4-Manager'!C292+'5-Manager'!C292","v":137},{"$f":"'1-Manager'!D292+'2-Manager'!D292+'3-Manager'!D292+'4-Manager'!D292+'5-Manager'!D292","v":317},{"$f":"'1-Manager'!E292+'2-Manager'!E292+'3-Manager'!E292+'4-Manager'!E292+'5-Manager'!E292","v":164},946,null,5,10]
["2020-10-17",{"$f":"'1-Manager'!B293+'2-Manager'!B293+'3-Manager'!B293+'4-Manager'!B293+'5-Manager'!B293","v":237},{"$f":"'1-Manager'!C293+'2-Manager'!C293+'3-Manager'!C293+'4-Manager'!C293+'5-Manager'!C293","v":182},{"$f":"'1-Manager'!D293+'2-Manager'!D293+'3-Manager'!D293+'4-Manager'!D293+'5-Manager'!D293","v":269},{"$f":"'1-Manager'!E293+'2-Manager'!E293+'3-Manager'!E293+'4-Manager'!E293+'5-Manager'!E293","v":93},781,null,6,10]
["2020-10-18",{"$f":"'1-Manager'!B294+'2-Manager'!B294+'3-Manager'!B294+'4-Manager'!B294+'5-Manager'!B294","v":75},{"$f":"'1-Manager'!C294+'2-Manager'!C294+'3-Manager'!C294+'4-Manager'!C294+'5-Manager'!C294","v":57},{"$f":"'1-Manager'!D294+'2-Manager'!D294+'3-Manager'!D294+'4-Manager'!D294+'5-Manager'!D294","v":43},{"$f":"'1-Manager'!E294+'2-Manager'!E294+'3-Manager'!E294+'4-Manager'!E294+'5-Manager'!E294","v":34},209,null,7,10]
["2020-10-19",{"$f":"'1-Manager'!B295+'2-Manager'!B295+'3-Manager'!B295+'4-Manager'!B295+'5-Manager'!B295","v":206},{"$f":"'1-Manager'!C295+'2-Manager'!C295+'3-Manager'!C295+'4-Manager'!C295+'5-Manager'!C295","v":106},{"$f":"'1-Manager'!D295+'2-Manager'!D295+'3-Manager'!D295+'4-Manager'!D295+'5-Manager'!D295","v":277},{"$f":"'1-Manager'!E295+'2-Manager'!E295+'3-Manager'!E295+'4-Manager'!E295+'5-Manager'!E295","v":78},667,null,1,10]
["2020-10-20",{"$f":"'1-Manager'!B296+'2-Manager'!B296+'3-Manager'!B296+'4-Manager'!B296+'5-Manager'!B296","v":327},{"$f":"'1-Manager'!C296+'2-Manager'!C296+'3-Manager'!C296+'4-Manager'!C296+'5-Manager'!C296","v":119},{"$f":"'1-Manager'!D296+'2-Manager'!D296+'3-Manager'!D296+'4-Manager'!D296+'5-Manager'!D296","v":325},{"$f":"'1-Manager'!E296+'2-Manager'!E296+'3-Manager'!E296+'4-Manager'!E296+'5-Manager'!E296","v":157},928,null,2,10]
["2020-10-21",{"$f":"'1-Manager'!B297+'2-Manager'!B297+'3-Manager'!B297+'4-Manager'!B297+'5-Manager'!B297","v":182},{"$f":"'1-Manager'!C297+'2-Manager'!C297+'3-Manager'!C297+'4-Manager'!C297+'5-Manager'!C297","v":178},{"$f":"'1-Manager'!D297+'2-Manager'!D297+'3-Manager'!D297+'4-Manager'!D297+'5-Manager'!D297","v":291},{"$f":"'1-Manager'!E297+'2-Manager'!E297+'3-Manager'!E297+'4-Manager'!E297+'5-Manager'!E297","v":125},776,null,3,10]
["2020-10-22",{"$f":"'1-Manager'!B298+'2-Manager'!B298+'3-Manager'!B298+'4-Manager'!B298+'5-Manager'!B298","v":206},{"$f":"'1-Manager'!C298+'2-Manager'!C298+'3-Manager'!C298+'4-Manager'!C298+'5-Manager'!C298","v":102},{"$f":"'1-Manager'!D298+'2-Manager'!D298+'3-Manager'!D298+'4-Manager'!D298+'5-Manager'!D298","v":320},{"$f":"'1-Manager'!E298+'2-Manager'!E298+'3-Manager'!E298+'4-Manager'!E298+'5-Manager'!E298","v":149},777,null,4,10]
["2020-10-23",{"$f":"'1-Manager'!B299+'2-Manager'!B299+'3-Manager'!B299+'4-Manager'!B299+'5-Manager'!B299","v":291},{"$f":"'1-Manager'!C299+'2-Manager'!C299+'3-Manager'!C299+'4-Manager'!C299+'5-Manager'!C299","v":151},{"$f":"'1-Manager'!D299+'2-Manager'!D299+'3-Manager'!D299+'4-Manager'!D299+'5-Manager'!D299","v":232},{"$f":"'1-Manager'!E299+'2-Manager'!E299+'3-Manager'!E299+'4-Manager'!E299+'5-Manager'!E299","v":122},796,null,5,10]
["2020-10-24",{"$f":"'1-Manager'!B300+'2-Manager'!B300+'3-Manager'!B300+'4-Manager'!B300+'5-Manager'!B300","v":202},{"$f":"'1-Manager'!C300+'2-Manager'!C300+'3-Manager'!C300+'4-Manager'!C300+'5-Manager'!C300","v":107},{"$f":"'1-Manager'!D300+'2-Manager'!D300+'3-Manager'!D300+'4-Manager'!D300+'5-Manager'!D300","v":356},{"$f":"'1-Manager'!E300+'2-Manager'!E300+'3-Manager'!E300+'4-Manager'!E300+'5-Manager'!E300","v":125},790,null,6,10]
["2020-10-25",{"$f":"'1-Manager'!B301+'2-Manager'!B301+'3-Manager'!B301+'4-Manager'!B301+'5-Manager'!B301","v":81},{"$f":"'1-Manager'!C301+'2-Manager'!C301+'3-Manager'!C301+'4-Manager'!C301+'5-Manager'!C301","v":38},{"$f":"'1-Manager'!D301+'2-Manager'!D301+'3-Manager'!D301+'4-Manager'!D301+'5-Manager'!D301","v":97},{"$f":"'1-Manager'!E301+'2-Manager'!E301+'3-Manager'!E301+'4-Manager'!E301+'5-Manager'!E301","v":45},261,null,7,10]
["2020-10-26",{"$f":"'1-Manager'!B302+'2-Manager'!B302+'3-Manager'!B302+'4-Manager'!B302+'5-Manager'!B302","v":208},{"$f":"'1-Manager'!C302+'2-Manager'!C302+'3-Manager'!C302+'4-Manager'!C302+'5-Manager'!C302","v":103},{"$f":"'1-Manager'!D302+'2-Manager'!D302+'3-Manager'!D302+'4-Manager'!D302+'5-Manager'!D302","v":258},{"$f":"'1-Manager'!E302+'2-Manager'!E302+'3-Manager'!E302+'4-Manager'!E302+'5-Manager'!E302","v":169},738,null,1,10]
["2020-10-27",{"$f":"'1-Manager'!B303+'2-Manager'!B303+'3-Manager'!B303+'4-Manager'!B303+'5-Manager'!B303","v":268},{"$f":"'1-Manager'!C303+'2-Manager'!C303+'3-Manager'!C303+'4-Manager'!C303+'5-Manager'!C303","v":107},{"$f":"'1-Manager'!D303+'2-Manager'!D303+'3-Manager'!D303+'4-Manager'!D303+'5-Manager'!D303","v":217},{"$f":"'1-Manager'!E303+'2-Manager'!E303+'3-Manager'!E303+'4-Manager'!E303+'5-Manager'!E303","v":160},752,null,2,10]
["2020-10-28",{"$f":"'1-Manager'!B304+'2-Manager'!B304+'3-Manager'!B304+'4-Manager'!B304+'5-Manager'!B304","v":259},{"$f":"'1-Manager'!C304+'2-Manager'!C304+'3-Manager'!C304+'4-Manager'!C304+'5-Manager'!C304","v":235},{"$f":"'1-Manager'!D304+'2-Manager'!D304+'3-Manager'!D304+'4-Manager'!D304+'5-Manager'!D304","v":271},{"$f":"'1-Manager'!E304+'2-Manager'!E304+'3-Manager'!E304+'4-Manager'!E304+'5-Manager'!E304","v":161},926,null,3,10]
["2020-10-29",{"$f":"'1-Manager'!B305+'2-Manager'!B305+'3-Manager'!B305+'4-Manager'!B305+'5-Manager'!B305","v":247},{"$f":"'1-Manager'!C305+'2-Manager'!C305+'3-Manager'!C305+'4-Manager'!C305+'5-Manager'!C305","v":134},{"$f":"'1-Manager'!D305+'2-Manager'!D305+'3-Manager'!D305+'4-Manager'!D305+'5-Manager'!D305","v":169},{"$f":"'1-Manager'!E305+'2-Manager'!E305+'3-Manager'!E305+'4-Manager'!E305+'5-Manager'!E305","v":127},677,null,4,10]
["2020-10-30",{"$f":"'1-Manager'!B306+'2-Manager'!B306+'3-Manager'!B306+'4-Manager'!B306+'5-Manager'!B306","v":225},{"$f":"'1-Manager'!C306+'2-Manager'!C306+'3-Manager'!C306+'4-Manager'!C306+'5-Manager'!C306","v":217},{"$f":"'1-Manager'!D306+'2-Manager'!D306+'3-Manager'!D306+'4-Manager'!D306+'5-Manager'!D306","v":215},{"$f":"'1-Manager'!E306+'2-Manager'!E306+'3-Manager'!E306+'4-Manager'!E306+'5-Manager'!E306","v":168},825,null,5,10]
["2020-10-31",{"$f":"'1-Manager'!B307+'2-Manager'!B307+'3-Manager'!B307+'4-Manager'!B307+'5-Manager'!B307","v":262},{"$f":"'1-Manager'!C307+'2-Manager'!C307+'3-Manager'!C307+'4-Manager'!C307+'5-Manager'!C307","v":143},{"$f":"'1-Manager'!D307+'2-Manager'!D307+'3-Manager'!D307+'4-Manager'!D307+'5-Manager'!D307","v":229},{"$f":"'1-Manager'!E307+'2-Manager'!E307+'3-Manager'!E307+'4-Manager'!E307+'5-Manager'!E307","v":109},743,null,6,10]
["2020-11-01",{"$f":"'1-Manager'!B308+'2-Manager'!B308+'3-Manager'!B308+'4-Manager'!B308+'5-Manager'!B308","v":72},{"$f":"'1-Manager'!C308+'2-Manager'!C308+'3-Manager'!C308+'4-Manager'!C308+'5-Manager'!C308","v":64},{"$f":"'1-Manager'!D308+'2-Manager'!D308+'3-Manager'!D308+'4-Manager'!D308+'5-Manager'!D308","v":49},{"$f":"'1-Manager'!E308+'2-Manager'!E308+'3-Manager'!E308+'4-Manager'!E308+'5-Manager'!E308","v":36},221,null,7,11]
["2020-11-02",{"$f":"'1-Manager'!B309+'2-Manager'!B309+'3-Manager'!B309+'4-Manager'!B309+'5-Manager'!B309","v":88},{"$f":"'1-Manager'!C309+'2-Manager'!C309+'3-Manager'!C309+'4-Manager'!C309+'5-Manager'!C309","v":150},{"$f":"'1-Manager'!D309+'2-Manager'!D309+'3-Manager'!D309+'4-Manager'!D309+'5-Manager'!D309","v":337},{"$f":"'1-Manager'!E309+'2-Manager'!E309+'3-Manager'!E309+'4-Manager'!E309+'5-Manager'!E309","v":139},714,null,1,11]
["2020-11-03",{"$f":"'1-Manager'!B310+'2-Manager'!B310+'3-Manager'!B310+'4-Manager'!B310+'5-Manager'!B310","v":201},{"$f":"'1-Manager'!C310+'2-Manager'!C310+'3-Manager'!C310+'4-Manager'!C310+'5-Manager'!C310","v":135},{"$f":"'1-Manager'!D310+'2-Manager'!D310+'3-Manager'!D310+'4-Manager'!D310+'5-Manager'!D310","v":261},{"$f":"'1-Manager'!E310+'2-Manager'!E310+'3-Manager'!E310+'4-Manager'!E310+'5-Manager'!E310","v":175},772,null,2,11]
["2020-11-04",{"$f":"'1-Manager'!B311+'2-Manager'!B311+'3-Manager'!B311+'4-Manager'!B311+'5-Manager'!B311","v":109},{"$f":"'1-Manager'!C311+'2-Manager'!C311+'3-Manager'!C311+'4-Manager'!C311+'5-Manager'!C311","v":149},{"$f":"'1-Manager'!D311+'2-Manager'!D311+'3-Manager'!D311+'4-Manager'!D311+'5-Manager'!D311","v":149},{"$f":"'1-Manager'!E311+'2-Manager'!E311+'3-Manager'!E311+'4-Manager'!E311+'5-Manager'!E311","v":190},597,null,3,11]
["2020-11-05",{"$f":"'1-Manager'!B312+'2-Manager'!B312+'3-Manager'!B312+'4-Manager'!B312+'5-Manager'!B312","v":361},{"$f":"'1-Manager'!C312+'2-Manager'!C312+'3-Manager'!C312+'4-Manager'!C312+'5-Manager'!C312","v":221},{"$f":"'1-Manager'!D312+'2-Manager'!D312+'3-Manager'!D312+'4-Manager'!D312+'5-Manager'!D312","v":277},{"$f":"'1-Manager'!E312+'2-Manager'!E312+'3-Manager'!E312+'4-Manager'!E312+'5-Manager'!E312","v":121},980,null,4,11]
["2020-11-06",{"$f":"'1-Manager'!B313+'2-Manager'!B313+'3-Manager'!B313+'4-Manager'!B313+'5-Manager'!B313","v":262},{"$f":"'1-Manager'!C313+'2-Manager'!C313+'3-Manager'!C313+'4-Manager'!C313+'5-Manager'!C313","v":233},{"$f":"'1-Manager'!D313+'2-Manager'!D313+'3-Manager'!D313+'4-Manager'!D313+'5-Manager'!D313","v":173},{"$f":"'1-Manager'!E313+'2-Manager'!E313+'3-Manager'!E313+'4-Manager'!E313+'5-Manager'!E313","v":100},768,null,5,11]
["2020-11-07",{"$f":"'1-Manager'!B314+'2-Manager'!B314+'3-Manager'!B314+'4-Manager'!B314+'5-Manager'!B314","v":293},{"$f":"'1-Manager'!C314+'2-Manager'!C314+'3-Manager'!C314+'4-Manager'!C314+'5-Manager'!C314","v":152},{"$f":"'1-Manager'!D314+'2-Manager'!D314+'3-Manager'!D314+'4-Manager'!D314+'5-Manager'!D314","v":202},{"$f":"'1-Manager'!E314+'2-Manager'!E314+'3-Manager'!E314+'4-Manager'!E314+'5-Manager'!E314","v":127},774,null,6,11]
["2020-11-08",{"$f":"'1-Manager'!B315+'2-Manager'!B315+'3-Manager'!B315+'4-Manager'!B315+'5-Manager'!B315","v":97},{"$f":"'1-Manager'!C315+'2-Manager'!C315+'3-Manager'!C315+'4-Manager'!C315+'5-Manager'!C315","v":73},{"$f":"'1-Manager'!D315+'2-Manager'!D315+'3-Manager'!D315+'4-Manager'!D315+'5-Manager'!D315","v":71},{"$f":"'1-Manager'!E315+'2-Manager'!E315+'3-Manager'!E315+'4-Manager'!E315+'5-Manager'!E315","v":70},311,null,7,11]
["2020-11-09",{"$f":"'1-Manager'!B316+'2-Manager'!B316+'3-Manager'!B316+'4-Manager'!B316+'5-Manager'!B316","v":190},{"$f":"'1-Manager'!C316+'2-Manager'!C316+'3-Manager'!C316+'4-Manager'!C316+'5-Manager'!C316","v":83},{"$f":"'1-Manager'!D316+'2-Manager'!D316+'3-Manager'!D316+'4-Manager'!D316+'5-Manager'!D316","v":194},{"$f":"'1-Manager'!E316+'2-Manager'!E316+'3-Manager'!E316+'4-Manager'!E316+'5-Manager'!E316","v":142},609,null,1,11]
["2020-11-10",{"$f":"'1-Manager'!B317+'2-Manager'!B317+'3-Manager'!B317+'4-Manager'!B317+'5-Manager'!B317","v":251},{"$f":"'1-Manager'!C317+'2-Manager'!C317+'3-Manager'!C317+'4-Manager'!C317+'5-Manager'!C317","v":71},{"$f":"'1-Manager'!D317+'2-Manager'!D317+'3-Manager'!D317+'4-Manager'!D317+'5-Manager'!D317","v":291},{"$f":"'1-Manager'!E317+'2-Manager'!E317+'3-Manager'!E317+'4-Manager'!E317+'5-Manager'!E317","v":159},772,null,2,11]
["2020-11-11",{"$f":"'1-Manager'!B318+'2-Manager'!B318+'3-Manager'!B318+'4-Manager'!B318+'5-Manager'!B318","v":268},{"$f":"'1-Manager'!C318+'2-Manager'!C318+'3-Manager'!C318+'4-Manager'!C318+'5-Manager'!C318","v":195},{"$f":"'1-Manager'!D318+'2-Manager'!D318+'3-Manager'!D318+'4-Manager'!D318+'5-Manager'!D318","v":335},{"$f":"'1-Manager'!E318+'2-Manager'!E318+'3-Manager'!E318+'4-Manager'!E318+'5-Manager'!E318","v":170},968,null,3,11]
["2020-11-12",{"$f":"'1-Manager'!B319+'2-Manager'!B319+'3-Manager'!B319+'4-Manager'!B319+'5-Manager'!B319","v":203},{"$f":"'1-Manager'!C319+'2-Manager'!C319+'3-Manager'!C319+'4-Manager'!C319+'5-Manager'!C319","v":131},{"$f":"'1-Manager'!D319+'2-Manager'!D319+'3-Manager'!D319+'4-Manager'!D319+'5-Manager'!D319","v":165},{"$f":"'1-Manager'!E319+'2-Manager'!E319+'3-Manager'!E319+'4-Manager'!E319+'5-Manager'!E319","v":191},690,null,4,11]
["2020-11-13",{"$f":"'1-Manager'!B320+'2-Manager'!B320+'3-Manager'!B320+'4-Manager'!B320+'5-Manager'!B320","v":264},{"$f":"'1-Manager'!C320+'2-Manager'!C320+'3-Manager'!C320+'4-Manager'!C320+'5-Manager'!C320","v":172},{"$f":"'1-Manager'!D320+'2-Manager'!D320+'3-Manager'!D320+'4-Manager'!D320+'5-Manager'!D320","v":248},{"$f":"'1-Manager'!E320+'2-Manager'!E320+'3-Manager'!E320+'4-Manager'!E320+'5-Manager'!E320","v":166},850,null,5,11]
["2020-11-14",{"$f":"'1-Manager'!B321+'2-Manager'!B321+'3-Manager'!B321+'4-Manager'!B321+'5-Manager'!B321","v":328},{"$f":"'1-Manager'!C321+'2-Manager'!C321+'3-Manager'!C321+'4-Manager'!C321+'5-Manager'!C321","v":167},{"$f":"'1-Manager'!D321+'2-Manager'!D321+'3-Manager'!D321+'4-Manager'!D321+'5-Manager'!D321","v":252},{"$f":"'1-Manager'!E321+'2-Manager'!E321+'3-Manager'!E321+'4-Manager'!E321+'5-Manager'!E321","v":132},879,null,6,11]
["2020-11-15",{"$f":"'1-Manager'!B322+'2-Manager'!B322+'3-Manager'!B322+'4-Manager'!B322+'5-Manager'!B322","v":68},{"$f":"'1-Manager'!C322+'2-Manager'!C322+'3-Manager'!C322+'4-Manager'!C322+'5-Manager'!C322","v":60},{"$f":"'1-Manager'!D322+'2-Manager'!D322+'3-Manager'!D322+'4-Manager'!D322+'5-Manager'!D322","v":48},{"$f":"'1-Manager'!E322+'2-Manager'!E322+'3-Manager'!E322+'4-Manager'!E322+'5-Manager'!E322","v":45},221,null,7,11]
["2020-11-16",{"$f":"'1-Manager'!B323+'2-Manager'!B323+'3-Manager'!B323+'4-Manager'!B323+'5-Manager'!B323","v":149},{"$f":"'1-Manager'!C323+'2-Manager'!C323+'3-Manager'!C323+'4-Manager'!C323+'5-Manager'!C323","v":139},{"$f":"'1-Manager'!D323+'2-Manager'!D323+'3-Manager'!D323+'4-Manager'!D323+'5-Manager'!D323","v":324},{"$f":"'1-Manager'!E323+'2-Manager'!E323+'3-Manager'!E323+'4-Manager'!E323+'5-Manager'!E323","v":149},761,null,1,11]
["2020-11-17",{"$f":"'1-Manager'!B324+'2-Manager'!B324+'3-Manager'!B324+'4-Manager'!B324+'5-Manager'!B324","v":151},{"$f":"'1-Manager'!C324+'2-Manager'!C324+'3-Manager'!C324+'4-Manager'!C324+'5-Manager'!C324","v":118},{"$f":"'1-Manager'!D324+'2-Manager'!D324+'3-Manager'!D324+'4-Manager'!D324+'5-Manager'!D324","v":124},{"$f":"'1-Manager'!E324+'2-Manager'!E324+'3-Manager'!E324+'4-Manager'!E324+'5-Manager'!E324","v":154},{"$f":"SUM(B324:E324)","v":547},null,{"$f":"WEEKDAY(A324,2)","v":2},{"$f":"MONTH(A324)","v":11}]
["2020-11-18",{"$f":"'1-Manager'!B325+'2-Manager'!B325+'3-Manager'!B325+'4-Manager'!B325+'5-Manager'!B325","v":216},{"$f":"'1-Manager'!C325+'2-Manager'!C325+'3-Manager'!C325+'4-Manager'!C325+'5-Manager'!C325","v":116},{"$f":"'1-Manager'!D325+'2-Manager'!D325+'3-Manager'!D325+'4-Manager'!D325+'5-Manager'!D325","v":215},{"$f":"'1-Manager'!E325+'2-Manager'!E325+'3-Manager'!E325+'4-Manager'!E325+'5-Manager'!E325","v":94},641,null,3,11]
["2020-11-19",{"$f":"'1-Manager'!B326+'2-Manager'!B326+'3-Manager'!B326+'4-Manager'!B326+'5-Manager'!B326","v":425},{"$f":"'1-Manager'!C326+'2-Manager'!C326+'3-Manager'!C326+'4-Manager'!C326+'5-Manager'!C326","v":125},{"$f":"'1-Manager'!D326+'2-Manager'!D326+'3-Manager'!D326+'4-Manager'!D326+'5-Manager'!D326","v":204},{"$f":"'1-Manager'!E326+'2-Manager'!E326+'3-Manager'!E326+'4-Manager'!E326+'5-Manager'!E326","v":157},911,null,4,11]
["2020-11-20",{"$f":"'1-Manager'!B327+'2-Manager'!B327+'3-Manager'!B327+'4-Manager'!B327+'5-Manager'!B327","v":217},{"$f":"'1-Manager'!C327+'2-Manager'!C327+'3-Manager'!C327+'4-Manager'!C327+'5-Manager'!C327","v":113},{"$f":"'1-Manager'!D327+'2-Manager'!D327+'3-Manager'!D327+'4-Manager'!D327+'5-Manager'!D327","v":319},{"$f":"'1-Manager'!E327+'2-Manager'!E327+'3-Manager'!E327+'4-Manager'!E327+'5-Manager'!E327","v":233},882,null,5,11]
["2020-11-21",{"$f":"'1-Manager'!B328+'2-Manager'!B328+'3-Manager'!B328+'4-Manager'!B328+'5-Manager'!B328","v":203},{"$f":"'1-Manager'!C328+'2-Manager'!C328+'3-Manager'!C328+'4-Manager'!C328+'5-Manager'!C328","v":99},{"$f":"'1-Manager'!D328+'2-Manager'!D328+'3-Manager'!D328+'4-Manager'!D328+'5-Manager'!D328","v":345},{"$f":"'1-Manager'!E328+'2-Manager'!E328+'3-Manager'!E328+'4-Manager'!E328+'5-Manager'!E328","v":126},773,null,6,11]
["2020-11-22",{"$f":"'1-Manager'!B329+'2-Manager'!B329+'3-Manager'!B329+'4-Manager'!B329+'5-Manager'!B329","v":57},{"$f":"'1-Manager'!C329+'2-Manager'!C329+'3-Manager'!C329+'4-Manager'!C329+'5-Manager'!C329","v":62},{"$f":"'1-Manager'!D329+'2-Manager'!D329+'3-Manager'!D329+'4-Manager'!D329+'5-Manager'!D329","v":125},{"$f":"'1-Manager'!E329+'2-Manager'!E329+'3-Manager'!E329+'4-Manager'!E329+'5-Manager'!E329","v":49},293,null,7,11]
["2020-11-23",{"$f":"'1-Manager'!B330+'2-Manager'!B330+'3-Manager'!B330+'4-Manager'!B330+'5-Manager'!B330","v":274},{"$f":"'1-Manager'!C330+'2-Manager'!C330+'3-Manager'!C330+'4-Manager'!C330+'5-Manager'!C330","v":114},{"$f":"'1-Manager'!D330+'2-Manager'!D330+'3-Manager'!D330+'4-Manager'!D330+'5-Manager'!D330","v":232},{"$f":"'1-Manager'!E330+'2-Manager'!E330+'3-Manager'!E330+'4-Manager'!E330+'5-Manager'!E330","v":173},793,null,1,11]
["2020-11-24",{"$f":"'1-Manager'!B331+'2-Manager'!B331+'3-Manager'!B331+'4-Manager'!B331+'5-Manager'!B331","v":204},{"$f":"'1-Manager'!C331+'2-Manager'!C331+'3-Manager'!C331+'4-Manager'!C331+'5-Manager'!C331","v":175},{"$f":"'1-Manager'!D331+'2-Manager'!D331+'3-Manager'!D331+'4-Manager'!D331+'5-Manager'!D331","v":265},{"$f":"'1-Manager'!E331+'2-Manager'!E331+'3-Manager'!E331+'4-Manager'!E331+'5-Manager'!E331","v":77},721,null,2,11]
["2020-11-25",{"$f":"'1-Manager'!B332+'2-Manager'!B332+'3-Manager'!B332+'4-Manager'!B332+'5-Manager'!B332","v":251},{"$f":"'1-Manager'!C332+'2-Manager'!C332+'3-Manager'!C332+'4-Manager'!C332+'5-Manager'!C332","v":188},{"$f":"'1-Manager'!D332+'2-Manager'!D332+'3-Manager'!D332+'4-Manager'!D332+'5-Manager'!D332","v":209},{"$f":"'1-Manager'!E332+'2-Manager'!E332+'3-Manager'!E332+'4-Manager'!E332+'5-Manager'!E332","v":149},797,null,3,11]
["2020-11-26",{"$f":"'1-Manager'!B333+'2-Manager'!B333+'3-Manager'!B333+'4-Manager'!B333+'5-Manager'!B333","v":250},{"$f":"'1-Manager'!C333+'2-Manager'!C333+'3-Manager'!C333+'4-Manager'!C333+'5-Manager'!C333","v":126},{"$f":"'1-Manager'!D333+'2-Manager'!D333+'3-Manager'!D333+'4-Manager'!D333+'5-Manager'!D333","v":248},{"$f":"'1-Manager'!E333+'2-Manager'!E333+'3-Manager'!E333+'4-Manager'!E333+'5-Manager'!E333","v":144},768,null,4,11]
["2020-11-27",{"$f":"'1-Manager'!B334+'2-Manager'!B334+'3-Manager'!B334+'4-Manager'!B334+'5-Manager'!B334","v":424},{"$f":"'1-Manager'!C334+'2-Manager'!C334+'3-Manager'!C334+'4-Manager'!C334+'5-Manager'!C334","v":173},{"$f":"'1-Manager'!D334+'2-Manager'!D334+'3-Manager'!D334+'4-Manager'!D334+'5-Manager'!D334","v":285},{"$f":"'1-Manager'!E334+'2-Manager'!E334+'3-Manager'!E334+'4-Manager'!E334+'5-Manager'!E334","v":128},1010,null,5,11]
["2020-11-28",{"$f":"'1-Manager'!B335+'2-Manager'!B335+'3-Manager'!B335+'4-Manager'!B335+'5-Manager'!B335","v":334},{"$f":"'1-Manager'!C335+'2-Manager'!C335+'3-Manager'!C335+'4-Manager'!C335+'5-Manager'!C335","v":155},{"$f":"'1-Manager'!D335+'2-Manager'!D335+'3-Manager'!D335+'4-Manager'!D335+'5-Manager'!D335","v":270},{"$f":"'1-Manager'!E335+'2-Manager'!E335+'3-Manager'!E335+'4-Manager'!E335+'5-Manager'!E335","v":155},914,null,6,11]
["2020-11-29",{"$f":"'1-Manager'!B336+'2-Manager'!B336+'3-Manager'!B336+'4-Manager'!B336+'5-Manager'!B336","v":66},{"$f":"'1-Manager'!C336+'2-Manager'!C336+'3-Manager'!C336+'4-Manager'!C336+'5-Manager'!C336","v":53},{"$f":"'1-Manager'!D336+'2-Manager'!D336+'3-Manager'!D336+'4-Manager'!D336+'5-Manager'!D336","v":92},{"$f":"'1-Manager'!E336+'2-Manager'!E336+'3-Manager'!E336+'4-Manager'!E336+'5-Manager'!E336","v":53},264,null,7,11]
["2020-11-30",{"$f":"'1-Manager'!B337+'2-Manager'!B337+'3-Manager'!B337+'4-Manager'!B337+'5-Manager'!B337","v":219},{"$f":"'1-Manager'!C337+'2-Manager'!C337+'3-Manager'!C337+'4-Manager'!C337+'5-Manager'!C337","v":153},{"$f":"'1-Manager'!D337+'2-Manager'!D337+'3-Manager'!D337+'4-Manager'!D337+'5-Manager'!D337","v":196},{"$f":"'1-Manager'!E337+'2-Manager'!E337+'3-Manager'!E337+'4-Manager'!E337+'5-Manager'!E337","v":87},655,null,1,11]
["2020-12-01",{"$f":"'1-Manager'!B338+'2-Manager'!B338+'3-Manager'!B338+'4-Manager'!B338+'5-Manager'!B338","v":232},{"$f":"'1-Manager'!C338+'2-Manager'!C338+'3-Manager'!C338+'4-Manager'!C338+'5-Manager'!C338","v":133},{"$f":"'1-Manager'!D338+'2-Manager'!D338+'3-Manager'!D338+'4-Manager'!D338+'5-Manager'!D338","v":220},{"$f":"'1-Manager'!E338+'2-Manager'!E338+'3-Manager'!E338+'4-Manager'!E338+'5-Manager'!E338","v":175},760,null,2,12]
["2020-12-02",{"$f":"'1-Manager'!B339+'2-Manager'!B339+'3-Manager'!B339+'4-Manager'!B339+'5-Manager'!B339","v":151},{"$f":"'1-Manager'!C339+'2-Manager'!C339+'3-Manager'!C339+'4-Manager'!C339+'5-Manager'!C339","v":110},{"$f":"'1-Manager'!D339+'2-Manager'!D339+'3-Manager'!D339+'4-Manager'!D339+'5-Manager'!D339","v":187},{"$f":"'1-Manager'!E339+'2-Manager'!E339+'3-Manager'!E339+'4-Manager'!E339+'5-Manager'!E339","v":176},624,null,3,12]
["2020-12-03",{"$f":"'1-Manager'!B340+'2-Manager'!B340+'3-Manager'!B340+'4-Manager'!B340+'5-Manager'!B340","v":180},{"$f":"'1-Manager'!C340+'2-Manager'!C340+'3-Manager'!C340+'4-Manager'!C340+'5-Manager'!C340","v":112},{"$f":"'1-Manager'!D340+'2-Manager'!D340+'3-Manager'!D340+'4-Manager'!D340+'5-Manager'!D340","v":192},{"$f":"'1-Manager'!E340+'2-Manager'!E340+'3-Manager'!E340+'4-Manager'!E340+'5-Manager'!E340","v":125},609,null,4,12]
["2020-12-04",{"$f":"'1-Manager'!B341+'2-Manager'!B341+'3-Manager'!B341+'4-Manager'!B341+'5-Manager'!B341","v":313},{"$f":"'1-Manager'!C341+'2-Manager'!C341+'3-Manager'!C341+'4-Manager'!C341+'5-Manager'!C341","v":156},{"$f":"'1-Manager'!D341+'2-Manager'!D341+'3-Manager'!D341+'4-Manager'!D341+'5-Manager'!D341","v":199},{"$f":"'1-Manager'!E341+'2-Manager'!E341+'3-Manager'!E341+'4-Manager'!E341+'5-Manager'!E341","v":149},817,null,5,12]
["2020-12-05",{"$f":"'1-Manager'!B342+'2-Manager'!B342+'3-Manager'!B342+'4-Manager'!B342+'5-Manager'!B342","v":345},{"$f":"'1-Manager'!C342+'2-Manager'!C342+'3-Manager'!C342+'4-Manager'!C342+'5-Manager'!C342","v":173},{"$f":"'1-Manager'!D342+'2-Manager'!D342+'3-Manager'!D342+'4-Manager'!D342+'5-Manager'!D342","v":338},{"$f":"'1-Manager'!E342+'2-Manager'!E342+'3-Manager'!E342+'4-Manager'!E342+'5-Manager'!E342","v":91},947,null,6,12]
["2020-12-06",{"$f":"'1-Manager'!B343+'2-Manager'!B343+'3-Manager'!B343+'4-Manager'!B343+'5-Manager'!B343","v":124},{"$f":"'1-Manager'!C343+'2-Manager'!C343+'3-Manager'!C343+'4-Manager'!C343+'5-Manager'!C343","v":21},{"$f":"'1-Manager'!D343+'2-Manager'!D343+'3-Manager'!D343+'4-Manager'!D343+'5-Manager'!D343","v":86},{"$f":"'1-Manager'!E343+'2-Manager'!E343+'3-Manager'!E343+'4-Manager'!E343+'5-Manager'!E343","v":46},277,null,7,12]
["2020-12-07",{"$f":"'1-Manager'!B344+'2-Manager'!B344+'3-Manager'!B344+'4-Manager'!B344+'5-Manager'!B344","v":187},{"$f":"'1-Manager'!C344+'2-Manager'!C344+'3-Manager'!C344+'4-Manager'!C344+'5-Manager'!C344","v":152},{"$f":"'1-Manager'!D344+'2-Manager'!D344+'3-Manager'!D344+'4-Manager'!D344+'5-Manager'!D344","v":320},{"$f":"'1-Manager'!E344+'2-Manager'!E344+'3-Manager'!E344+'4-Manager'!E344+'5-Manager'!E344","v":177},836,null,1,12]
["2020-12-08",{"$f":"'1-Manager'!B345+'2-Manager'!B345+'3-Manager'!B345+'4-Manager'!B345+'5-Manager'!B345","v":257},{"$f":"'1-Manager'!C345+'2-Manager'!C345+'3-Manager'!C345+'4-Manager'!C345+'5-Manager'!C345","v":78},{"$f":"'1-Manager'!D345+'2-Manager'!D345+'3-Manager'!D345+'4-Manager'!D345+'5-Manager'!D345","v":285},{"$f":"'1-Manager'!E345+'2-Manager'!E345+'3-Manager'!E345+'4-Manager'!E345+'5-Manager'!E345","v":108},728,null,2,12]
["2020-12-09",{"$f":"'1-Manager'!B346+'2-Manager'!B346+'3-Manager'!B346+'4-Manager'!B346+'5-Manager'!B346","v":197},{"$f":"'1-Manager'!C346+'2-Manager'!C346+'3-Manager'!C346+'4-Manager'!C346+'5-Manager'!C346","v":140},{"$f":"'1-Manager'!D346+'2-Manager'!D346+'3-Manager'!D346+'4-Manager'!D346+'5-Manager'!D346","v":333},{"$f":"'1-Manager'!E346+'2-Manager'!E346+'3-Manager'!E346+'4-Manager'!E346+'5-Manager'!E346","v":161},831,null,3,12]
["2020-12-10",{"$f":"'1-Manager'!B347+'2-Manager'!B347+'3-Manager'!B347+'4-Manager'!B347+'5-Manager'!B347","v":345},{"$f":"'1-Manager'!C347+'2-Manager'!C347+'3-Manager'!C347+'4-Manager'!C347+'5-Manager'!C347","v":188},{"$f":"'1-Manager'!D347+'2-Manager'!D347+'3-Manager'!D347+'4-Manager'!D347+'5-Manager'!D347","v":319},{"$f":"'1-Manager'!E347+'2-Manager'!E347+'3-Manager'!E347+'4-Manager'!E347+'5-Manager'!E347","v":110},962,null,4,12]
["2020-12-11",{"$f":"'1-Manager'!B348+'2-Manager'!B348+'3-Manager'!B348+'4-Manager'!B348+'5-Manager'!B348","v":331},{"$f":"'1-Manager'!C348+'2-Manager'!C348+'3-Manager'!C348+'4-Manager'!C348+'5-Manager'!C348","v":258},{"$f":"'1-Manager'!D348+'2-Manager'!D348+'3-Manager'!D348+'4-Manager'!D348+'5-Manager'!D348","v":332},{"$f":"'1-Manager'!E348+'2-Manager'!E348+'3-Manager'!E348+'4-Manager'!E348+'5-Manager'!E348","v":199},1120,null,5,12]
["2020-12-12",{"$f":"'1-Manager'!B349+'2-Manager'!B349+'3-Manager'!B349+'4-Manager'!B349+'5-Manager'!B349","v":327},{"$f":"'1-Manager'!C349+'2-Manager'!C349+'3-Manager'!C349+'4-Manager'!C349+'5-Manager'!C349","v":227},{"$f":"'1-Manager'!D349+'2-Manager'!D349+'3-Manager'!D349+'4-Manager'!D349+'5-Manager'!D349","v":285},{"$f":"'1-Manager'!E349+'2-Manager'!E349+'3-Manager'!E349+'4-Manager'!E349+'5-Manager'!E349","v":170},1009,null,6,12]
["2020-12-13",{"$f":"'1-Manager'!B350+'2-Manager'!B350+'3-Manager'!B350+'4-Manager'!B350+'5-Manager'!B350","v":82},{"$f":"'1-Manager'!C350+'2-Manager'!C350+'3-Manager'!C350+'4-Manager'!C350+'5-Manager'!C350","v":27},{"$f":"'1-Manager'!D350+'2-Manager'!D350+'3-Manager'!D350+'4-Manager'!D350+'5-Manager'!D350","v":88},{"$f":"'1-Manager'!E350+'2-Manager'!E350+'3-Manager'!E350+'4-Manager'!E350+'5-Manager'!E350","v":56},253,null,7,12]
["2020-12-14",{"$f":"'1-Manager'!B351+'2-Manager'!B351+'3-Manager'!B351+'4-Manager'!B351+'5-Manager'!B351","v":150},{"$f":"'1-Manager'!C351+'2-Manager'!C351+'3-Manager'!C351+'4-Manager'!C351+'5-Manager'!C351","v":111},{"$f":"'1-Manager'!D351+'2-Manager'!D351+'3-Manager'!D351+'4-Manager'!D351+'5-Manager'!D351","v":169},{"$f":"'1-Manager'!E351+'2-Manager'!E351+'3-Manager'!E351+'4-Manager'!E351+'5-Manager'!E351","v":124},554,null,1,12]
["2020-12-15",{"$f":"'1-Manager'!B352+'2-Manager'!B352+'3-Manager'!B352+'4-Manager'!B352+'5-Manager'!B352","v":269},{"$f":"'1-Manager'!C352+'2-Manager'!C352+'3-Manager'!C352+'4-Manager'!C352+'5-Manager'!C352","v":193},{"$f":"'1-Manager'!D352+'2-Manager'!D352+'3-Manager'!D352+'4-Manager'!D352+'5-Manager'!D352","v":322},{"$f":"'1-Manager'!E352+'2-Manager'!E352+'3-Manager'!E352+'4-Manager'!E352+'5-Manager'!E352","v":109},893,null,2,12]
["2020-12-16",{"$f":"'1-Manager'!B353+'2-Manager'!B353+'3-Manager'!B353+'4-Manager'!B353+'5-Manager'!B353","v":219},{"$f":"'1-Manager'!C353+'2-Manager'!C353+'3-Manager'!C353+'4-Manager'!C353+'5-Manager'!C353","v":133},{"$f":"'1-Manager'!D353+'2-Manager'!D353+'3-Manager'!D353+'4-Manager'!D353+'5-Manager'!D353","v":365},{"$f":"'1-Manager'!E353+'2-Manager'!E353+'3-Manager'!E353+'4-Manager'!E353+'5-Manager'!E353","v":137},854,null,3,12]
["2020-12-17",{"$f":"'1-Manager'!B354+'2-Manager'!B354+'3-Manager'!B354+'4-Manager'!B354+'5-Manager'!B354","v":208},{"$f":"'1-Manager'!C354+'2-Manager'!C354+'3-Manager'!C354+'4-Manager'!C354+'5-Manager'!C354","v":230},{"$f":"'1-Manager'!D354+'2-Manager'!D354+'3-Manager'!D354+'4-Manager'!D354+'5-Manager'!D354","v":241},{"$f":"'1-Manager'!E354+'2-Manager'!E354+'3-Manager'!E354+'4-Manager'!E354+'5-Manager'!E354","v":129},808,null,4,12]
["2020-12-18",{"$f":"'1-Manager'!B355+'2-Manager'!B355+'3-Manager'!B355+'4-Manager'!B355+'5-Manager'!B355","v":247},{"$f":"'1-Manager'!C355+'2-Manager'!C355+'3-Manager'!C355+'4-Manager'!C355+'5-Manager'!C355","v":165},{"$f":"'1-Manager'!D355+'2-Manager'!D355+'3-Manager'!D355+'4-Manager'!D355+'5-Manager'!D355","v":342},{"$f":"'1-Manager'!E355+'2-Manager'!E355+'3-Manager'!E355+'4-Manager'!E355+'5-Manager'!E355","v":135},889,null,5,12]
["2020-12-19",{"$f":"'1-Manager'!B356+'2-Manager'!B356+'3-Manager'!B356+'4-Manager'!B356+'5-Manager'!B356","v":328},{"$f":"'1-Manager'!C356+'2-Manager'!C356+'3-Manager'!C356+'4-Manager'!C356+'5-Manager'!C356","v":98},{"$f":"'1-Manager'!D356+'2-Manager'!D356+'3-Manager'!D356+'4-Manager'!D356+'5-Manager'!D356","v":253},{"$f":"'1-Manager'!E356+'2-Manager'!E356+'3-Manager'!E356+'4-Manager'!E356+'5-Manager'!E356","v":114},793,null,6,12]
["2020-12-20",{"$f":"'1-Manager'!B357+'2-Manager'!B357+'3-Manager'!B357+'4-Manager'!B357+'5-Manager'!B357","v":96},{"$f":"'1-Manager'!C357+'2-Manager'!C357+'3-Manager'!C357+'4-Manager'!C357+'5-Manager'!C357","v":39},{"$f":"'1-Manager'!D357+'2-Manager'!D357+'3-Manager'!D357+'4-Manager'!D357+'5-Manager'!D357","v":136},{"$f":"'1-Manager'!E357+'2-Manager'!E357+'3-Manager'!E357+'4-Manager'!E357+'5-Manager'!E357","v":50},321,null,7,12]
["2020-12-21",{"$f":"'1-Manager'!B358+'2-Manager'!B358+'3-Manager'!B358+'4-Manager'!B358+'5-Manager'!B358","v":169},{"$f":"'1-Manager'!C358+'2-Manager'!C358+'3-Manager'!C358+'4-Manager'!C358+'5-Manager'!C358","v":179},{"$f":"'1-Manager'!D358+'2-Manager'!D358+'3-Manager'!D358+'4-Manager'!D358+'5-Manager'!D358","v":261},{"$f":"'1-Manager'!E358+'2-Manager'!E358+'3-Manager'!E358+'4-Manager'!E358+'5-Manager'!E358","v":144},753,null,1,12]
["2020-12-22",{"$f":"'1-Manager'!B359+'2-Manager'!B359+'3-Manager'!B359+'4-Manager'!B359+'5-Manager'!B359","v":274},{"$f":"'1-Manager'!C359+'2-Manager'!C359+'3-Manager'!C359+'4-Manager'!C359+'5-Manager'!C359","v":126},{"$f":"'1-Manager'!D359+'2-Manager'!D359+'3-Manager'!D359+'4-Manager'!D359+'5-Manager'!D359","v":287},{"$f":"'1-Manager'!E359+'2-Manager'!E359+'3-Manager'!E359+'4-Manager'!E359+'5-Manager'!E359","v":132},819,null,2,12]
["2020-12-23",{"$f":"'1-Manager'!B360+'2-Manager'!B360+'3-Manager'!B360+'4-Manager'!B360+'5-Manager'!B360","v":240},{"$f":"'1-Manager'!C360+'2-Manager'!C360+'3-Manager'!C360+'4-Manager'!C360+'5-Manager'!C360","v":169},{"$f":"'1-Manager'!D360+'2-Manager'!D360+'3-Manager'!D360+'4-Manager'!D360+'5-Manager'!D360","v":369},{"$f":"'1-Manager'!E360+'2-Manager'!E360+'3-Manager'!E360+'4-Manager'!E360+'5-Manager'!E360","v":148},926,null,3,12]
["2020-12-24",{"$f":"'1-Manager'!B361+'2-Manager'!B361+'3-Manager'!B361+'4-Manager'!B361+'5-Manager'!B361","v":291},{"$f":"'1-Manager'!C361+'2-Manager'!C361+'3-Manager'!C361+'4-Manager'!C361+'5-Manager'!C361","v":137},{"$f":"'1-Manager'!D361+'2-Manager'!D361+'3-Manager'!D361+'4-Manager'!D361+'5-Manager'!D361","v":111},{"$f":"'1-Manager'!E361+'2-Manager'!E361+'3-Manager'!E361+'4-Manager'!E361+'5-Manager'!E361","v":177},716,null,4,12]
["2020-12-25",{"$f":"'1-Manager'!B362+'2-Manager'!B362+'3-Manager'!B362+'4-Manager'!B362+'5-Manager'!B362","v":377},{"$f":"'1-Manager'!C362+'2-Manager'!C362+'3-Manager'!C362+'4-Manager'!C362+'5-Manager'!C362","v":145},{"$f":"'1-Manager'!D362+'2-Manager'!D362+'3-Manager'!D362+'4-Manager'!D362+'5-Manager'!D362","v":185},{"$f":"'1-Manager'!E362+'2-Manager'!E362+'3-Manager'!E362+'4-Manager'!E362+'5-Manager'!E362","v":114},821,null,5,12]
["2020-12-26",{"$f":"'1-Manager'!B363+'2-Manager'!B363+'3-Manager'!B363+'4-Manager'!B363+'5-Manager'!B363","v":397},{"$f":"'1-Manager'!C363+'2-Manager'!C363+'3-Manager'!C363+'4-Manager'!C363+'5-Manager'!C363","v":185},{"$f":"'1-Manager'!D363+'2-Manager'!D363+'3-Manager'!D363+'4-Manager'!D363+'5-Manager'!D363","v":279},{"$f":"'1-Manager'!E363+'2-Manager'!E363+'3-Manager'!E363+'4-Manager'!E363+'5-Manager'!E363","v":147},1008,null,6,12]
["2020-12-27",{"$f":"'1-Manager'!B364+'2-Manager'!B364+'3-Manager'!B364+'4-Manager'!B364+'5-Manager'!B364","v":96},{"$f":"'1-Manager'!C364+'2-Manager'!C364+'3-Manager'!C364+'4-Manager'!C364+'5-Manager'!C364","v":67},{"$f":"'1-Manager'!D364+'2-Manager'!D364+'3-Manager'!D364+'4-Manager'!D364+'5-Manager'!D364","v":88},{"$f":"'1-Manager'!E364+'2-Manager'!E364+'3-Manager'!E364+'4-Manager'!E364+'5-Manager'!E364","v":46},297,null,7,12]
["2020-12-28",{"$f":"'1-Manager'!B365+'2-Manager'!B365+'3-Manager'!B365+'4-Manager'!B365+'5-Manager'!B365","v":247},{"$f":"'1-Manager'!C365+'2-Manager'!C365+'3-Manager'!C365+'4-Manager'!C365+'5-Manager'!C365","v":174},{"$f":"'1-Manager'!D365+'2-Manager'!D365+'3-Manager'!D365+'4-Manager'!D365+'5-Manager'!D365","v":290},{"$f":"'1-Manager'!E365+'2-Manager'!E365+'3-Manager'!E365+'4-Manager'!E365+'5-Manager'!E365","v":136},847,null,1,12]
["2020-12-29",{"$f":"'1-Manager'!B366+'2-Manager'!B366+'3-Manager'!B366+'4-Manager'!B366+'5-Manager'!B366","v":147},{"$f":"'1-Manager'!C366+'2-Manager'!C366+'3-Manager'!C366+'4-Manager'!C366+'5-Manager'!C366","v":87},{"$f":"'1-Manager'!D366+'2-Manager'!D366+'3-Manager'!D366+'4-Manager'!D366+'5-Manager'!D366","v":157},{"$f":"'1-Manager'!E366+'2-Manager'!E366+'3-Manager'!E366+'4-Manager'!E366+'5-Manager'!E366","v":96},487,null,2,12]
["2020-12-30",{"$f":"'1-Manager'!B367+'2-Manager'!B367+'3-Manager'!B367+'4-Manager'!B367+'5-Manager'!B367","v":214},{"$f":"'1-Manager'!C367+'2-Manager'!C367+'3-Manager'!C367+'4-Manager'!C367+'5-Manager'!C367","v":147},{"$f":"'1-Manager'!D367+'2-Manager'!D367+'3-Manager'!D367+'4-Manager'!D367+'5-Manager'!D367","v":231},{"$f":"'1-Manager'!E367+'2-Manager'!E367+'3-Manager'!E367+'4-Manager'!E367+'5-Manager'!E367","v":106},698,null,3,12]
["2020-12-31",{"$f":"'1-Manager'!B368+'2-Manager'!B368+'3-Manager'!B368+'4-Manager'!B368+'5-Manager'!B368","v":276},{"$f":"'1-Manager'!C368+'2-Manager'!C368+'3-Manager'!C368+'4-Manager'!C368+'5-Manager'!C368","v":214},{"$f":"'1-Manager'!D368+'2-Manager'!D368+'3-Manager'!D368+'4-Manager'!D368+'5-Manager'!D368","v":300},{"$f":"'1-Manager'!E368+'2-Manager'!E368+'3-Manager'!E368+'4-Manager'!E368+'5-Manager'!E368","v":71},861,null,4,12]
[null,null,null,null,null,{"$f":"SUM(F3:F368)","v":263415}]

{"sheet":"Processing","index":7,"n_rows":48,"n_cols":30,"rows_kept":48,"cut":false,"hidden":false,"merged":[[1,29,1,39]]}
[{"$f":"'1-Manager'!F369","v":83893},{"$f":"\"1-MANAGER\"&CHAR(10)&\"$\"&TEXT(A1,\"# ###\")","v":"1-MANAGER\n$83 893"},"new","ALL","Mon","Tue","Wed","Thu","Fri","Sat","Sun",null,"Mon","Tue","Wed","Thu","Fri","Sat","Sun",null,"A",{"$f":"SUM(E2:K2)","v":83164},{"$f":"INDEX($U$1:$U$4,SMALL(IF($V$1:$V$4=X1,ROW($V$1:$V$4)),COUNTIF($X$1:X1,X1)))","v":"C"},{"$f":"LARGE($V$1:$V$4,1)","v":83945},{"$f":"MAX($X$1:$X$4)-X1","v":0},null,"Alabama",{"$f":"IF(AC1=0,$AD$1,AC1)","v":13784},{"$f":"INDEX(ALL!$L$2:$Q$49,MATCH(Processing!AA1,ALL!$K$2:$K$49,0),MATCH(Processing!$D$1,ALL!$L$1:$Q$1,0))","v":13784},1000]
[{"$f":"'2-Manager'!F369","v":68104},{"$f":"\"2-MANAGER\"&CHAR(10)&\"$\"&TEXT(A2,\"# ###\")","v":"2-MANAGER\n$68 104"},"A","$B$3:$B$368",{"$f":"SUMIFS(INDIRECT(\"'\"&$D$1&\"'!\"&$D2),INDIRECT(\"'\"&$D$1&\"'!$H$3:$H$368\"),Processing!E$6)","v":10897},{"$f":"SUMIFS(INDIRECT(\"'\"&$D$1&\"'!\"&$D2),INDIRECT(\"'\"&$D$1&\"'!$H$3:$H$368\"),Processing!F$6)","v":12747},{"$f":"SUMIFS(INDIRECT(\"'\"&$D$1&\"'!\"&$D2),INDIRECT(\"'\"&$D$1&\"'!$H$3:$H$368\"),Processing!G$6)","v":11947},{"$f":"SUMIFS(INDIRECT(\"'\"&$D$1&\"'!\"&$D2),INDIRECT(\"'\"&$D$1&\"'!$H$3:$H$368\"),Processing!H$6)","v":14221},{"$f":"SUMIFS(INDIRECT(\"'\"&$D$1&\"'!\"&$D2),INDIRECT(\"'\"&$D$1&\"'!$H$3:$H$368\"),Processing!I$6)","v":14699},{"$f":"SUMIFS(INDIRECT(\"'\"&$D$1&\"'!\"&$D2),INDIRECT(\"'\"&$D$1&\"'!$H$3:$H$368\"),Processing!J$6)","v":13928},{"$f":"SUMIFS(INDIRECT(\"'\"&$D$1&\"'!\"&$D2),INDIRECT(\"'\"&$D$1&\"'!$H$3:$H$368\"),Processing!K$6)","v":4725},null,10,10,10,10,10,10,10,null,"B",{"$f":"SUM(E3:K3)","v":49206},{"$f":"INDEX($U$1:$U$4,SMALL(IF($V$1:$V$4=X2,ROW($V$1:$V$4)),COUNTIF($X$1:X2,X2)))","v":"A"},{"$f":"LARGE($V$1:$V$4,2)","v":83164},{"$f":"MAX($X$1:$X$4)-X2","v":781},null,"Arizona",{"$f":"IF(AC2=0,$AD$1,AC2)","v":13369},{"$f":"INDEX(ALL!$L$2:$Q$49,MATCH(Processing!AA2,ALL!$K$2:$K$49,0),MATCH(Processing!$D$1,ALL!$L$1:$Q$1,0))","v":13369},"https://exceltable.com/en/templates/3d-menu-for-dashboard-in-excel"]
[{"$f":"'3-Manager'!F369","v":50044},{"$f":"\"3-MANAGER\"&CHAR(10)&\"$\"&TEXT(A3,\"# ###\")","v":"3-MANAGER\n$50 044"},"B","$C$3:$C$368",{"$f":"SUMIFS(INDIRECT(\"'\"&$D$1&\"'!\"&$D3),INDIRECT(\"'\"&$D$1&\"'!$H$3:$H$368\"),Processing!E$6)","v":6866},{"$f":"SUMIFS(INDIRECT(\"'\"&$D$1&\"'!\"&$D3),INDIRECT(\"'\"&$D$1&\"'!$H$3:$H$368\"),Processing!F$6)","v":6744},{"$f":"SUMIFS(INDIRECT(\"'\"&$D$1&\"'!\"&$D3),INDIRECT(\"'\"&$D$1&\"'!$H$3:$H$368\"),Processing!G$6)","v":7949},{"$f":"SUMIFS(INDIRECT(\"'\"&$D$1&\"'!\"&$D3),INDIRECT(\"'\"&$D$1&\"'!$H$3:$H$368\"),Processing!H$6)","v":8034},{"$f":"SUMIFS(INDIRECT(\"'\"&$D$1&\"'!\"&$D3),INDIRECT(\"'\"&$D$1&\"'!$H$3:$H$368\"),Processing!I$6)","v":8758},{"$f":"SUMIFS(INDIRECT(\"'\"&$D$1&\"'!\"&$D3),INDIRECT(\"'\"&$D$1&\"'!$H$3:$H$368\"),Processing!J$6)","v":8254},{"$f":"SUMIFS(INDIRECT(\"'\"&$D$1&\"'!\"&$D3),INDIRECT(\"'\"&$D$1&\"'!$H$3:$H$368\"),Processing!K$6)","v":2601},null,10,10,10,10,10,10,10,null,"C",{"$f":"SUM(E4:K4)","v":83945},{"$f":"INDEX($U$1:$U$4,SMALL(IF($V$1:$V$4=X3,ROW($V$1:$V$4)),COUNTIF($X$1:X3,X3)))","v":"B"},{"$f":"LARGE($V$1:$V$4,3)","v":49206},34739,null,"Arkansas",7209,{"$f":"INDEX(ALL!$L$2:$Q$49,MATCH(Processing!AA3,ALL!$K$2:$K$49,0),MATCH(Processing!$D$1,ALL!$L$1:$Q$1,0))","v":7209}]
[{"$f":"'4-Manager'!F369","v":31442},{"$f":"\"4-MANAGER\"&CHAR(10)&\"$\"&TEXT(A4,\"# ###\")","v":"4-MANAGER\n$31 442"},"C","$D$3:$D$368",{"$f":"SUMIFS(INDIRECT(\"'\"&$D$1&\"'!\"&$D4),INDIRECT(\"'\"&$D$1&\"'!$H$3:$H$368\"),Processing!E$6)","v":11990},{"$f":"SUMIFS(INDIRECT(\"'\"&$D$1&\"'!\"&$D4),INDIRECT(\"'\"&$D$1&\"'!$H$3:$H$368\"),Processing!F$6)","v":12719},{"$f":"SUMIFS(INDIRECT(\"'\"&$D$1&\"'!\"&$D4),INDIRECT(\"'\"&$D$1&\"'!$H$3:$H$368\"),Processing!G$6)","v":14365},{"$f":"SUMIFS(INDIRECT(\"'\"&$D$1&\"'!\"&$D4),INDIRECT(\"'\"&$D$1&\"'!$H$3:$H$368\"),Processing!H$6)","v":12465},{"$f":"SUMIFS(INDIRECT(\"'\"&$D$1&\"'!\"&$D4),INDIRECT(\"'\"&$D$1&\"'!$H$3:$H$368\"),Processing!I$6)","v":14205},{"$f":"SUMIFS(INDIRECT(\"'\"&$D$1&\"'!\"&$D4),INDIRECT(\"'\"&$D$1&\"'!$H$3:$H$368\"),Processing!J$6)","v":13596},{"$f":"SUMIFS(INDIRECT(\"'\"&$D$1&\"'!\"&$D4),INDIRECT(\"'\"&$D$1&\"'!$H$3:$H$368\"),Processing!K$6)","v":4605},null,10,10,10,10,10,10,10,null,"D",{"$f":"SUM(E5:K5)","v":47100},{"$f":"INDEX($U$1:$U$4,SMALL(IF($V$1:$V$4=X4,ROW($V$1:$V$4)),COUNTIF($X$1:X4,X4)))","v":"D"},{"$f":"LARGE($V$1:$V$4,4)","v":47100},36845,null,"California",7262,{"$f":"INDEX(ALL!$L$2:$Q$49,MATCH(Processing!AA4,ALL!$K$2:$K$49,0),MATCH(Processing!$D$1,ALL!$L$1:$Q$1,0))","v":7262}]
[{"$f":"'5-Manager'!F369","v":29932},{"$f":"\"5-MANAGER\"&CHAR(10)&\"$\"&TEXT(A5,\"# ###\")","v":"5-MANAGER\n$29 932"},"D","$E$3:$E$368",{"$f":"SUMIFS(INDIRECT(\"'\"&$D$1&\"'!\"&$D5),INDIRECT(\"'\"&$D$1&\"'!$H$3:$H$368\"),Processing!E$6)","v":7476},{"$f":"SUMIFS(INDIRECT(\"'\"&$D$1&\"'!\"&$D5),INDIRECT(\"'\"&$D$1&\"'!$H$3:$H$368\"),Processing!F$6)","v":7026},{"$f":"SUMIFS(INDIRECT(\"'\"&$D$1&\"'!\"&$D5),INDIRECT(\"'\"&$D$1&\"'!$H$3:$H$368\"),Processing!G$6)","v":7336},{"$f":"SUMIFS(INDIRECT(\"'\"&$D$1&\"'!\"&$D5),INDIRECT(\"'\"&$D$1&\"'!$H$3:$H$368\"),Processing!H$6)","v":7647},{"$f":"SUMIFS(INDIRECT(\"'\"&$D$1&\"'!\"&$D5),INDIRECT(\"'\"&$D$1&\"'!$H$3:$H$368\"),Processing!I$6)","v":8376},{"$f":"SUMIFS(INDIRECT(\"'\"&$D$1&\"'!\"&$D5),INDIRECT(\"'\"&$D$1&\"'!$H$3:$H$368\"),Processing!J$6)","v":6556},{"$f":"SUMIFS(INDIRECT(\"'\"&$D$1&\"'!\"&$D5),INDIRECT(\"'\"&$D$1&\"'!$H$3:$H$368\"),Processing!K$6)","v":2683},null,10,10,10,10,10,10,10,null,null,null,null,null,null,null,"Colorado",7077,{"$f":"INDEX(ALL!$L$2:$Q$49,MATCH(Processing!AA5,ALL!$K$2:$K$49,0),MATCH(Processing!$D$1,ALL!$L$1:$Q$1,0))","v":7077}]
[null,null,"old","1-Manager",1,2,3,4,5,6,7,null,null,null,null,null,null,null,null,null,null,null,null,null,null,null,"Connecticut",7010,{"$f":"INDEX(ALL!$L$2:$Q$49,MATCH(Processing!AA6,ALL!$K$2:$K$49,0),MATCH(Processing!$D$1,ALL!$L$1:$Q$1,0))","v":7010}]
[null,null,null,null,null,null,null,null,null,null,null,null,null,null,null,null,null,null,null,null,null,null,null,null,null,null,"Delaware",7481,{"$f":"INDEX(ALL!$L$2:$Q$49,MATCH(Processing!AA7,ALL!$K$2:$K$49,0),MATCH(Processing!$D$1,ALL!$L$1:$Q$1,0))","v":7481}]
[1,{"$f":"LEFT(CHOOSE(A8,\"January\", \"February\", \"March\", \"April\", \"May\", \"June\", \"July\", \"August\", \"September\", \"October\", \"November\", \"December\"),3)","v":"Jan"},{"$f":"SUMIFS(INDIRECT(\"'\"&$D$1&\"'!$F$3:$F$368\"),INDIRECT(\"'\"&$D$1&\"'!$I$3:$I$368\"),Processing!A8)","v":22658},null,null,null,null,null,null,null,null,null,null,null,null,null,null,null,null,null,null,null,null,null,null,null,"Florida",6868,{"$f":"INDEX(ALL!$L$2:$Q$49,MATCH(Processing!AA8,ALL!$K$2:$K$49,0),MATCH(Processing!$D$1,ALL!$L$1:$Q$1,0))","v":6868}]
[2,{"$f":"LEFT(CHOOSE(A9,\"January\", \"February\", \"March\", \"April\", \"May\", \"June\", \"July\", \"August\", \"September\", \"October\", \"November\", \"December\"),3)","v":"Feb"},{"$f":"SUMIFS(INDIRECT(\"'\"&$D$1&\"'!$F$3:$F$368\"),INDIRECT(\"'\"&$D$1&\"'!$I$3:$I$368\"),Processing!A9)","v":20000},null,null,null,null,null,null,null,null,null,null,null,null,null,null,null,null,null,null,null,null,null,null,null,"Georgia",6942,{"$f":"INDEX(ALL!$L$2:$Q$49,MATCH(Processing!AA9,ALL!$K$2:$K$49,0),MATCH(Processing!$D$1,ALL!$L$1:$Q$1,0))","v":6942}]
[3,"Mar",{"$f":"SUMIFS(INDIRECT(\"'\"&$D$1&\"'!$F$3:$F$368\"),INDIRECT(\"'\"&$D$1&\"'!$I$3:$I$368\"),Processing!A10)","v":22400},null,null,null,null,null,null,null,null,null,null,null,null,null,null,null,null,null,null,null,null,null,null,null,"Idaho",6891,{"$f":"INDEX(ALL!$L$2:$Q$49,MATCH(Processing!AA10,ALL!$K$2:$K$49,0),MATCH(Processing!$D$1,ALL!$L$1:$Q$1,0))","v":6891}]
[4,"Apr",{"$f":"SUMIFS(INDIRECT(\"'\"&$D$1&\"'!$F$3:$F$368\"),INDIRECT(\"'\"&$D$1&\"'!$I$3:$I$368\"),Processing!A11)","v":21745},null,null,null,null,null,null,null,null,null,null,null,null,null,null,null,null,null,null,null,null,null,null,null,"Illinois",11426,{"$f":"INDEX(ALL!$L$2:$Q$49,MATCH(Processing!AA11,ALL!$K$2:$K$49,0),MATCH(Processing!$D$1,ALL!$L$1:$Q$1,0))","v":11426}]
[5,"May",{"$f":"SUMIFS(INDIRECT(\"'\"&$D$1&\"'!$F$3:$F$368\"),INDIRECT(\"'\"&$D$1&\"'!$I$3:$I$368\"),Processing!A12)","v":21531},null,null,null,null,null,null,null,null,null,null,null,null,null,null,null,null,null,null,null,null,null,null,null,"Indiana",11075,{"$f":"INDEX(ALL!$L$2:$Q$49,MATCH(Processing!AA12,ALL!$K$2:$K$49,0),MATCH(Processing!$D$1,ALL!$L$1:$Q$1,0))","v":11075}]
[6,"Jun",{"$f":"SUMIFS(INDIRECT(\"'\"&$D$1&\"'!$F$3:$F$368\"),INDIRECT(\"'\"&$D$1&\"'!$I$3:$I$368\"),Processing!A13)","v":22510},null,null,null,null,null,null,null,null,null,null,null,null,null,null,null,null,null,null,null,null,null,null,null,"Iowa",5576,{"$f":"INDEX(ALL!$L$2:$Q$49,MATCH(Processing!AA13,ALL!$K$2:$K$49,0),MATCH(Processing!$D$1,ALL!$L$1:$Q$1,0))","v":5576}]
[7,"Jul",{"$f":"SUMIFS(INDIRECT(\"'\"&$D$1&\"'!$F$3:$F$368\"),INDIRECT(\"'\"&$D$1&\"'!$I$3:$I$368\"),Processing!A14)","v":23186},null,null,null,null,null,null,null,null,null,null,null,null,null,null,null,null,null,null,null,null,null,null,null,"Kansas",5402,{"$f":"INDEX(ALL!$L$2:$Q$49,MATCH(Processing!AA14,ALL!$K$2:$K$49,0),MATCH(Processing!$D$1,ALL!$L$1:$Q$1,0))","v":5402}]
[8,"Aug",{"$f":"SUMIFS(INDIRECT(\"'\"&$D$1&\"'!$F$3:$F$368\"),INDIRECT(\"'\"&$D$1&\"'!$I$3:$I$368\"),Processing!A15)","v":21543},null,null,null,null,null,null,null,null,null,null,null,null,null,null,null,null,null,null,null,null,null,null,null,"Kentucky",5376,{"$f":"INDEX(ALL!$L$2:$Q$49,MATCH(Processing!AA15,ALL!$K$2:$K$49,0),MATCH(Processing!$D$1,ALL!$L$1:$Q$1,0))","v":5376}]
[9,"Sep",{"$f":"SUMIFS(INDIRECT(\"'\"&$D$1&\"'!$F$3:$F$368\"),INDIRECT(\"'\"&$D$1&\"'!$I$3:$I$368\"),Processing!A16)","v":21134},null,null,null,null,null,null,null,null,null,null,null,null,null,null,null,null,null,null,null,null,null,null,null,"Louisiana",6041,{"$f":"INDEX(ALL!$L$2:$Q$49,MATCH(Processing!AA16,ALL!$K$2:$K$49,0),MATCH(Processing!$D$1,ALL!$L$1:$Q$1,0))","v":6041}]
[10,"Oct",{"$f":"SUMIFS(INDIRECT(\"'\"&$D$1&\"'!$F$3:$F$368\"),INDIRECT(\"'\"&$D$1&\"'!$I$3:$I$368\"),Processing!A17)","v":22734},null,null,null,null,null,null,null,null,null,null,null,null,null,null,null,null,null,null,null,null,null,null,null,"Maine",5837,{"$f":"INDEX(ALL!$L$2:$Q$49,MATCH(Processing!AA17,ALL!$K$2:$K$49,0),MATCH(Processing!$D$1,ALL!$L$1:$Q$1,0))","v":5837}]
[11,"Nov",{"$f":"SUMIFS(INDIRECT(\"'\"&$D$1&\"'!$F$3:$F$368\"),INDIRECT(\"'\"&$D$1&\"'!$I$3:$I$368\"),Processing!A18)","v":20856},null,null,null,null,null,null,null,null,null,null,null,null,null,null,null,null,null,null,null,null,null,null,null,"Maryland",5748,{"$f":"INDEX(ALL!$L$2:$Q$49,MATCH(Processing!AA18,ALL!$K$2:$K$49,0),MATCH(Processing!$D$1,ALL!$L$1:$Q$1,0))","v":5748}]
[12,"Dec",{"$f":"SUMIFS(INDIRECT(\"'\"&$D$1&\"'!$F$3:$F$368\"),INDIRECT(\"'\"&$D$1&\"'!$I$3:$I$368\"),Processing!A19)","v":23118},null,null,null,null,null,null,null,null,null,null,null,null,null,null,null,null,null,null,null,null,null,null,null,"Massachusetts",5524,{"$f":"INDEX(ALL!$L$2:$Q$49,MATCH(Processing!AA19,ALL!$K$2:$K$49,0),MATCH(Processing!$D$1,ALL!$L$1:$Q$1,0))","v":5524}]
[null,null,null,null,null,null,null,null,null,null,null,null,null,null,null,null,null,null,null,null,null,null,null,null,null,null,"Michigan",6099,{"$f":"INDEX(ALL!$L$2:$Q$49,MATCH(Processing!AA20,ALL!$K$2:$K$49,0),MATCH(Processing!$D$1,ALL!$L$1:$Q$1,0))","v":6099}]
[null,null,null,null,null,null,null,null,null,null,null,null,null,null,null,null,null,null,null,null,null,null,null,null,null,null,"Minnesota",8132,{"$f":"INDEX(ALL!$L$2:$Q$49,MATCH(Processing!AA21,ALL!$K$2:$K$49,0),MATCH(Processing!$D$1,ALL!$L$1:$Q$1,0))","v":8132}]
[null,null,null,null,null,null,null,null,null,null,null,null,null,null,null,null,null,null,null,null,null,null,null,null,null,null,"Mississippi",8769,{"$f":"INDEX(ALL!$L$2:$Q$49,MATCH(Processing!AA22,ALL!$K$2:$K$49,0),MATCH(Processing!$D$1,ALL!$L$1:$Q$1,0))","v":8769}]
[null,null,null,null,null,null,null,null,null,null,null,null,null,null,null,null,null,null,null,null,null,null,null,null,null,null,"Missouri",4477,{"$f":"INDEX(ALL!$L$2:$Q$49,MATCH(Processing!AA23,ALL!$K$2:$K$49,0),MATCH(Processing!$D$1,ALL!$L$1:$Q$1,0))","v":4477}]
[null,null,null,null,null,null,null,null,null,null,null,null,null,null,null,null,null,null,null,null,null,null,null,null,null,null,"Montana",3842,{"$f":"INDEX(ALL!$L$2:$Q$49,MATCH(Processing!AA24,ALL!$K$2:$K$49,0),MATCH(Processing!$D$1,ALL!$L$1:$Q$1,0))","v":3842}]
[null,null,null,null,null,null,null,null,null,null,null,null,null,null,null,null,null,null,null,null,null,null,null,null,null,null,"Nebraska",4183,{"$f":"INDEX(ALL!$L$2:$Q$49,MATCH(Processing!AA25,ALL!$K$2:$K$49,0),MATCH(Processing!$D$1,ALL!$L$1:$Q$1,0))","v":4183}]
[null,null,null,null,null,null,null,null,null,null,null,null,null,null,null,null,null,null,null,null,null,null,null,null,null,null,"Nevada",4003,{"$f":"INDEX(ALL!$L$2:$Q$49,MATCH(Processing!AA26,ALL!$K$2:$K$49,0),MATCH(Processing!$D$1,ALL!$L$1:$Q$1,0))","v":4003}]
[null,null,null,null,null,null,null,null,null,null,null,null,null,null,null,null,null,null,null,null,null,null,null,null,null,null,"New hampshire",4455,{"$f":"INDEX(ALL!$L$2:$Q$49,MATCH(Processing!AA27,ALL!$K$2:$K$49,0),MATCH(Processing!$D$1,ALL!$L$1:$Q$1,0))","v":4455}]
[null,null,null,null,null,null,null,null,null,null,null,null,null,null,null,null,null,null,null,null,null,null,null,null,null,null,"New Jersey",3997,{"$f":"INDEX(ALL!$L$2:$Q$49,MATCH(Processing!AA28,ALL!$K$2:$K$49,0),MATCH(Processing!$D$1,ALL!$L$1:$Q$1,0))","v":3997}]
[null,null,null,null,null,null,null,null,null,null,null,null,null,null,null,null,null,null,null,null,null,null,null,null,null,null,"New Mexico",3801,{"$f":"INDEX(ALL!$L$2:$Q$49,MATCH(Processing!AA29,ALL!$K$2:$K$49,0),MATCH(Processing!$D$1,ALL!$L$1:$Q$1,0))","v":3801}]
[null,null,null,null,null,null,null,null,null,null,null,null,null,null,null,null,null,null,null,null,null,null,null,null,null,null,"New York",4385,{"$f":"INDEX(ALL!$L$2:$Q$49,MATCH(Processing!AA30,ALL!$K$2:$K$49,0),MATCH(Processing!$D$1,ALL!$L$1:$Q$1,0))","v":4385}]
[null,null,null,null,null,null,null,null,null,null,null,null,null,null,null,null,null,null,null,null,null,null,null,null,null,null,"North Carolina",5059,{"$f":"INDEX(ALL!$L$2:$Q$49,MATCH(Processing!AA31,ALL!$K$2:$K$49,0),MATCH(Processing!$D$1,ALL!$L$1:$Q$1,0))","v":5059}]
[null,null,null,null,null,null,null,null,null,null,null,null,null,null,null,null,null,null,null,null,null,null,null,null,null,null,"North Dakota",5351,{"$f":"INDEX(ALL!$L$2:$Q$49,MATCH(Processing!AA32,ALL!$K$2:$K$49,0),MATCH(Processing!$D$1,ALL!$L$1:$Q$1,0))","v":5351}]
[null,null,null,null,null,null,null,null,null,null,null,null,null,null,null,null,null,null,null,null,null,null,null,null,null,null,"Ohio",2556,{"$f":"INDEX(ALL!$L$2:$Q$49,MATCH(Processing!AA33,ALL!$K$2:$K$49,0),MATCH(Processing!$D$1,ALL!$L$1:$Q$1,0))","v":2556}]
[null,null,null,null,null,null,null,null,null,null,null,null,null,null,null,null,null,null,null,null,null,null,null,null,null,null,"Oklahoma",2773,{"$f":"INDEX(ALL!$L$2:$Q$49,MATCH(Processing!AA34,ALL!$K$2:$K$49,0),MATCH(Processing!$D$1,ALL!$L$1:$Q$1,0))","v":2773}]
[null,null,null,null,null,null,null,null,null,null,null,null,null,null,null,null,null,null,null,null,null,null,null,null,null,null,"Oregon",2730,{"$f":"INDEX(ALL!$L$2:$Q$49,MATCH(Processing!AA35,ALL!$K$2:$K$49,0),MATCH(Processing!$D$1,ALL!$L$1:$Q$1,0))","v":2730}]
[null,null,null,null,null,null,null,null,null,null,null,null,null,null,null,null,null,null,null,null,null,null,null,null,null,null,"Pennsylvania",2869,{"$f":"INDEX(ALL!$L$2:$Q$49,MATCH(Processing!AA36,ALL!$K$2:$K$49,0),MATCH(Processing!$D$1,ALL!$L$1:$Q$1,0))","v":2869}]
[null,null,null,null,null,null,null,null,null,null,null,null,null,null,null,null,null,null,null,null,null,null,null,null,null,null,"Rhode Island",2683,{"$f":"INDEX(ALL!$L$2:$Q$49,MATCH(Processing!AA37,ALL!$K$2:$K$49,0),MATCH(Processing!$D$1,ALL!$L$1:$Q$1,0))","v":2683}]
[null,null,null,null,null,null,null,null,null,null,null,null,null,null,null,null,null,null,null,null,null,null,null,null,null,null,"South Carolina",2328,{"$f":"INDEX(ALL!$L$2:$Q$49,MATCH(Processing!AA38,ALL!$K$2:$K$49,0),MATCH(Processing!$D$1,ALL!$L$1:$Q$1,0))","v":2328}]
[null,null,null,null,null,null,null,null,null,null,null,null,null,null,null,null,null,null,null,null,null,null,null,null,null,null,"South Dakota",2452,{"$f":"INDEX(ALL!$L$2:$Q$49,MATCH(Processing!AA39,ALL!$K$2:$K$49,0),MATCH(Processing!$D$1,ALL!$L$1:$Q$1,0))","v":2452}]
[null,null,null,null,null,null,null,null,null,null,null,null,null,null,null,null,null,null,null,null,null,null,null,null,null,null,"Tennessee",2641,{"$f":"INDEX(ALL!$L$2:$Q$49,MATCH(Processing!AA40,ALL!$K$2:$K$49,0),MATCH(Processing!$D$1,ALL!$L$1:$Q$1,0))","v":2641}]
[null,null,null,null,null,null,null,null,null,null,null,null,null,null,null,null,null,null,null,null,null,null,null,null,null,null,"Texas",5010,{"$f":"INDEX(ALL!$L$2:$Q$49,MATCH(Processing!AA41,ALL!$K$2:$K$49,0),MATCH(Processing!$D$1,ALL!$L$1:$Q$1,0))","v":5010}]
[null,null,null,null,null,null,null,null,null,null,null,null,null,null,null,null,null,null,null,null,null,null,null,null,null,null,"Utah",4858,{"$f":"INDEX(ALL!$L$2:$Q$49,MATCH(Processing!AA42,ALL!$K$2:$K$49,0),MATCH(Processing!$D$1,ALL!$L$1:$Q$1,0))","v":4858}]
[null,null,null,null,null,null,null,null,null,null,null,null,null,null,null,null,null,null,null,null,null,null,null,null,null,null,"Vermont",5100,{"$f":"INDEX(ALL!$L$2:$Q$49,MATCH(Processing!AA43,ALL!$K$2:$K$49,0),MATCH(Processing!$D$1,ALL!$L$1:$Q$1,0))","v":5100}]
[null,null,null,null,null,null,null,null,null,null,null,null,null,null,null,null,null,null,null,null,null,null,null,null,null,null,"Virginia",4880,{"$f":"INDEX(ALL!$L$2:$Q$49,MATCH(Processing!AA44,ALL!$K$2:$K$49,0),MATCH(Processing!$D$1,ALL!$L$1:$Q$1,0))","v":4880}]
[null,null,null,null,null,null,null,null,null,null,null,null,null,null,null,null,null,null,null,null,null,null,null,null,null,null,"Washington",2165,{"$f":"INDEX(ALL!$L$2:$Q$49,MATCH(Processing!AA45,ALL!$K$2:$K$49,0),MATCH(Processing!$D$1,ALL!$L$1:$Q$1,0))","v":2165}]
[null,null,null,null,null,null,null,null,null,null,null,null,null,null,null,null,null,null,null,null,null,null,null,null,null,null,"West Virginia",2587,{"$f":"INDEX(ALL!$L$2:$Q$49,MATCH(Processing!AA46,ALL!$K$2:$K$49,0),MATCH(Processing!$D$1,ALL!$L$1:$Q$1,0))","v":2587}]
[null,null,null,null,null,null,null,null,null,null,null,null,null,null,null,null,null,null,null,null,null,null,null,null,null,null,"Wisconsin",2730,{"$f":"INDEX(ALL!$L$2:$Q$49,MATCH(Processing!AA47,ALL!$K$2:$K$49,0),MATCH(Processing!$D$1,ALL!$L$1:$Q$1,0))","v":2730}]
[null,null,null,null,null,null,null,null,null,null,null,null,null,null,null,null,null,null,null,null,null,null,null,null,null,null,"Wyoming",2602,{"$f":"INDEX(ALL!$L$2:$Q$49,MATCH(Processing!AA48,ALL!$K$2:$K$49,0),MATCH(Processing!$D$1,ALL!$L$1:$Q$1,0))","v":2602}]