{"text_format":"1","workbook":"xlsx","n_sheets":8,"sheets":["DASHBOARD","1-Manager","2-Manager","3-Manager","4-Manager","5-Manager","ALL","Processing"],"not_rendered":{"charts":6,"images":5,"macros":1,"external_links":0,"defined_names":0,"comments":0,"pivot_tables":0},"unopened":[],"bounds":{"document_bytes":16777216,"sheet_cells":100000,"rows_first":2000,"rows_last":500,"rows_between":2000,"halvings":0,"cell_chars":16384,"cell_head_chars":4096},"cells_cut":0,"cells_raw":0,"read":"whole","date_system":"1900"}

{"sheet":"DASHBOARD","index":0,"n_rows":35,"n_cols":28,"rows_kept":35,"cut":false,"hidden":false,"merged":[[2,1,2,2],[17,1,17,2],[17,5,17,6],[34,2,34,9]]}
[5,145,null,null,null,null,null,null,null,null,null,null,null,null,null,null,null,null,null,null,null,null,null,null,81,23.6,51,5]
[1,{"$f":"\"0\"&A2","v":"01"},null,null,null,null,null,null,null,null,null,null,null,null,null,null,null,null,null,null,null,null,null,null,96,30.4,52,75]
[null,"PRODUCTS BY DAYS",null,null,null,null,null,null,null,null,null,null,null,null,null,null,null,null,"RATING OF PRODUCTS",null,null,null,null,null,110,36,53,145]
[290,75,null,null,null,null,null,null,null,null,null,null,null,null,null,null,null,null,null,null,null,null,null,null,96,30.4,54,220]
[null,null,null,null,null,null,null,null,null,null,null,null,null,null,null,null,null,null,null,null,null,null,null,null,81,23.6,55,290]
[null,null,null,null,null,null,null,null,null,null,null,null,null,null,null,null,null,null,null,null,null,null,null,null,96,30.4,751]
[null,null,null,null,null,null,null,null,null,null,null,null,null,null,null,null,null,null,null,null,null,null,null,null,110,36,752]
[null,null,null,null,null,null,null,null,null,null,null,null,null,null,null,null,null,null,null,null,null,null,null,null,96,30.4,753]
[null,null,null,null,null,null,null,null,null,null,null,null,null,null,null,null,null,null,null,null,null,null,null,null,81,23.6,754]
[null,null,null,null,null,null,null,null,null,null,null,null,null,null,null,null,null,null,null,null,null,null,null,null,81,23.6,755]
{"$rows_left_out":26}
{"sheet":"1-Manager","index":1,"n_rows":369,"n_cols":10,"rows_kept":369,"cut":false,"hidden":false,"merged":[[0,9,0,19],[0,8,1,8],[0,7,1,7],[0,0,1,0],[0,1,0,4],[0,6,1,6],[0,5,1,5]]}
["Date","Product Groups",null,null,null,"Total sales","State","Days of the week","№ Month","https://exceltable.com/en/templates/3d-menu-for-dashboard-in-excel"]
[null,"A","B","C","D"]
["2020-01-01",165,93,89,39,{"$f":"SUM(B3:E3)","v":386},"Alabama",{"$f":"WEEKDAY(A3,2)","v":3},{"$f":"MONTH(A3)","v":1}]
["2020-01-02",109,54,52,28,{"$f":"SUM(B4:E4)","v":243},"Alabama",{"$f":"WEEKDAY(A4,2)","v":4},{"$f":"MONTH(A4)","v":1}]
["2020-01-03",146,82,104,13,345,"Alabama",5,1]
["2020-01-04",181,79,123,39,422,"Alabama",6,1]
["2020-01-05",14,31,13,11,69,"Alabama",7,1]
["2020-01-06",38,48,45,6,137,"Alabama",1,1]
["2020-01-07",21,85,118,20,244,"Alabama",2,1]
["2020-01-08",99,83,16,28,226,"Alabama",3,1]
{"$rows_left_out":360}
{"sheet":"2-Manager","index":2,"n_rows":369,"n_cols":10,"rows_kept":369,"cut":false,"hidden":false,"merged":[[0,9,0,19],[0,0,1,0],[0,1,0,4],[0,6,1,6],[0,5,1,5],[0,8,1,8],[0,7,1,7]]}
["Date","Product Groups",null,null,null,"Total sales","State","Days of the week","№ Month","https://exceltable.com/en/templates/3d-menu-for-dashboard-in-excel"]
[null,"A","B","C","D"]
["2020-01-01",45,65,67,26,{"$f":"SUM(B3:E3)","v":203},"Illinois",{"$f":"WEEKDAY(A3,2)","v":3},{"$f":"MONTH(A3)","v":1}]
["2020-01-02",67,76,147,48,{"$f":"SUM(B4:E4)","v":338},"Illinois",{"$f":"WEEKDAY(A4,2)","v":4},{"$f":"MONTH(A4)","v":1}]
["2020-01-03",71,90,23,17,201,"Illinois",5,1]
["2020-01-04",84,59,140,25,308,"Illinois",6,1]
["2020-01-05",21,25,16,16,78,"Illinois",7,1]
["2020-01-06",32,70,128,34,264,"Illinois",1,1]
["2020-01-07",17,11,26,23,77,"Illinois",2,1]
["2020-01-08",41,42,23,47,153,"Illinois",3,1]
{"$rows_left_out":360}
{"sheet":"3-Manager","index":3,"n_rows":369,"n_cols":10,"rows_kept":369,"cut":false,"hidden":false,"merged":[[0,9,0,19],[0,0,1,0],[0,1,0,4],[0,6,1,6],[0,5,1,5],[0,8,1,8],[0,7,1,7]]}
["Date","Product Groups",null,null,null,"Total sales","State","Days of the week","№ Month","https://exceltable.com/en/templates/3d-menu-for-dashboard-in-excel"]
[null,"A","B","C","D"]
["2020-01-01",32,19,23,13,{"$f":"SUM(B3:E3)","v":87},"Minnesota",{"$f":"WEEKDAY(A3,2)","v":3},{"$f":"MONTH(A3)","v":1}]
["2020-01-02",47,37,50,32,166,"Minnesota",{"$f":"WEEKDAY(A4,2)","v":4},{"$f":"MONTH(A4)","v":1}]
["2020-01-03",54,33,38,15,140,"Minnesota",5,1]
["2020-01-04",93,42,26,23,184,"Minnesota",6,1]
["2020-01-05",23,6,8,8,45,"Minnesota",7,1]
["2020-01-06",55,5,17,28,105,"Minnesota",1,1]
["2020-01-07",97,30,18,13,158,"Minnesota",2,1]
["2020-01-08",75,22,20,25,142,"Minnesota",3,1]
{"$rows_left_out":360}
{"sheet":"4-Manager","index":4,"n_rows":369,"n_cols":10,"rows_kept":369,"cut":false,"hidden":false,"merged":[[0,9,0,19],[0,8,1,8],[0,0,1,0],[0,1,0,4],[0,6,1,6],[0,5,1,5],[0,7,1,7]]}
["Date","Product Groups",null,null,null,"Total sales","State","Days of the week","№ Month","https://exceltable.com/en/templates/3d-menu-for-dashboard-in-excel"]
[null,"A","B","C","D"]
["2020-01-01",20,19,100,6,{"$f":"SUM(B3:E3)","v":145},"North Carolina",{"$f":"WEEKDAY(A3,2)","v":3},{"$f":"MONTH(A3)","v":1}]
["2020-01-02",7,9,44,1,61,"North Carolina",{"$f":"WEEKDAY(A4,2)","v":4},{"$f":"MONTH(A4)","v":1}]
["2020-01-03",9,17,11,4,41,"North Carolina",5,1]
["2020-01-04",7,3,56,27,93,"North Carolina",6,1]
["2020-01-05",6,9,7,1,23,"North Carolina",7,1]
["2020-01-06",27,5,47,12,91,"North Carolina",1,1]
["2020-01-07",6,5,63,28,102,"North Carolina",2,1]
["2020-01-08",21,3,48,16,88,"North Carolina",3,1]
{"$rows_left_out":360}
{"sheet":"5-Manager","index":5,"n_rows":369,"n_cols":10,"rows_kept":369,"cut":false,"hidden":false,"merged":[[0,9,0,19],[0,8,1,8],[0,0,1,0],[0,1,0,4],[0,6,1,6],[0,5,1,5],[0,7,1,7]]}
["Date","Product Groups",null,null,null,"Total sales","State","Days of the week","№ Month","https://exceltable.com/en/templates/3d-menu-for-dashboard-in-excel"]
[null,"A","B","C","D"]
["2020-01-01",15,9,8,77,{"$f":"SUM(B3:E3)","v":109},"Texas",{"$f":"WEEKDAY(A3,2)","v":3},{"$f":"MONTH(A3)","v":1}]
["2020-01-02",11,5,49,29,94,"Texas",{"$f":"WEEKDAY(A4,2)","v":4},{"$f":"MONTH(A4)","v":1}]
["2020-01-03",20,8,30,19,77,"Texas",5,1]
["2020-01-04",4,1,22,12,39,"Texas",6,1]
["2020-01-05",2,3,8,18,31,"Texas",7,1]
["2020-01-06",7,6,19,85,117,"Texas",1,1]
["2020-01-07",13,4,19,24,60,"Texas",2,1]
["2020-01-08",16,6,10,28,60,"Texas",3,1]
{"$rows_left_out":360}
{"sheet":"ALL","index":6,"n_rows":369,"n_cols":18,"rows_kept":369,"cut":false,"hidden":false,"merged":[[0,17,0,27],[0,8,1,8],[0,0,1,0],[0,1,0,4],[0,5,1,5],[0,7,1,7]]}
["Date","Product Groups",null,null,null,"Total sales",null,"Days of the week","№ Month",null,"State","1-Manager","2-Manager","3-Manager","4-Manager","5-Manager","ALL","https://exceltable.com/en/templates/3d-menu-for-dashboard-in-excel"]
[null,"A","B","C","D",null,null,null,null,null,"Alabama",{"$f":"SUMIFS('1-Manager'!$F$3:$F$368,'1-Manager'!$G$3:$G$368,ALL!K2)","v":13784},{"$f":"SUMIFS('2-Manager'!$F$3:$F$368,'2-Manager'!$G$3:$G$368,ALL!K2)","v":0},{"$f":"SUMIFS('3-Manager'!$F$3:$F$368,'3-Manager'!$G$3:$G$368,ALL!K2)","v":0},{"$f":"SUMIFS('4-Manager'!$F$3:$F$368,'4-Manager'!$G$3:$G$368,ALL!K2)","v":0},{"$f":"SUMIFS('5-Manager'!$F$3:$F$368,'5-Manager'!$G$3:$G$368,ALL!K2)","v":0},{"$f":"SUM(L2:P2)","v":13784}]
["2020-01-01",{"$f":"'1-Manager'!B3+'2-Manager'!B3+'3-Manager'!B3+'4-Manager'!B3+'5-Manager'!B3","v":277},{"$f":"'1-Manager'!C3+'2-Manager'!C3+'3-Manager'!C3+'4-Manager'!C3+'5-Manager'!C3","v":205},{"$f":"'1-Manager'!D3+'2-Manager'!D3+'3-Manager'!D3+'4-Manager'!D3+'5-Manager'!D3","v":287},{"$f":"'1-Manager'!E3+'2-Manager'!E3+'3-Manager'!E3+'4-Manager'!E3+'5-Manager'!E3","v":161},{"$f":"SUM(B3:E3)","v":930},null,{"$f":"WEEKDAY(A3,2)","v":3},{"$f":"MONTH(A3)","v":1},null,"Arizona",{"$f":"SUMIFS('1-Manager'!$F$3:$F$368,'1-Manager'!$G$3:$G$368,ALL!K3)","v":13369},{"$f":"SUMIFS('2-Manager'!$F$3:$F$368,'2-Manager'!$G$3:$G$368,ALL!K3)","v":0},{"$f":"SUMIFS('3-Manager'!$F$3:$F$368,'3-Manager'!$G$3:$G$368,ALL!K3)","v":0},{"$f":"SUMIFS('4-Manager'!$F$3:$F$368,'4-Manager'!$G$3:$G$368,ALL!K3)","v":0},{"$f":"SUMIFS('5-Manager'!$F$3:$F$368,'5-Manager'!$G$3:$G$368,ALL!K3)","v":0},{"$f":"SUM(L3:P3)","v":13369}]
["2020-01-02",{"$f":"'1-Manager'!B4+'2-Manager'!B4+'3-Manager'!B4+'4-Manager'!B4+'5-Manager'!B4","v":241},{"$f":"'1-Manager'!C4+'2-Manager'!C4+'3-Manager'!C4+'4-Manager'!C4+'5-Manager'!C4","v":181},{"$f":"'1-Manager'!D4+'2-Manager'!D4+'3-Manager'!D4+'4-Manager'!D4+'5-Manager'!D4","v":342},{"$f":"'1-Manager'!E4+'2-Manager'!E4+'3-Manager'!E4+'4-Manager'!E4+'5-Manager'!E4","v":138},{"$f":"SUM(B4:E4)","v":902},null,{"$f":"WEEKDAY(A4,2)","v":4},{"$f":"MONTH(A4)","v":1},null,"Arkansas",{"$f":"SUMIFS('1-Manager'!$F$3:$F$368,'1-Manager'!$G$3:$G$368,ALL!K4)","v":7209},{"$f":"SUMIFS('2-Manager'!$F$3:$F$368,'2-Manager'!$G$3:$G$368,ALL!K4)","v":0},{"$f":"SUMIFS('3-Manager'!$F$3:$F$368,'3-Manager'!$G$3:$G$368,ALL!K4)","v":0},{"$f":"SUMIFS('4-Manager'!$F$3:$F$368,'4-Manager'!$G$3:$G$368,ALL!K4)","v":0},{"$f":"SUMIFS('5-Manager'!$F$3:$F$368,'5-Manager'!$G$3:$G$368,ALL!K4)","v":0},7209]
["2020-01-03",{"$f":"'1-Manager'!B5+'2-Manager'!B5+'3-Manager'!B5+'4-Manager'!B5+'5-Manager'!B5","v":300},{"$f":"'1-Manager'!C5+'2-Manager'!C5+'3-Manager'!C5+'4-Manager'!C5+'5-Manager'!C5","v":230},{"$f":"'1-Manager'!D5+'2-Manager'!D5+'3-Manager'!D5+'4-Manager'!D5+'5-Manager'!D5","v":206},{"$f":"'1-Manager'!E5+'2-Manager'!E5+'3-Manager'!E5+'4-Manager'!E5+'5-Manager'!E5","v":68},804,null,5,1,null,"California",{"$f":"SUMIFS('1-Manager'!$F$3:$F$368,'1-Manager'!$G$3:$G$368,ALL!K5)","v":7262},{"$f":"SUMIFS('2-Manager'!$F$3:$F$368,'2-Manager'!$G$3:$G$368,ALL!K5)","v":0},{"$f":"SUMIFS('3-Manager'!$F$3:$F$368,'3-Manager'!$G$3:$G$368,ALL!K5)","v":0},{"$f":"SUMIFS('4-Manager'!$F$3:$F$368,'4-Manager'!$G$3:$G$368,ALL!K5)","v":0},{"$f":"SUMIFS('5-Manager'!$F$3:$F$368,'5-Manager'!$G$3:$G$368,ALL!K5)","v":0},7262]
["2020-01-04",{"$f":"'1-Manager'!B6+'2-Manager'!B6+'3-Manager'!B6+'4-Manager'!B6+'5-Manager'!B6","v":369},{"$f":"'1-Manager'!C6+'2-Manager'!C6+'3-Manager'!C6+'4-Manager'!C6+'5-Manager'!C6","v":184},{"$f":"'1-Manager'!D6+'2-Manager'!D6+'3-Manager'!D6+'4-Manager'!D6+'5-Manager'!D6","v":367},{"$f":"'1-Manager'!E6+'2-Manager'!E6+'3-Manager'!E6+'4-Manager'!E6+'5-Manager'!E6","v":126},1046,null,6,1,null,"Colorado",{"$f":"SUMIFS('1-Manager'!$F$3:$F$368,'1-Manager'!$G$3:$G$368,ALL!K6)","v":7077},{"$f":"SUMIFS('2-Manager'!$F$3:$F$368,'2-Manager'!$G$3:$G$368,ALL!K6)","v":0},{"$f":"SUMIFS('3-Manager'!$F$3:$F$368,'3-Manager'!$G$3:$G$368,ALL!K6)","v":0},{"$f":"SUMIFS('4-Manager'!$F$3:$F$368,'4-Manager'!$G$3:$G$368,ALL!K6)","v":0},{"$f":"SUMIFS('5-Manager'!$F$3:$F$368,'5-Manager'!$G$3:$G$368,ALL!K6)","v":0},7077]
["2020-01-05",{"$f":"'1-Manager'!B7+'2-Manager'!B7+'3-Manager'!B7+'4-Manager'!B7+'5-Manager'!B7","v":66},{"$f":"'1-Manager'!C7+'2-Manager'!C7+'3-Manager'!C7+'4-Manager'!C7+'5-Manager'!C7","v":74},{"$f":"'1-Manager'!D7+'2-Manager'!D7+'3-Manager'!D7+'4-Manager'!D7+'5-Manager'!D7","v":52},{"$f":"'1-Manager'!E7+'2-Manager'!E7+'3-Manager'!E7+'4-Manager'!E7+'5-Manager'!E7","v":54},246,null,7,1,null,"Connecticut",{"$f":"SUMIFS('1-Manager'!$F$3:$F$368,'1-Manager'!$G$3:$G$368,ALL!K7)","v":7010},{"$f":"SUMIFS('2-Manager'!$F$3:$F$368,'2-Manager'!$G$3:$G$368,ALL!K7)","v":0},{"$f":"SUMIFS('3-Manager'!$F$3:$F$368,'3-Manager'!$G$3:$G$368,ALL!K7)","v":0},{"$f":"SUMIFS('4-Manager'!$F$3:$F$368,'4-Manager'!$G$3:$G$368,ALL!K7)","v":0},{"$f":"SUMIFS('5-Manager'!$F$3:$F$368,'5-Manager'!$G$3:$G$368,ALL!K7)","v":0},7010]
["2020-01-06",{"$f":"'1-Manager'!B8+'2-Manager'!B8+'3-Manager'!B8+'4-Manager'!B8+'5-Manager'!B8","v":159},{"$f":"'1-Manager'!C8+'2-Manager'!C8+'3-Manager'!C8+'4-Manager'!C8+'5-Manager'!C8","v":134},{"$f":"'1-Manager'!D8+'2-Manager'!D8+'3-Manager'!D8+'4-Manager'!D8+'5-Manager'!D8","v":256},{"$f":"'1-Manager'!E8+'2-Manager'!E8+'3-Manager'!E8+'4-Manager'!E8+'5-Manager'!E8","v":165},714,null,1,1,null,"Delaware",{"$f":"SUMIFS('1-Manager'!$F$3:$F$368,'1-Manager'!$G$3:$G$368,ALL!K8)","v":7481},{"$f":"SUMIFS('2-Manager'!$F$3:$F$368,'2-Manager'!$G$3:$G$368,ALL!K8)","v":0},{"$f":"SUMIFS('3-Manager'!$F$3:$F$368,'3-Manager'!$G$3:$G$368,ALL!K8)","v":0},{"$f":"SUMIFS('4-Manager'!$F$3:$F$368,'4-Manager'!$G$3:$G$368,ALL!K8)","v":0},{"$f":"SUMIFS('5-Manager'!$F$3:$F$368,'5-Manager'!$G$3:$G$368,ALL!K8)","v":0},7481]
["2020-01-07",{"$f":"'1-Manager'!B9+'2-Manager'!B9+'3-Manager'!B9+'4-Manager'!B9+'5-Manager'!B9","v":154},{"$f":"'1-Manager'!C9+'2-Manager'!C9+'3-Manager'!C9+'4-Manager'!C9+'5-Manager'!C9","v":135},{"$f":"'1-Manager'!D9+'2-Manager'!D9+'3-Manager'!D9+'4-Manager'!D9+'5-Manager'!D9","v":244},{"$f":"'1-Manager'!E9+'2-Manager'!E9+'3-Manager'!E9+'4-Manager'!E9+'5-Manager'!E9","v":108},641,null,2,1,null,"Florida",{"$f":"SUMIFS('1-Manager'!$F$3:$F$368,'1-Manager'!$G$3:$G$368,ALL!K9)","v":6868},{"$f":"SUMIFS('2-Manager'!$F$3:$F$368,'2-Manager'!$G$3:$G$368,ALL!K9)","v":0},{"$f":"SUMIFS('3-Manager'!$F$3:$F$368,'3-Manager'!$G$3:$G$368,ALL!K9)","v":0},{"$f":"SUMIFS('4-Manager'!$F$3:$F$368,'4-Manager'!$G$3:$G$368,ALL!K9)","v":0},{"$f":"SUMIFS('5-Manager'!$F$3:$F$368,'5-Manager'!$G$3:$G$368,ALL!K9)","v":0},6868]
["2020-01-08",{"$f":"'1-Manager'!B10+'2-Manager'!B10+'3-Manager'!B10+'4-Manager'!B10+'5-Manager'!B10","v":252},{"$f":"'1-Manager'!C10+'2-Manager'!C10+'3-Manager'!C10+'4-Manager'!C10+'5-Manager'!C10","v":156},{"$f":"'1-Manager'!D10+'2-Manager'!D10+'3-Manager'!D10+'4-Manager'!D10+'5-Manager'!D10","v":117},{"$f":"'1-Manager'!E10+'2-Manager'!E10+'3-Manager'!E10+'4-Manager'!E10+'5-Manager'!E10","v":144},669,null,3,1,null,"Georgia",{"$f":"SUMIFS('1-Manager'!$F$3:$F$368,'1-Manager'!$G$3:$G$368,ALL!K10)","v":6942},{"$f":"SUMIFS('2-Manager'!$F$3:$F$368,'2-Manager'!$G$3:$G$368,ALL!K10)","v":0},{"$f":"SUMIFS('3-Manager'!$F$3:$F$368,'3-Manager'!$G$3:$G$368,ALL!K10)","v":0},{"$f":"SUMIFS('4-Manager'!$F$3:$F$368,'4-Manager'!$G$3:$G$368,ALL!K10)","v":0},{"$f":"SUMIFS('5-Manager'!$F$3:$F$368,'5-Manager'!$G$3:$G$368,ALL!K10)","v":0},6942]
{"$rows_left_out":360}
{"sheet":"Processing","index":7,"n_rows":48,"n_cols":30,"rows_kept":48,"cut":false,"hidden":false,"merged":[[1,29,1,39]]}
[{"$f":"'1-Manager'!F369","v":83893},{"$f":"\"1-MANAGER\"&CHAR(10)&\"$\"&TEXT(A1,\"# ###\")","v":"1-MANAGER\n$83 893"},"new","ALL","Mon","Tue","Wed","Thu","Fri","Sat","Sun",null,"Mon","Tue","Wed","Thu","Fri","Sat","Sun",null,"A",{"$f":"SUM(E2:K2)","v":83164},{"$f":"INDEX($U$1:$U$4,SMALL(IF($V$1:$V$4=X1,ROW($V$1:$V$4)),COUNTIF($X$1:X1,X1)))","v":"C"},{"$f":"LARGE($V$1:$V$4,1)","v":83945},{"$f":"MAX($X$1:$X$4)-X1","v":0},null,"Alabama",{"$f":"IF(AC1=0,$AD$1,AC1)","v":13784},{"$f":"INDEX(ALL!$L$2:$Q$49,MATCH(Processing!AA1,ALL!$K$2:$K$49,0),MATCH(Processing!$D$1,ALL!$L$1:$Q$1,0))","v":13784},1000]
[{"$f":"'2-Manager'!F369","v":68104},{"$f":"\"2-MANAGER\"&CHAR(10)&\"$\"&TEXT(A2,\"# ###\")","v":"2-MANAGER\n$68 104"},"A","$B$3:$B$368",{"$f":"SUMIFS(INDIRECT(\"'\"&$D$1&\"'!\"&$D2),INDIRECT(\"'\"&$D$1&\"'!$H$3:$H$368\"),Processing!E$6)","v":10897},{"$f":"SUMIFS(INDIRECT(\"'\"&$D$1&\"'!\"&$D2),INDIRECT(\"'\"&$D$1&\"'!$H$3:$H$368\"),Processing!F$6)","v":12747},{"$f":"SUMIFS(INDIRECT(\"'\"&$D$1&\"'!\"&$D2),INDIRECT(\"'\"&$D$1&\"'!$H$3:$H$368\"),Processing!G$6)","v":11947},{"$f":"SUMIFS(INDIRECT(\"'\"&$D$1&\"'!\"&$D2),INDIRECT(\"'\"&$D$1&\"'!$H$3:$H$368\"),Processing!H$6)","v":14221},{"$f":"SUMIFS(INDIRECT(\"'\"&$D$1&\"'!\"&$D2),INDIRECT(\"'\"&$D$1&\"'!$H$3:$H$368\"),Processing!I$6)","v":14699},{"$f":"SUMIFS(INDIRECT(\"'\"&$D$1&\"'!\"&$D2),INDIRECT(\"'\"&$D$1&\"'!$H$3:$H$368\"),Processing!J$6)","v":13928},{"$f":"SUMIFS(INDIRECT(\"'\"&$D$1&\"'!\"&$D2),INDIRECT(\"'\"&$D$1&\"'!$H$3:$H$368\"),Processing!K$6)","v":4725},null,10,10,10,10,10,10,10,null,"B",{"$f":"SUM(E3:K3)","v":49206},{"$f":"INDEX($U$1:$U$4,SMALL(IF($V$1:$V$4=X2,ROW($V$1:$V$4)),COUNTIF($X$1:X2,X2)))","v":"A"},{"$f":"LARGE($V$1:$V$4,2)","v":83164},{"$f":"MAX($X$1:$X$4)-X2","v":781},null,"Arizona",{"$f":"IF(AC2=0,$AD$1,AC2)","v":13369},{"$f":"INDEX(ALL!$L$2:$Q$49,MATCH(Processing!AA2,ALL!$K$2:$K$49,0),MATCH(Processing!$D$1,ALL!$L$1:$Q$1,0))","v":13369},"https://exceltable.com/en/templates/3d-menu-for-dashboard-in-excel"]
[{"$f":"'3-Manager'!F369","v":50044},{"$f":"\"3-MANAGER\"&CHAR(10)&\"$\"&TEXT(A3,\"# ###\")","v":"3-MANAGER\n$50 044"},"B","$C$3:$C$368",{"$f":"SUMIFS(INDIRECT(\"'\"&$D$1&\"'!\"&$D3),INDIRECT(\"'\"&$D$1&\"'!$H$3:$H$368\"),Processing!E$6)","v":6866},{"$f":"SUMIFS(INDIRECT(\"'\"&$D$1&\"'!\"&$D3),INDIRECT(\"'\"&$D$1&\"'!$H$3:$H$368\"),Processing!F$6)","v":6744},{"$f":"SUMIFS(INDIRECT(\"'\"&$D$1&\"'!\"&$D3),INDIRECT(\"'\"&$D$1&\"'!$H$3:$H$368\"),Processing!G$6)","v":7949},{"$f":"SUMIFS(INDIRECT(\"'\"&$D$1&\"'!\"&$D3),INDIRECT(\"'\"&$D$1&\"'!$H$3:$H$368\"),Processing!H$6)","v":8034},{"$f":"SUMIFS(INDIRECT(\"'\"&$D$1&\"'!\"&$D3),INDIRECT(\"'\"&$D$1&\"'!$H$3:$H$368\"),Processing!I$6)","v":8758},{"$f":"SUMIFS(INDIRECT(\"'\"&$D$1&\"'!\"&$D3),INDIRECT(\"'\"&$D$1&\"'!$H$3:$H$368\"),Processing!J$6)","v":8254},{"$f":"SUMIFS(INDIRECT(\"'\"&$D$1&\"'!\"&$D3),INDIRECT(\"'\"&$D$1&\"'!$H$3:$H$368\"),Processing!K$6)","v":2601},null,10,10,10,10,10,10,10,null,"C",{"$f":"SUM(E4:K4)","v":83945},{"$f":"INDEX($U$1:$U$4,SMALL(IF($V$1:$V$4=X3,ROW($V$1:$V$4)),COUNTIF($X$1:X3,X3)))","v":"B"},{"$f":"LARGE($V$1:$V$4,3)","v":49206},34739,null,"Arkansas",7209,{"$f":"INDEX(ALL!$L$2:$Q$49,MATCH(Processing!AA3,ALL!$K$2:$K$49,0),MATCH(Processing!$D$1,ALL!$L$1:$Q$1,0))","v":7209}]
[{"$f":"'4-Manager'!F369","v":31442},{"$f":"\"4-MANAGER\"&CHAR(10)&\"$\"&TEXT(A4,\"# ###\")","v":"4-MANAGER\n$31 442"},"C","$D$3:$D$368",{"$f":"SUMIFS(INDIRECT(\"'\"&$D$1&\"'!\"&$D4),INDIRECT(\"'\"&$D$1&\"'!$H$3:$H$368\"),Processing!E$6)","v":11990},{"$f":"SUMIFS(INDIRECT(\"'\"&$D$1&\"'!\"&$D4),INDIRECT(\"'\"&$D$1&\"'!$H$3:$H$368\"),Processing!F$6)","v":12719},{"$f":"SUMIFS(INDIRECT(\"'\"&$D$1&\"'!\"&$D4),INDIRECT(\"'\"&$D$1&\"'!$H$3:$H$368\"),Processing!G$6)","v":14365},{"$f":"SUMIFS(INDIRECT(\"'\"&$D$1&\"'!\"&$D4),INDIRECT(\"'\"&$D$1&\"'!$H$3:$H$368\"),Processing!H$6)","v":12465},{"$f":"SUMIFS(INDIRECT(\"'\"&$D$1&\"'!\"&$D4),INDIRECT(\"'\"&$D$1&\"'!$H$3:$H$368\"),Processing!I$6)","v":14205},{"$f":"SUMIFS(INDIRECT(\"'\"&$D$1&\"'!\"&$D4),INDIRECT(\"'\"&$D$1&\"'!$H$3:$H$368\"),Processing!J$6)","v":13596},{"$f":"SUMIFS(INDIRECT(\"'\"&$D$1&\"'!\"&$D4),INDIRECT(\"'\"&$D$1&\"'!$H$3:$H$368\"),Processing!K$6)","v":4605},null,10,10,10,10,10,10,10,null,"D",{"$f":"SUM(E5:K5)","v":47100},{"$f":"INDEX($U$1:$U$4,SMALL(IF($V$1:$V$4=X4,ROW($V$1:$V$4)),COUNTIF($X$1:X4,X4)))","v":"D"},{"$f":"LARGE($V$1:$V$4,4)","v":47100},36845,null,"California",7262,{"$f":"INDEX(ALL!$L$2:$Q$49,MATCH(Processing!AA4,ALL!$K$2:$K$49,0),MATCH(Processing!$D$1,ALL!$L$1:$Q$1,0))","v":7262}]
[{"$f":"'5-Manager'!F369","v":29932},{"$f":"\"5-MANAGER\"&CHAR(10)&\"$\"&TEXT(A5,\"# ###\")","v":"5-MANAGER\n$29 932"},"D","$E$3:$E$368",{"$f":"SUMIFS(INDIRECT(\"'\"&$D$1&\"'!\"&$D5),INDIRECT(\"'\"&$D$1&\"'!$H$3:$H$368\"),Processing!E$6)","v":7476},{"$f":"SUMIFS(INDIRECT(\"'\"&$D$1&\"'!\"&$D5),INDIRECT(\"'\"&$D$1&\"'!$H$3:$H$368\"),Processing!F$6)","v":7026},{"$f":"SUMIFS(INDIRECT(\"'\"&$D$1&\"'!\"&$D5),INDIRECT(\"'\"&$D$1&\"'!$H$3:$H$368\"),Processing!G$6)","v":7336},{"$f":"SUMIFS(INDIRECT(\"'\"&$D$1&\"'!\"&$D5),INDIRECT(\"'\"&$D$1&\"'!$H$3:$H$368\"),Processing!H$6)","v":7647},{"$f":"SUMIFS(INDIRECT(\"'\"&$D$1&\"'!\"&$D5),INDIRECT(\"'\"&$D$1&\"'!$H$3:$H$368\"),Processing!I$6)","v":8376},{"$f":"SUMIFS(INDIRECT(\"'\"&$D$1&\"'!\"&$D5),INDIRECT(\"'\"&$D$1&\"'!$H$3:$H$368\"),Processing!J$6)","v":6556},{"$f":"SUMIFS(INDIRECT(\"'\"&$D$1&\"'!\"&$D5),INDIRECT(\"'\"&$D$1&\"'!$H$3:$H$368\"),Processing!K$6)","v":2683},null,10,10,10,10,10,10,10,null,null,null,null,null,null,null,"Colorado",7077,{"$f":"INDEX(ALL!$L$2:$Q$49,MATCH(Processing!AA5,ALL!$K$2:$K$49,0),MATCH(Processing!$D$1,ALL!$L$1:$Q$1,0))","v":7077}]
[null,null,"old","1-Manager",1,2,3,4,5,6,7,null,null,null,null,null,null,null,null,null,null,null,null,null,null,null,"Connecticut",7010,{"$f":"INDEX(ALL!$L$2:$Q$49,MATCH(Processing!AA6,ALL!$K$2:$K$49,0),MATCH(Processing!$D$1,ALL!$L$1:$Q$1,0))","v":7010}]
[null,null,null,null,null,null,null,null,null,null,null,null,null,null,null,null,null,null,null,null,null,null,null,null,null,null,"Delaware",7481,{"$f":"INDEX(ALL!$L$2:$Q$49,MATCH(Processing!AA7,ALL!$K$2:$K$49,0),MATCH(Processing!$D$1,ALL!$L$1:$Q$1,0))","v":7481}]
[1,{"$f":"LEFT(CHOOSE(A8,\"January\", \"February\", \"March\", \"April\", \"May\", \"June\", \"July\", \"August\", \"September\", \"October\", \"November\", \"December\"),3)","v":"Jan"},{"$f":"SUMIFS(INDIRECT(\"'\"&$D$1&\"'!$F$3:$F$368\"),INDIRECT(\"'\"&$D$1&\"'!$I$3:$I$368\"),Processing!A8)","v":22658},null,null,null,null,null,null,null,null,null,null,null,null,null,null,null,null,null,null,null,null,null,null,null,"Florida",6868,{"$f":"INDEX(ALL!$L$2:$Q$49,MATCH(Processing!AA8,ALL!$K$2:$K$49,0),MATCH(Processing!$D$1,ALL!$L$1:$Q$1,0))","v":6868}]
[2,{"$f":"LEFT(CHOOSE(A9,\"January\", \"February\", \"March\", \"April\", \"May\", \"June\", \"July\", \"August\", \"September\", \"October\", \"November\", \"December\"),3)","v":"Feb"},{"$f":"SUMIFS(INDIRECT(\"'\"&$D$1&\"'!$F$3:$F$368\"),INDIRECT(\"'\"&$D$1&\"'!$I$3:$I$368\"),Processing!A9)","v":20000},null,null,null,null,null,null,null,null,null,null,null,null,null,null,null,null,null,null,null,null,null,null,null,"Georgia",6942,{"$f":"INDEX(ALL!$L$2:$Q$49,MATCH(Processing!AA9,ALL!$K$2:$K$49,0),MATCH(Processing!$D$1,ALL!$L$1:$Q$1,0))","v":6942}]
[3,"Mar",{"$f":"SUMIFS(INDIRECT(\"'\"&$D$1&\"'!$F$3:$F$368\"),INDIRECT(\"'\"&$D$1&\"'!$I$3:$I$368\"),Processing!A10)","v":22400},null,null,null,null,null,null,null,null,null,null,null,null,null,null,null,null,null,null,null,null,null,null,null,"Idaho",6891,{"$f":"INDEX(ALL!$L$2:$Q$49,MATCH(Processing!AA10,ALL!$K$2:$K$49,0),MATCH(Processing!$D$1,ALL!$L$1:$Q$1,0))","v":6891}]
{"$rows_left_out":38}