{"text_format":"1","workbook":"xlsx","n_sheets":4,"sheets":["PVPC","PVPC AUX","PVPC PCB","PVPC CYM"],"not_rendered":{"charts":2,"images":1,"macros":1,"external_links":0,"defined_names":17,"comments":0,"pivot_tables":3},"unopened":[],"bounds":{"document_bytes":16777216,"sheet_cells":100000,"rows_first":2000,"rows_last":500,"rows_between":2000,"halvings":0,"cell_chars":16384,"cell_head_chars":4096},"cells_cut":0,"cells_raw":0,"read":"whole","date_system":"1900"}

{"sheet":"PVPC","index":0,"n_rows":45,"n_cols":19,"rows_kept":45,"cut":false,"hidden":false,"merged":[[33,1,33,2],[35,1,35,7],[39,1,39,11],[37,1,37,7],[34,1,34,5]]}
[null,null,null,null,null,null,null,null,null,null,null,null,null,{"$f":"$S$1 & \" Horas PVPC MÁXIMO\"","v":"20 Horas PVPC MÁXIMO"},null,{"$f":"INDEX(TablaPVPC[PVPC\n€/MWh],MATCH(\"MÁXIMO*\",TablaPVPC[Tipo Período],0)) & \" €/MWh\"","v":"335,9 €/MWh"},{"$f":"\"de \" & $S$1-1 & \" a \" & $S$1 & \" horas\"","v":"de 19 a 20 horas"},null,{"$f":"INDEX(TablaPVPC[Hora],MATCH(\"MÁXIMO*\",TablaPVPC[Tipo Período],0))","v":20}]
[null,null,null,null,null,null,null,null,null,null,null,null,null,{"$f":"$S$2 & \" Horas PVPC MÍNIMO\"","v":"3 Horas PVPC MÍNIMO"},null,{"$f":"INDEX(TablaPVPC[PVPC\n€/MWh],MATCH(\"MÍNIMO*\",TablaPVPC[Tipo Período],0)) & \" €/MWh\"","v":"223,1 €/MWh"},{"$f":"\"de \" & $S$2-1 & \" a \" & $S$2 & \" horas\"","v":"de 2 a 3 horas"},null,{"$f":"INDEX(TablaPVPC[Hora],MATCH(\"MÍNIMO*\",TablaPVPC[Tipo Período],0))","v":3}]
[]
[]
[]
[]
[]
[null,null,null,null,null,null,null,null,null,null,null,null,null,{"$f":"\"PVPC \" & MiTerritorio","v":"PVPC Península-Canarias-Baleares"}]
[null,null,null,null,null,null,null,null,null,null,null,null,null,{"$f":"TEXT(MiDía,\"dd-mm-\") & YEAR(MiDía) & \" de \" & MiHora-1 & \" a \" & MiHora & \" horas\"","v":"23-05-2022 de 9 a 10 horas"}]
[]
[null,null,null,null,null,null,null,null,null,null,null,null,"C","Hora PVPC",{"$f":"INDIRECT(\"'PVPC \" & MiTerritorioPVPC & \"'!B\" & MiHora+1)","v":10},{"$f":"\"Peaje \" & INDIRECT(\"'PVPC \" & MiTerritorioPVPC & \"'!\" & $M11 & MiHora+1)","v":"Peaje 2.0TD"},"€/MWh","€/MWh"]
[null,null,null,null,null,null,null,null,null,null,null,null,"D","Periodo",{"$f":"INDIRECT(\"'PVPC \" & MiTerritorioPVPC & \"'!\" & $M12 & MiHora+1)","v":2},{"$f":"INDIRECT(\"'PVPC AUX'!E\" & MiHora+1)","v":"Llano"},"consumo","bc"]
[]
[null,null,null,null,null,null,null,null,null,null,null,null,"E","Término energía PVPC",null,null,{"$f":"INDIRECT(\"'PVPC \" & MiTerritorioPVPC & \"'!\" & $M14 & MiHora+1)","v":292.41000000000003},null,"FEU = TEU + TCU"]
[null,null,null,null,null,null,null,null,null,null,null,null,"F","Peajes y cargos",null,null,{"$f":"INDIRECT(\"'PVPC \" & MiTerritorioPVPC & \"'!\" & $M15 & MiHora+1)","v":28.47},null,"TEU"]
[null,null,null,null,null,null,null,null,null,null,null,null,"G","Precio producción",null,null,{"$f":"INDIRECT(\"'PVPC \" & MiTerritorioPVPC & \"'!\" & $M16 & MiHora+1)","v":263.94},null,"TCU=CP x(1+PERD/100)"]
[]
[null,null,null,null,null,null,null,null,null,null,null,null,"H","% coeficiente pérdidas PVPC",null,null,null,{"$f":"INDIRECT(\"'PVPC \" & MiTerritorioPVPC & \"'!\" & $M18 & MiHora+1) / 100","v":0.155},"PERD"]
[null,null,null,null,null,null,null,null,null,null,null,null,"I","% coeficiente \npérdidas estándar",null,null,null,{"$f":"INDIRECT(\"'PVPC \" & MiTerritorioPVPC & \"'!\" & $M19 & MiHora+1) / 100","v":0.16300000000000001}]
[]
[null,null,null,null,null,null,null,null,null,null,null,null,"J","Coste producción CP",null,null,null,{"$f":"INDIRECT(\"'PVPC \" & MiTerritorioPVPC & \"'!\" & $M21 & MiHora+1)","v":228.52},"CP=OC+SAH+PMH"]
[]
[null,null,null,null,null,null,null,null,null,null,null,null,"K","Total OC",null,null,null,{"$f":"INDIRECT(\"'PVPC \" & MiTerritorioPVPC & \"'!\" & $M23 & MiHora+1)","v":4.6500000000000004},"OC"]
[null,null,null,null,null,null,null,null,null,null,null,null,"L","Financiación OS",null,null,null,{"$f":"INDIRECT(\"'PVPC \" & MiTerritorioPVPC & \"'!\" & $M24 & MiHora+1)","v":0.14000000000000001}]
[null,null,null,null,null,null,null,null,null,null,null,null,"M","Financiación OM",null,null,null,{"$f":"INDIRECT(\"'PVPC \" & MiTerritorioPVPC & \"'!\" & $M25 & MiHora+1)","v":0.03}]
[null,null,null,null,null,null,null,null,null,null,null,null,"N","Cargo capacidad",null,null,null,{"$f":"INDIRECT(\"'PVPC \" & MiTerritorioPVPC & \"'!\" & $M26 & MiHora+1)","v":0.24}]
[null,null,null,null,null,null,null,null,null,null,null,null,"O","Servicio interrumpibilidad",null,null,null,{"$f":"INDIRECT(\"'PVPC \" & MiTerritorioPVPC & \"'!\" & $M27 & MiHora+1)","v":0}]
[null,null,null,null,null,null,null,null,null,null,null,null,"P","Excedente o deficit subastas renovables",null,null,null,{"$f":"INDIRECT(\"'PVPC \" & MiTerritorioPVPC & \"'!\" & $M28 & MiHora+1)","v":0}]
[null,null,null,null,null,null,null,null,null,null,null,null,"Q","CCVh coste comercialización RCVtovph",null,null,null,{"$f":"INDIRECT(\"'PVPC \" & MiTerritorioPVPC & \"'!\" & $M29 & MiHora+1)","v":3.43}]
[null,null,null,null,null,null,null,null,null,null,null,null,"R","CCVh coste comercialización RFE",null,null,null,{"$f":"INDIRECT(\"'PVPC \" & MiTerritorioPVPC & \"'!\" & $M30 & MiHora+1)","v":0.26}]
[null,null,null,null,null,null,null,null,null,null,null,null,"S","CCVh coste comercialización RMRv",null,null,null,{"$f":"INDIRECT(\"'PVPC \" & MiTerritorioPVPC & \"'!\" & $M31 & MiHora+1)","v":0}]
[null,null,null,null,null,null,null,null,null,null,null,null,"T","CCVh coste comercialización Runitaria",null,null,null,{"$f":"INDIRECT(\"'PVPC \" & MiTerritorioPVPC & \"'!\" & $M32 & MiHora+1)","v":0.56000000000000005}]
[]
["AUTOR:","#ExcelPedroWave",null,null,null,null,null,null,null,null,null,null,"U","Total SAH",null,null,null,{"$f":"INDIRECT(\"'PVPC \" & MiTerritorioPVPC & \"'!\" & $M34 & MiHora+1)","v":3.24},"SAH"]
["BLOG:","Gráficos PVPC Electricidad España | #ExcelPedroWave",null,null,null,null,null,null,null,null,null,null,"V","Otros sistema",null,null,null,{"$f":"INDIRECT(\"'PVPC \" & MiTerritorioPVPC & \"'!\" & $M35 & MiHora+1)","v":1.24}]
["COPYRIGHT:","Creative Commons — Atribución-NoComercial-CompartirIgual 3.0 No portada",null,null,null,null,null,null,null,null,null,null,"W","Coste desvíos",null,null,null,{"$f":"INDIRECT(\"'PVPC \" & MiTerritorioPVPC & \"'!\" & $M36 & MiHora+1)","v":0.3}]
[null,null,null,null,null,null,null,null,null,null,null,null,"X","Coste banda",null,null,null,{"$f":"INDIRECT(\"'PVPC \" & MiTerritorioPVPC & \"'!\" & $M37 & MiHora+1)","v":1.36}]
["DATOS:","Aviso legal y política de privacidad | ESIOS electricidad · datos · transparencia (ree.es)",null,null,null,null,null,null,null,null,null,null,"Y","Coste  reserva",null,null,null,{"$f":"INDIRECT(\"'PVPC \" & MiTerritorioPVPC & \"'!\" & $M38 & MiHora+1)","v":0}]
[null,"6.1 Propiedad intelectual e industrial",null,null,null,null,null,null,null,null,null,null,"Z","Coste restricciones técnicas diario",null,null,null,{"$f":"INDIRECT(\"'PVPC \" & MiTerritorioPVPC & \"'!\" & $M39 & MiHora+1)","v":0.34}]
[null,"La reproducción, comunicación pública, distribución, modificación o cualquier otra acción similar, de todo o parte de los mismos están sujetas a las condiciones contenidas en este documento. En particular el usuario estará sujeto a las siguientes condiciones:"]
[null,"1. Mencionar de forma clara y explícita a Red Eléctrica como fuente de la información y de los datos.",null,null,null,null,null,null,null,null,null,null,"AA","Total PMH",null,null,null,{"$f":"INDIRECT(\"'PVPC \" & MiTerritorioPVPC & \"'!\" & $M41 & MiHora+1)","v":220.63},"PMH"]
[null,"2. No alterar ni desnaturalizar el sentido de la información ni de los datos.",null,null,null,null,null,null,null,null,null,null,"AB","Componente intradiario 1",null,null,null,{"$f":"INDIRECT(\"'PVPC \" & MiTerritorioPVPC & \"'!\" & $M42 & MiHora+1)","v":-0.34}]
[null,"3. Mencionar la fecha de la última actualización de la información y los datos.",null,null,null,null,null,null,null,null,null,null,"AC","Mercado diario",null,null,null,{"$f":"INDIRECT(\"'PVPC \" & MiTerritorioPVPC & \"'!\" & $M43 & MiHora+1)","v":220.97}]
[null,"4. No se podrá sugerir o indicar que el titular de la información patrocina o apoya la reutilización que se realice.",null,null,null,null,null,null,null,null,null,null,"AD"]
[null,null,null,null,null,null,null,null,null,null,null,null,null,"Coeficiente perfilado",null,{"$f":"INDIRECT(\"'PVPC \" & MiTerritorioPVPC & \"'!\" & $M44 & MiHora+1)","v":1.00008541E-4}]

{"sheet":"PVPC AUX","index":1,"n_rows":358,"n_cols":11,"rows_kept":358,"cut":false,"hidden":false,"merged":[]}
["Día","Hora","Periodo","PVPC\n€/MWh","Tipo Período","Horas",null,"Fecha",null,"PVPC",{"$f":"INDEX(TablaTerritorioPVPC[Tabla],MATCH(MiTerritorio,TablaTerritorioPVPC[Territorio],0))","v":"PCB"}]
[{"$f":"IF(MiTerritorioPVPC=\"PCB\",'PVPC PCB'!A2,'PVPC CYM'!A2)","v":"2022-05-23"},{"$f":"IF(MiTerritorioPVPC=\"PCB\",'PVPC PCB'!B2,'PVPC CYM'!B2)","v":1},{"$f":"IF(MiTerritorioPVPC=\"PCB\",'PVPC PCB'!D2,'PVPC CYM'!D2)","v":3},{"$f":"IF(MiTerritorioPVPC=\"PCB\",'PVPC PCB'!E2,'PVPC CYM'!E2)","v":246.28},{"$f":"IF(TablaPVPC[[#This Row],[PVPC\n€/MWh]]=$D$26,\"MÁXIMO \n\",\nIF(TablaPVPC[[#This Row],[PVPC\n€/MWh]]=$C$26,\"MÍNIMO \n\",\"\")) & CHOOSE(TablaPVPC[[#This Row],[Periodo]],\"Punta\",\"Llano\",\"Valle\")","v":"Valle"},12,null,"2021-06-01"]
[{"$f":"IF(MiTerritorioPVPC=\"PCB\",'PVPC PCB'!A3,'PVPC CYM'!A3)","v":"2022-05-23"},{"$f":"IF(MiTerritorioPVPC=\"PCB\",'PVPC PCB'!B3,'PVPC CYM'!B3)","v":2},{"$f":"IF(MiTerritorioPVPC=\"PCB\",'PVPC PCB'!D3,'PVPC CYM'!D3)","v":3},{"$f":"IF(MiTerritorioPVPC=\"PCB\",'PVPC PCB'!E3,'PVPC CYM'!E3)","v":231.59},{"$f":"IF(TablaPVPC[[#This Row],[PVPC\n€/MWh]]=$D$26,\"MÁXIMO \n\",\nIF(TablaPVPC[[#This Row],[PVPC\n€/MWh]]=$C$26,\"MÍNIMO \n\",\"\")) & CHOOSE(TablaPVPC[[#This Row],[Periodo]],\"Punta\",\"Llano\",\"Valle\")","v":"Valle"},1,null,"2021-06-02",null,"Fecha PVPC",{"$f":"IF(MiFecha=0,MiDía,MiFecha)","v":"2022-05-23"}]
[{"$f":"IF(MiTerritorioPVPC=\"PCB\",'PVPC PCB'!A4,'PVPC CYM'!A4)","v":"2022-05-23"},{"$f":"IF(MiTerritorioPVPC=\"PCB\",'PVPC PCB'!B4,'PVPC CYM'!B4)","v":3},{"$f":"IF(MiTerritorioPVPC=\"PCB\",'PVPC PCB'!D4,'PVPC CYM'!D4)","v":3},{"$f":"IF(MiTerritorioPVPC=\"PCB\",'PVPC PCB'!E4,'PVPC CYM'!E4)","v":223.1},{"$f":"IF(TablaPVPC[[#This Row],[PVPC\n€/MWh]]=$D$26,\"MÁXIMO \n\",\nIF(TablaPVPC[[#This Row],[PVPC\n€/MWh]]=$C$26,\"MÍNIMO \n\",\"\")) & CHOOSE(TablaPVPC[[#This Row],[Periodo]],\"Punta\",\"Llano\",\"Valle\")","v":"MÍNIMO \nValle"},2,null,"2021-06-03",null,"Fecha Mínima","2021-06-01"]
[{"$f":"IF(MiTerritorioPVPC=\"PCB\",'PVPC PCB'!A5,'PVPC CYM'!A5)","v":"2022-05-23"},{"$f":"IF(MiTerritorioPVPC=\"PCB\",'PVPC PCB'!B5,'PVPC CYM'!B5)","v":4},{"$f":"IF(MiTerritorioPVPC=\"PCB\",'PVPC PCB'!D5,'PVPC CYM'!D5)","v":3},{"$f":"IF(MiTerritorioPVPC=\"PCB\",'PVPC PCB'!E5,'PVPC CYM'!E5)","v":225.06},{"$f":"IF(TablaPVPC[[#This Row],[PVPC\n€/MWh]]=$D$26,\"MÁXIMO \n\",\nIF(TablaPVPC[[#This Row],[PVPC\n€/MWh]]=$C$26,\"MÍNIMO \n\",\"\")) & CHOOSE(TablaPVPC[[#This Row],[Periodo]],\"Punta\",\"Llano\",\"Valle\")","v":"Valle"},3,null,"2021-06-04",null,"Fecha Máxima",{"$f":"TODAY()+IF(TEXT(NOW(),\"hh:mm\")>\"20:15\",1,0)","v":"2022-05-23"}]
[{"$f":"IF(MiTerritorioPVPC=\"PCB\",'PVPC PCB'!A6,'PVPC CYM'!A6)","v":"2022-05-23"},{"$f":"IF(MiTerritorioPVPC=\"PCB\",'PVPC PCB'!B6,'PVPC CYM'!B6)","v":5},{"$f":"IF(MiTerritorioPVPC=\"PCB\",'PVPC PCB'!D6,'PVPC CYM'!D6)","v":3},{"$f":"IF(MiTerritorioPVPC=\"PCB\",'PVPC PCB'!E6,'PVPC CYM'!E6)","v":224.82},{"$f":"IF(TablaPVPC[[#This Row],[PVPC\n€/MWh]]=$D$26,\"MÁXIMO \n\",\nIF(TablaPVPC[[#This Row],[PVPC\n€/MWh]]=$C$26,\"MÍNIMO \n\",\"\")) & CHOOSE(TablaPVPC[[#This Row],[Periodo]],\"Punta\",\"Llano\",\"Valle\")","v":"Valle"},4,null,"2021-06-05",null,"Fecha ISO",{"$f":"YEAR(MiFechaPVPC) & TEXT(MiFechaPVPC,\"-mm-dd\")","v":"2022-05-23"}]
[{"$f":"IF(MiTerritorioPVPC=\"PCB\",'PVPC PCB'!A7,'PVPC CYM'!A7)","v":"2022-05-23"},{"$f":"IF(MiTerritorioPVPC=\"PCB\",'PVPC PCB'!B7,'PVPC CYM'!B7)","v":6},{"$f":"IF(MiTerritorioPVPC=\"PCB\",'PVPC PCB'!D7,'PVPC CYM'!D7)","v":3},{"$f":"IF(MiTerritorioPVPC=\"PCB\",'PVPC PCB'!E7,'PVPC CYM'!E7)","v":225.34},{"$f":"IF(TablaPVPC[[#This Row],[PVPC\n€/MWh]]=$D$26,\"MÁXIMO \n\",\nIF(TablaPVPC[[#This Row],[PVPC\n€/MWh]]=$C$26,\"MÍNIMO \n\",\"\")) & CHOOSE(TablaPVPC[[#This Row],[Periodo]],\"Punta\",\"Llano\",\"Valle\")","v":"Valle"},5,null,"2021-06-06"]
[{"$f":"IF(MiTerritorioPVPC=\"PCB\",'PVPC PCB'!A8,'PVPC CYM'!A8)","v":"2022-05-23"},{"$f":"IF(MiTerritorioPVPC=\"PCB\",'PVPC PCB'!B8,'PVPC CYM'!B8)","v":7},{"$f":"IF(MiTerritorioPVPC=\"PCB\",'PVPC PCB'!D8,'PVPC CYM'!D8)","v":3},{"$f":"IF(MiTerritorioPVPC=\"PCB\",'PVPC PCB'!E8,'PVPC CYM'!E8)","v":255.57},{"$f":"IF(TablaPVPC[[#This Row],[PVPC\n€/MWh]]=$D$26,\"MÁXIMO \n\",\nIF(TablaPVPC[[#This Row],[PVPC\n€/MWh]]=$C$26,\"MÍNIMO \n\",\"\")) & CHOOSE(TablaPVPC[[#This Row],[Periodo]],\"Punta\",\"Llano\",\"Valle\")","v":"Valle"},6,null,"2021-06-07",null,"Ruta",{"$f":"\"https://api.esios.ree.es/archives/71/download?date_type=datos&end_date=\" & MiFechaISO & \"T23%3A59%3A59%2B00%3A00&locale=es&start_date=\" & MiFechaISO & \"T00%3A00%3A00%2B00%3A00\"","v":"https://api.esios.ree.es/archives/71/download?date_type=datos&end_date=2022-05-23T23%3A59%3A59%2B00%3A00&locale=es&start_date=2022-05-23T00%3A00%3A00%2B00%3A00"}]
[{"$f":"IF(MiTerritorioPVPC=\"PCB\",'PVPC PCB'!A9,'PVPC CYM'!A9)","v":"2022-05-23"},{"$f":"IF(MiTerritorioPVPC=\"PCB\",'PVPC PCB'!B9,'PVPC CYM'!B9)","v":8},{"$f":"IF(MiTerritorioPVPC=\"PCB\",'PVPC PCB'!D9,'PVPC CYM'!D9)","v":3},{"$f":"IF(MiTerritorioPVPC=\"PCB\",'PVPC PCB'!E9,'PVPC CYM'!E9)","v":276.87},{"$f":"IF(TablaPVPC[[#This Row],[PVPC\n€/MWh]]=$D$26,\"MÁXIMO \n\",\nIF(TablaPVPC[[#This Row],[PVPC\n€/MWh]]=$C$26,\"MÍNIMO \n\",\"\")) & CHOOSE(TablaPVPC[[#This Row],[Periodo]],\"Punta\",\"Llano\",\"Valle\")","v":"Valle"},7,null,"2021-06-08"]
[{"$f":"IF(MiTerritorioPVPC=\"PCB\",'PVPC PCB'!A10,'PVPC CYM'!A10)","v":"2022-05-23"},{"$f":"IF(MiTerritorioPVPC=\"PCB\",'PVPC PCB'!B10,'PVPC CYM'!B10)","v":9},{"$f":"IF(MiTerritorioPVPC=\"PCB\",'PVPC PCB'!D10,'PVPC CYM'!D10)","v":2},{"$f":"IF(MiTerritorioPVPC=\"PCB\",'PVPC PCB'!E10,'PVPC CYM'!E10)","v":312.87},{"$f":"IF(TablaPVPC[[#This Row],[PVPC\n€/MWh]]=$D$26,\"MÁXIMO \n\",\nIF(TablaPVPC[[#This Row],[PVPC\n€/MWh]]=$C$26,\"MÍNIMO \n\",\"\")) & CHOOSE(TablaPVPC[[#This Row],[Periodo]],\"Punta\",\"Llano\",\"Valle\")","v":"Llano"},8,null,"2021-06-09",null,"Título1",{"$f":"\"PVPC \" & MiTerritorio & \" \n\" & TEXT(MiDía,\"dd-mm-\") & YEAR(MiDía) & \" de 0 a 12 horas\"","v":"PVPC Península-Canarias-Baleares \n23-05-2022 de 0 a 12 horas"}]
[{"$f":"IF(MiTerritorioPVPC=\"PCB\",'PVPC PCB'!A11,'PVPC CYM'!A11)","v":"2022-05-23"},{"$f":"IF(MiTerritorioPVPC=\"PCB\",'PVPC PCB'!B11,'PVPC CYM'!B11)","v":10},{"$f":"IF(MiTerritorioPVPC=\"PCB\",'PVPC PCB'!D11,'PVPC CYM'!D11)","v":2},{"$f":"IF(MiTerritorioPVPC=\"PCB\",'PVPC PCB'!E11,'PVPC CYM'!E11)","v":292.41000000000003},{"$f":"IF(TablaPVPC[[#This Row],[PVPC\n€/MWh]]=$D$26,\"MÁXIMO \n\",\nIF(TablaPVPC[[#This Row],[PVPC\n€/MWh]]=$C$26,\"MÍNIMO \n\",\"\")) & CHOOSE(TablaPVPC[[#This Row],[Periodo]],\"Punta\",\"Llano\",\"Valle\")","v":"Llano"},9,null,"2021-06-10",null,"Título2",{"$f":"\"PVPC \" & MiTerritorio & \" \n\" & TEXT(MiDía,\"dd-mm-\") & YEAR(MiDía) & \" de 12 a 24 horas\"","v":"PVPC Península-Canarias-Baleares \n23-05-2022 de 12 a 24 horas"}]
[{"$f":"IF(MiTerritorioPVPC=\"PCB\",'PVPC PCB'!A12,'PVPC CYM'!A12)","v":"2022-05-23"},{"$f":"IF(MiTerritorioPVPC=\"PCB\",'PVPC PCB'!B12,'PVPC CYM'!B12)","v":11},{"$f":"IF(MiTerritorioPVPC=\"PCB\",'PVPC PCB'!D12,'PVPC CYM'!D12)","v":1},{"$f":"IF(MiTerritorioPVPC=\"PCB\",'PVPC PCB'!E12,'PVPC CYM'!E12)","v":334.89},{"$f":"IF(TablaPVPC[[#This Row],[PVPC\n€/MWh]]=$D$26,\"MÁXIMO \n\",\nIF(TablaPVPC[[#This Row],[PVPC\n€/MWh]]=$C$26,\"MÍNIMO \n\",\"\")) & CHOOSE(TablaPVPC[[#This Row],[Periodo]],\"Punta\",\"Llano\",\"Valle\")","v":"Punta"},10,null,"2021-06-11"]
[{"$f":"IF(MiTerritorioPVPC=\"PCB\",'PVPC PCB'!A13,'PVPC CYM'!A13)","v":"2022-05-23"},{"$f":"IF(MiTerritorioPVPC=\"PCB\",'PVPC PCB'!B13,'PVPC CYM'!B13)","v":12},{"$f":"IF(MiTerritorioPVPC=\"PCB\",'PVPC PCB'!D13,'PVPC CYM'!D13)","v":1},{"$f":"IF(MiTerritorioPVPC=\"PCB\",'PVPC PCB'!E13,'PVPC CYM'!E13)","v":315.91000000000003},{"$f":"IF(TablaPVPC[[#This Row],[PVPC\n€/MWh]]=$D$26,\"MÁXIMO \n\",\nIF(TablaPVPC[[#This Row],[PVPC\n€/MWh]]=$C$26,\"MÍNIMO \n\",\"\")) & CHOOSE(TablaPVPC[[#This Row],[Periodo]],\"Punta\",\"Llano\",\"Valle\")","v":"Punta"},11,null,"2021-06-12",null,"Fechas","Territorio"]
[{"$f":"IF(MiTerritorioPVPC=\"PCB\",'PVPC PCB'!A14,'PVPC CYM'!A14)","v":"2022-05-23"},{"$f":"IF(MiTerritorioPVPC=\"PCB\",'PVPC PCB'!B14,'PVPC CYM'!B14)","v":13},{"$f":"IF(MiTerritorioPVPC=\"PCB\",'PVPC PCB'!D14,'PVPC CYM'!D14)","v":1},{"$f":"IF(MiTerritorioPVPC=\"PCB\",'PVPC PCB'!E14,'PVPC CYM'!E14)","v":303.35000000000002},{"$f":"IF(TablaPVPC[[#This Row],[PVPC\n€/MWh]]=$D$26,\"MÁXIMO \n\",\nIF(TablaPVPC[[#This Row],[PVPC\n€/MWh]]=$C$26,\"MÍNIMO \n\",\"\")) & CHOOSE(TablaPVPC[[#This Row],[Periodo]],\"Punta\",\"Llano\",\"Valle\")","v":"Punta"},24,null,"2021-06-13",null,"2022-05-23","Península-Canarias-Baleares"]
[{"$f":"IF(MiTerritorioPVPC=\"PCB\",'PVPC PCB'!A15,'PVPC CYM'!A15)","v":"2022-05-23"},{"$f":"IF(MiTerritorioPVPC=\"PCB\",'PVPC PCB'!B15,'PVPC CYM'!B15)","v":14},{"$f":"IF(MiTerritorioPVPC=\"PCB\",'PVPC PCB'!D15,'PVPC CYM'!D15)","v":1},{"$f":"IF(MiTerritorioPVPC=\"PCB\",'PVPC PCB'!E15,'PVPC CYM'!E15)","v":301.8},{"$f":"IF(TablaPVPC[[#This Row],[PVPC\n€/MWh]]=$D$26,\"MÁXIMO \n\",\nIF(TablaPVPC[[#This Row],[PVPC\n€/MWh]]=$C$26,\"MÍNIMO \n\",\"\")) & CHOOSE(TablaPVPC[[#This Row],[Periodo]],\"Punta\",\"Llano\",\"Valle\")","v":"Punta"},13,null,"2021-06-14",null,"Tabla","Territorio"]
[{"$f":"IF(MiTerritorioPVPC=\"PCB\",'PVPC PCB'!A16,'PVPC CYM'!A16)","v":"2022-05-23"},{"$f":"IF(MiTerritorioPVPC=\"PCB\",'PVPC PCB'!B16,'PVPC CYM'!B16)","v":15},{"$f":"IF(MiTerritorioPVPC=\"PCB\",'PVPC PCB'!D16,'PVPC CYM'!D16)","v":2},{"$f":"IF(MiTerritorioPVPC=\"PCB\",'PVPC PCB'!E16,'PVPC CYM'!E16)","v":245.67},{"$f":"IF(TablaPVPC[[#This Row],[PVPC\n€/MWh]]=$D$26,\"MÁXIMO \n\",\nIF(TablaPVPC[[#This Row],[PVPC\n€/MWh]]=$C$26,\"MÍNIMO \n\",\"\")) & CHOOSE(TablaPVPC[[#This Row],[Periodo]],\"Punta\",\"Llano\",\"Valle\")","v":"Llano"},14,null,"2021-06-15",null,"PCB","Península-Canarias-Baleares"]
[{"$f":"IF(MiTerritorioPVPC=\"PCB\",'PVPC PCB'!A17,'PVPC CYM'!A17)","v":"2022-05-23"},{"$f":"IF(MiTerritorioPVPC=\"PCB\",'PVPC PCB'!B17,'PVPC CYM'!B17)","v":16},{"$f":"IF(MiTerritorioPVPC=\"PCB\",'PVPC PCB'!D17,'PVPC CYM'!D17)","v":2},{"$f":"IF(MiTerritorioPVPC=\"PCB\",'PVPC PCB'!E17,'PVPC CYM'!E17)","v":250.88},{"$f":"IF(TablaPVPC[[#This Row],[PVPC\n€/MWh]]=$D$26,\"MÁXIMO \n\",\nIF(TablaPVPC[[#This Row],[PVPC\n€/MWh]]=$C$26,\"MÍNIMO \n\",\"\")) & CHOOSE(TablaPVPC[[#This Row],[Periodo]],\"Punta\",\"Llano\",\"Valle\")","v":"Llano"},15,null,"2021-06-16",null,"CYM","Ceuta y Melilla"]
[{"$f":"IF(MiTerritorioPVPC=\"PCB\",'PVPC PCB'!A18,'PVPC CYM'!A18)","v":"2022-05-23"},{"$f":"IF(MiTerritorioPVPC=\"PCB\",'PVPC PCB'!B18,'PVPC CYM'!B18)","v":17},{"$f":"IF(MiTerritorioPVPC=\"PCB\",'PVPC PCB'!D18,'PVPC CYM'!D18)","v":2},{"$f":"IF(MiTerritorioPVPC=\"PCB\",'PVPC PCB'!E18,'PVPC CYM'!E18)","v":249.16},{"$f":"IF(TablaPVPC[[#This Row],[PVPC\n€/MWh]]=$D$26,\"MÁXIMO \n\",\nIF(TablaPVPC[[#This Row],[PVPC\n€/MWh]]=$C$26,\"MÍNIMO \n\",\"\")) & CHOOSE(TablaPVPC[[#This Row],[Periodo]],\"Punta\",\"Llano\",\"Valle\")","v":"Llano"},16,null,"2021-06-17"]
[{"$f":"IF(MiTerritorioPVPC=\"PCB\",'PVPC PCB'!A19,'PVPC CYM'!A19)","v":"2022-05-23"},{"$f":"IF(MiTerritorioPVPC=\"PCB\",'PVPC PCB'!B19,'PVPC CYM'!B19)","v":18},{"$f":"IF(MiTerritorioPVPC=\"PCB\",'PVPC PCB'!D19,'PVPC CYM'!D19)","v":2},{"$f":"IF(MiTerritorioPVPC=\"PCB\",'PVPC PCB'!E19,'PVPC CYM'!E19)","v":255.21},{"$f":"IF(TablaPVPC[[#This Row],[PVPC\n€/MWh]]=$D$26,\"MÁXIMO \n\",\nIF(TablaPVPC[[#This Row],[PVPC\n€/MWh]]=$C$26,\"MÍNIMO \n\",\"\")) & CHOOSE(TablaPVPC[[#This Row],[Periodo]],\"Punta\",\"Llano\",\"Valle\")","v":"Llano"},17,null,"2021-06-18",null,"Horas","Hora anterior"]
[{"$f":"IF(MiTerritorioPVPC=\"PCB\",'PVPC PCB'!A20,'PVPC CYM'!A20)","v":"2022-05-23"},{"$f":"IF(MiTerritorioPVPC=\"PCB\",'PVPC PCB'!B20,'PVPC CYM'!B20)","v":19},{"$f":"IF(MiTerritorioPVPC=\"PCB\",'PVPC PCB'!D20,'PVPC CYM'!D20)","v":1},{"$f":"IF(MiTerritorioPVPC=\"PCB\",'PVPC PCB'!E20,'PVPC CYM'!E20)","v":299.64},{"$f":"IF(TablaPVPC[[#This Row],[PVPC\n€/MWh]]=$D$26,\"MÁXIMO \n\",\nIF(TablaPVPC[[#This Row],[PVPC\n€/MWh]]=$C$26,\"MÍNIMO \n\",\"\")) & CHOOSE(TablaPVPC[[#This Row],[Periodo]],\"Punta\",\"Llano\",\"Valle\")","v":"Punta"},18,null,"2021-06-19",null,10,10]
[{"$f":"IF(MiTerritorioPVPC=\"PCB\",'PVPC PCB'!A21,'PVPC CYM'!A21)","v":"2022-05-23"},{"$f":"IF(MiTerritorioPVPC=\"PCB\",'PVPC PCB'!B21,'PVPC CYM'!B21)","v":20},{"$f":"IF(MiTerritorioPVPC=\"PCB\",'PVPC PCB'!D21,'PVPC CYM'!D21)","v":1},{"$f":"IF(MiTerritorioPVPC=\"PCB\",'PVPC PCB'!E21,'PVPC CYM'!E21)","v":335.9},{"$f":"IF(TablaPVPC[[#This Row],[PVPC\n€/MWh]]=$D$26,\"MÁXIMO \n\",\nIF(TablaPVPC[[#This Row],[PVPC\n€/MWh]]=$C$26,\"MÍNIMO \n\",\"\")) & CHOOSE(TablaPVPC[[#This Row],[Periodo]],\"Punta\",\"Llano\",\"Valle\")","v":"MÁXIMO \nPunta"},19,null,"2021-06-20",null,"Hora"]
[{"$f":"IF(MiTerritorioPVPC=\"PCB\",'PVPC PCB'!A22,'PVPC CYM'!A22)","v":"2022-05-23"},{"$f":"IF(MiTerritorioPVPC=\"PCB\",'PVPC PCB'!B22,'PVPC CYM'!B22)","v":21},{"$f":"IF(MiTerritorioPVPC=\"PCB\",'PVPC PCB'!D22,'PVPC CYM'!D22)","v":1},{"$f":"IF(MiTerritorioPVPC=\"PCB\",'PVPC PCB'!E22,'PVPC CYM'!E22)","v":331.29},{"$f":"IF(TablaPVPC[[#This Row],[PVPC\n€/MWh]]=$D$26,\"MÁXIMO \n\",\nIF(TablaPVPC[[#This Row],[PVPC\n€/MWh]]=$C$26,\"MÍNIMO \n\",\"\")) & CHOOSE(TablaPVPC[[#This Row],[Periodo]],\"Punta\",\"Llano\",\"Valle\")","v":"Punta"},20,null,"2021-06-21",null,1]
[{"$f":"IF(MiTerritorioPVPC=\"PCB\",'PVPC PCB'!A23,'PVPC CYM'!A23)","v":"2022-05-23"},{"$f":"IF(MiTerritorioPVPC=\"PCB\",'PVPC PCB'!B23,'PVPC CYM'!B23)","v":22},{"$f":"IF(MiTerritorioPVPC=\"PCB\",'PVPC PCB'!D23,'PVPC CYM'!D23)","v":1},{"$f":"IF(MiTerritorioPVPC=\"PCB\",'PVPC PCB'!E23,'PVPC CYM'!E23)","v":333.37},{"$f":"IF(TablaPVPC[[#This Row],[PVPC\n€/MWh]]=$D$26,\"MÁXIMO \n\",\nIF(TablaPVPC[[#This Row],[PVPC\n€/MWh]]=$C$26,\"MÍNIMO \n\",\"\")) & CHOOSE(TablaPVPC[[#This Row],[Periodo]],\"Punta\",\"Llano\",\"Valle\")","v":"Punta"},21,null,"2021-06-22",null,2]
[{"$f":"IF(MiTerritorioPVPC=\"PCB\",'PVPC PCB'!A24,'PVPC CYM'!A24)","v":"2022-05-23"},{"$f":"IF(MiTerritorioPVPC=\"PCB\",'PVPC PCB'!B24,'PVPC CYM'!B24)","v":23},{"$f":"IF(MiTerritorioPVPC=\"PCB\",'PVPC PCB'!D24,'PVPC CYM'!D24)","v":2},{"$f":"IF(MiTerritorioPVPC=\"PCB\",'PVPC PCB'!E24,'PVPC CYM'!E24)","v":284.68},{"$f":"IF(TablaPVPC[[#This Row],[PVPC\n€/MWh]]=$D$26,\"MÁXIMO \n\",\nIF(TablaPVPC[[#This Row],[PVPC\n€/MWh]]=$C$26,\"MÍNIMO \n\",\"\")) & CHOOSE(TablaPVPC[[#This Row],[Periodo]],\"Punta\",\"Llano\",\"Valle\")","v":"Llano"},22,null,"2021-06-23",null,3]
[{"$f":"IF(MiTerritorioPVPC=\"PCB\",'PVPC PCB'!A25,'PVPC CYM'!A25)","v":"2022-05-23"},{"$f":"IF(MiTerritorioPVPC=\"PCB\",'PVPC PCB'!B25,'PVPC CYM'!B25)","v":24},{"$f":"IF(MiTerritorioPVPC=\"PCB\",'PVPC PCB'!D25,'PVPC CYM'!D25)","v":2},{"$f":"IF(MiTerritorioPVPC=\"PCB\",'PVPC PCB'!E25,'PVPC CYM'!E25)","v":255.51},{"$f":"IF(TablaPVPC[[#This Row],[PVPC\n€/MWh]]=$D$26,\"MÁXIMO \n\",\nIF(TablaPVPC[[#This Row],[PVPC\n€/MWh]]=$C$26,\"MÍNIMO \n\",\"\")) & CHOOSE(TablaPVPC[[#This Row],[Periodo]],\"Punta\",\"Llano\",\"Valle\")","v":"Llano"},23,null,"2021-06-24",null,4]
["Total",null,{"$f":"SUBTOTAL(5,TablaPVPC[PVPC\n€/MWh])","v":223.1},{"$f":"SUBTOTAL(4,TablaPVPC[PVPC\n€/MWh])","v":335.9},{"$f":"SUBTOTAL(103,TablaPVPC[Tipo Período])","v":24},null,null,"2021-06-25",null,5]
[null,null,null,null,null,null,null,"2021-06-26",null,6]
[null,null,null,null,null,null,null,"2021-06-27",null,7]
[null,null,null,null,null,null,null,"2021-06-28",null,8]
[null,null,null,null,null,null,null,"2021-06-29",null,9]
[null,null,null,null,null,null,null,"2021-06-30",null,10]
[null,null,null,null,null,null,null,"2021-07-01",null,11]
[null,null,null,null,null,null,null,"2021-07-02",null,12]
[null,null,null,null,null,null,null,"2021-07-03",null,13]
[null,null,null,null,null,null,null,"2021-07-04",null,14]
[null,null,null,null,null,null,null,"2021-07-05",null,15]
[null,null,null,null,null,null,null,"2021-07-06",null,16]
[null,null,null,null,null,null,null,"2021-07-07",null,17]
[null,null,null,null,null,null,null,"2021-07-08",null,18]
[null,null,null,null,null,null,null,"2021-07-09",null,19]
[null,null,null,null,null,null,null,"2021-07-10",null,20]
[null,null,null,null,null,null,null,"2021-07-11",null,21]
[null,null,null,null,null,null,null,"2021-07-12",null,22]
[null,null,null,null,null,null,null,"2021-07-13",null,23]
[null,null,null,null,null,null,null,"2021-07-14",null,24]
[null,null,null,null,null,null,null,"2021-07-15"]
[null,null,null,null,null,null,null,"2021-07-16"]
[null,null,null,null,null,null,null,"2021-07-17"]
[null,null,null,null,null,null,null,"2021-07-18"]
[null,null,null,null,null,null,null,"2021-07-19"]
[null,null,null,null,null,null,null,"2021-07-20"]
[null,null,null,null,null,null,null,"2021-07-21"]
[null,null,null,null,null,null,null,"2021-07-22"]
[null,null,null,null,null,null,null,"2021-07-23"]
[null,null,null,null,null,null,null,"2021-07-24"]
[null,null,null,null,null,null,null,"2021-07-25"]
[null,null,null,null,null,null,null,"2021-07-26"]
[null,null,null,null,null,null,null,"2021-07-27"]
[null,null,null,null,null,null,null,"2021-07-28"]
[null,null,null,null,null,null,null,"2021-07-29"]
[null,null,null,null,null,null,null,"2021-07-30"]
[null,null,null,null,null,null,null,"2021-07-31"]
[null,null,null,null,null,null,null,"2021-08-01"]
[null,null,null,null,null,null,null,"2021-08-02"]
[null,null,null,null,null,null,null,"2021-08-03"]
[null,null,null,null,null,null,null,"2021-08-04"]
[null,null,null,null,null,null,null,"2021-08-05"]
[null,null,null,null,null,null,null,"2021-08-06"]
[null,null,null,null,null,null,null,"2021-08-07"]
[null,null,null,null,null,null,null,"2021-08-08"]
[null,null,null,null,null,null,null,"2021-08-09"]
[null,null,null,null,null,null,null,"2021-08-10"]
[null,null,null,null,null,null,null,"2021-08-11"]
[null,null,null,null,null,null,null,"2021-08-12"]
[null,null,null,null,null,null,null,"2021-08-13"]
[null,null,null,null,null,null,null,"2021-08-14"]
[null,null,null,null,null,null,null,"2021-08-15"]
[null,null,null,null,null,null,null,"2021-08-16"]
[null,null,null,null,null,null,null,"2021-08-17"]
[null,null,null,null,null,null,null,"2021-08-18"]
[null,null,null,null,null,null,null,"2021-08-19"]
[null,null,null,null,null,null,null,"2021-08-20"]
[null,null,null,null,null,null,null,"2021-08-21"]
[null,null,null,null,null,null,null,"2021-08-22"]
[null,null,null,null,null,null,null,"2021-08-23"]
[null,null,null,null,null,null,null,"2021-08-24"]
[null,null,null,null,null,null,null,"2021-08-25"]
[null,null,null,null,null,null,null,"2021-08-26"]
[null,null,null,null,null,null,null,"2021-08-27"]
[null,null,null,null,null,null,null,"2021-08-28"]
[null,null,null,null,null,null,null,"2021-08-29"]
[null,null,null,null,null,null,null,"2021-08-30"]
[null,null,null,null,null,null,null,"2021-08-31"]
[null,null,null,null,null,null,null,"2021-09-01"]
[null,null,null,null,null,null,null,"2021-09-02"]
[null,null,null,null,null,null,null,"2021-09-03"]
[null,null,null,null,null,null,null,"2021-09-04"]
[null,null,null,null,null,null,null,"2021-09-05"]
[null,null,null,null,null,null,null,"2021-09-06"]
[null,null,null,null,null,null,null,"2021-09-07"]
[null,null,null,null,null,null,null,"2021-09-08"]
[null,null,null,null,null,null,null,"2021-09-09"]
[null,null,null,null,null,null,null,"2021-09-10"]
[null,null,null,null,null,null,null,"2021-09-11"]
[null,null,null,null,null,null,null,"2021-09-12"]
[null,null,null,null,null,null,null,"2021-09-13"]
[null,null,null,null,null,null,null,"2021-09-14"]
[null,null,null,null,null,null,null,"2021-09-15"]
[null,null,null,null,null,null,null,"2021-09-16"]
[null,null,null,null,null,null,null,"2021-09-17"]
[null,null,null,null,null,null,null,"2021-09-18"]
[null,null,null,null,null,null,null,"2021-09-19"]
[null,null,null,null,null,null,null,"2021-09-20"]
[null,null,null,null,null,null,null,"2021-09-21"]
[null,null,null,null,null,null,null,"2021-09-22"]
[null,null,null,null,null,null,null,"2021-09-23"]
[null,null,null,null,null,null,null,"2021-09-24"]
[null,null,null,null,null,null,null,"2021-09-25"]
[null,null,null,null,null,null,null,"2021-09-26"]
[null,null,null,null,null,null,null,"2021-09-27"]
[null,null,null,null,null,null,null,"2021-09-28"]
[null,null,null,null,null,null,null,"2021-09-29"]
[null,null,null,null,null,null,null,"2021-09-30"]
[null,null,null,null,null,null,null,"2021-10-01"]
[null,null,null,null,null,null,null,"2021-10-02"]
[null,null,null,null,null,null,null,"2021-10-03"]
[null,null,null,null,null,null,null,"2021-10-04"]
[null,null,null,null,null,null,null,"2021-10-05"]
[null,null,null,null,null,null,null,"2021-10-06"]
[null,null,null,null,null,null,null,"2021-10-07"]
[null,null,null,null,null,null,null,"2021-10-08"]
[null,null,null,null,null,null,null,"2021-10-09"]
[null,null,null,null,null,null,null,"2021-10-10"]
[null,null,null,null,null,null,null,"2021-10-11"]
[null,null,null,null,null,null,null,"2021-10-12"]
[null,null,null,null,null,null,null,"2021-10-13"]
[null,null,null,null,null,null,null,"2021-10-14"]
[null,null,null,null,null,null,null,"2021-10-15"]
[null,null,null,null,null,null,null,"2021-10-16"]
[null,null,null,null,null,null,null,"2021-10-17"]
[null,null,null,null,null,null,null,"2021-10-18"]
[null,null,null,null,null,null,null,"2021-10-19"]
[null,null,null,null,null,null,null,"2021-10-20"]
[null,null,null,null,null,null,null,"2021-10-21"]
[null,null,null,null,null,null,null,"2021-10-22"]
[null,null,null,null,null,null,null,"2021-10-23"]
[null,null,null,null,null,null,null,"2021-10-24"]
[null,null,null,null,null,null,null,"2021-10-25"]
[null,null,null,null,null,null,null,"2021-10-26"]
[null,null,null,null,null,null,null,"2021-10-27"]
[null,null,null,null,null,null,null,"2021-10-28"]
[null,null,null,null,null,null,null,"2021-10-29"]
[null,null,null,null,null,null,null,"2021-10-30"]
[null,null,null,null,null,null,null,"2021-10-31"]
[null,null,null,null,null,null,null,"2021-11-01"]
[null,null,null,null,null,null,null,"2021-11-02"]
[null,null,null,null,null,null,null,"2021-11-03"]
[null,null,null,null,null,null,null,"2021-11-04"]
[null,null,null,null,null,null,null,"2021-11-05"]
[null,null,null,null,null,null,null,"2021-11-06"]
[null,null,null,null,null,null,null,"2021-11-07"]
[null,null,null,null,null,null,null,"2021-11-08"]
[null,null,null,null,null,null,null,"2021-11-09"]
[null,null,null,null,null,null,null,"2021-11-10"]
[null,null,null,null,null,null,null,"2021-11-11"]
[null,null,null,null,null,null,null,"2021-11-12"]
[null,null,null,null,null,null,null,"2021-11-13"]
[null,null,null,null,null,null,null,"2021-11-14"]
[null,null,null,null,null,null,null,"2021-11-15"]
[null,null,null,null,null,null,null,"2021-11-16"]
[null,null,null,null,null,null,null,"2021-11-17"]
[null,null,null,null,null,null,null,"2021-11-18"]
[null,null,null,null,null,null,null,"2021-11-19"]
[null,null,null,null,null,null,null,"2021-11-20"]
[null,null,null,null,null,null,null,"2021-11-21"]
[null,null,null,null,null,null,null,"2021-11-22"]
[null,null,null,null,null,null,null,"2021-11-23"]
[null,null,null,null,null,null,null,"2021-11-24"]
[null,null,null,null,null,null,null,"2021-11-25"]
[null,null,null,null,null,null,null,"2021-11-26"]
[null,null,null,null,null,null,null,"2021-11-27"]
[null,null,null,null,null,null,null,"2021-11-28"]
[null,null,null,null,null,null,null,"2021-11-29"]
[null,null,null,null,null,null,null,"2021-11-30"]
[null,null,null,null,null,null,null,"2021-12-01"]
[null,null,null,null,null,null,null,"2021-12-02"]
[null,null,null,null,null,null,null,"2021-12-03"]
[null,null,null,null,null,null,null,"2021-12-04"]
[null,null,null,null,null,null,null,"2021-12-05"]
[null,null,null,null,null,null,null,"2021-12-06"]
[null,null,null,null,null,null,null,"2021-12-07"]
[null,null,null,null,null,null,null,"2021-12-08"]
[null,null,null,null,null,null,null,"2021-12-09"]
[null,null,null,null,null,null,null,"2021-12-10"]
[null,null,null,null,null,null,null,"2021-12-11"]
[null,null,null,null,null,null,null,"2021-12-12"]
[null,null,null,null,null,null,null,"2021-12-13"]
[null,null,null,null,null,null,null,"2021-12-14"]
[null,null,null,null,null,null,null,"2021-12-15"]
[null,null,null,null,null,null,null,"2021-12-16"]
[null,null,null,null,null,null,null,"2021-12-17"]
[null,null,null,null,null,null,null,"2021-12-18"]
[null,null,null,null,null,null,null,"2021-12-19"]
[null,null,null,null,null,null,null,"2021-12-20"]
[null,null,null,null,null,null,null,"2021-12-21"]
[null,null,null,null,null,null,null,"2021-12-22"]
[null,null,null,null,null,null,null,"2021-12-23"]
[null,null,null,null,null,null,null,"2021-12-24"]
[null,null,null,null,null,null,null,"2021-12-25"]
[null,null,null,null,null,null,null,"2021-12-26"]
[null,null,null,null,null,null,null,"2021-12-27"]
[null,null,null,null,null,null,null,"2021-12-28"]
[null,null,null,null,null,null,null,"2021-12-29"]
[null,null,null,null,null,null,null,"2021-12-30"]
[null,null,null,null,null,null,null,"2021-12-31"]
[null,null,null,null,null,null,null,"2022-01-01"]
[null,null,null,null,null,null,null,"2022-01-02"]
[null,null,null,null,null,null,null,"2022-01-03"]
[null,null,null,null,null,null,null,"2022-01-04"]
[null,null,null,null,null,null,null,"2022-01-05"]
[null,null,null,null,null,null,null,"2022-01-06"]
[null,null,null,null,null,null,null,"2022-01-07"]
[null,null,null,null,null,null,null,"2022-01-08"]
[null,null,null,null,null,null,null,"2022-01-09"]
[null,null,null,null,null,null,null,"2022-01-10"]
[null,null,null,null,null,null,null,"2022-01-11"]
[null,null,null,null,null,null,null,"2022-01-12"]
[null,null,null,null,null,null,null,"2022-01-13"]
[null,null,null,null,null,null,null,"2022-01-14"]
[null,null,null,null,null,null,null,"2022-01-15"]
[null,null,null,null,null,null,null,"2022-01-16"]
[null,null,null,null,null,null,null,"2022-01-17"]
[null,null,null,null,null,null,null,"2022-01-18"]
[null,null,null,null,null,null,null,"2022-01-19"]
[null,null,null,null,null,null,null,"2022-01-20"]
[null,null,null,null,null,null,null,"2022-01-21"]
[null,null,null,null,null,null,null,"2022-01-22"]
[null,null,null,null,null,null,null,"2022-01-23"]
[null,null,null,null,null,null,null,"2022-01-24"]
[null,null,null,null,null,null,null,"2022-01-25"]
[null,null,null,null,null,null,null,"2022-01-26"]
[null,null,null,null,null,null,null,"2022-01-27"]
[null,null,null,null,null,null,null,"2022-01-28"]
[null,null,null,null,null,null,null,"2022-01-29"]
[null,null,null,null,null,null,null,"2022-01-30"]
[null,null,null,null,null,null,null,"2022-01-31"]
[null,null,null,null,null,null,null,"2022-02-01"]
[null,null,null,null,null,null,null,"2022-02-02"]
[null,null,null,null,null,null,null,"2022-02-03"]
[null,null,null,null,null,null,null,"2022-02-04"]
[null,null,null,null,null,null,null,"2022-02-05"]
[null,null,null,null,null,null,null,"2022-02-06"]
[null,null,null,null,null,null,null,"2022-02-07"]
[null,null,null,null,null,null,null,"2022-02-08"]
[null,null,null,null,null,null,null,"2022-02-09"]
[null,null,null,null,null,null,null,"2022-02-10"]
[null,null,null,null,null,null,null,"2022-02-11"]
[null,null,null,null,null,null,null,"2022-02-12"]
[null,null,null,null,null,null,null,"2022-02-13"]
[null,null,null,null,null,null,null,"2022-02-14"]
[null,null,null,null,null,null,null,"2022-02-15"]
[null,null,null,null,null,null,null,"2022-02-16"]
[null,null,null,null,null,null,null,"2022-02-17"]
[null,null,null,null,null,null,null,"2022-02-18"]
[null,null,null,null,null,null,null,"2022-02-19"]
[null,null,null,null,null,null,null,"2022-02-20"]
[null,null,null,null,null,null,null,"2022-02-21"]
[null,null,null,null,null,null,null,"2022-02-22"]
[null,null,null,null,null,null,null,"2022-02-23"]
[null,null,null,null,null,null,null,"2022-02-24"]
[null,null,null,null,null,null,null,"2022-02-25"]
[null,null,null,null,null,null,null,"2022-02-26"]
[null,null,null,null,null,null,null,"2022-02-27"]
[null,null,null,null,null,null,null,"2022-02-28"]
[null,null,null,null,null,null,null,"2022-03-01"]
[null,null,null,null,null,null,null,"2022-03-02"]
[null,null,null,null,null,null,null,"2022-03-03"]
[null,null,null,null,null,null,null,"2022-03-04"]
[null,null,null,null,null,null,null,"2022-03-05"]
[null,null,null,null,null,null,null,"2022-03-06"]
[null,null,null,null,null,null,null,"2022-03-07"]
[null,null,null,null,null,null,null,"2022-03-08"]
[null,null,null,null,null,null,null,"2022-03-09"]
[null,null,null,null,null,null,null,"2022-03-10"]
[null,null,null,null,null,null,null,"2022-03-11"]
[null,null,null,null,null,null,null,"2022-03-12"]
[null,null,null,null,null,null,null,"2022-03-13"]
[null,null,null,null,null,null,null,"2022-03-14"]
[null,null,null,null,null,null,null,"2022-03-15"]
[null,null,null,null,null,null,null,"2022-03-16"]
[null,null,null,null,null,null,null,"2022-03-17"]
[null,null,null,null,null,null,null,"2022-03-18"]
[null,null,null,null,null,null,null,"2022-03-19"]
[null,null,null,null,null,null,null,"2022-03-20"]
[null,null,null,null,null,null,null,"2022-03-21"]
[null,null,null,null,null,null,null,"2022-03-22"]
[null,null,null,null,null,null,null,"2022-03-23"]
[null,null,null,null,null,null,null,"2022-03-24"]
[null,null,null,null,null,null,null,"2022-03-25"]
[null,null,null,null,null,null,null,"2022-03-26"]
[null,null,null,null,null,null,null,"2022-03-27"]
[null,null,null,null,null,null,null,"2022-03-28"]
[null,null,null,null,null,null,null,"2022-03-29"]
[null,null,null,null,null,null,null,"2022-03-30"]
[null,null,null,null,null,null,null,"2022-03-31"]
[null,null,null,null,null,null,null,"2022-04-01"]
[null,null,null,null,null,null,null,"2022-04-02"]
[null,null,null,null,null,null,null,"2022-04-03"]
[null,null,null,null,null,null,null,"2022-04-04"]
[null,null,null,null,null,null,null,"2022-04-05"]
[null,null,null,null,null,null,null,"2022-04-06"]
[null,null,null,null,null,null,null,"2022-04-07"]
[null,null,null,null,null,null,null,"2022-04-08"]
[null,null,null,null,null,null,null,"2022-04-09"]
[null,null,null,null,null,null,null,"2022-04-10"]
[null,null,null,null,null,null,null,"2022-04-11"]
[null,null,null,null,null,null,null,"2022-04-12"]
[null,null,null,null,null,null,null,"2022-04-13"]
[null,null,null,null,null,null,null,"2022-04-14"]
[null,null,null,null,null,null,null,"2022-04-15"]
[null,null,null,null,null,null,null,"2022-04-16"]
[null,null,null,null,null,null,null,"2022-04-17"]
[null,null,null,null,null,null,null,"2022-04-18"]
[null,null,null,null,null,null,null,"2022-04-19"]
[null,null,null,null,null,null,null,"2022-04-20"]
[null,null,null,null,null,null,null,"2022-04-21"]
[null,null,null,null,null,null,null,"2022-04-22"]
[null,null,null,null,null,null,null,"2022-04-23"]
[null,null,null,null,null,null,null,"2022-04-24"]
[null,null,null,null,null,null,null,"2022-04-25"]
[null,null,null,null,null,null,null,"2022-04-26"]
[null,null,null,null,null,null,null,"2022-04-27"]
[null,null,null,null,null,null,null,"2022-04-28"]
[null,null,null,null,null,null,null,"2022-04-29"]
[null,null,null,null,null,null,null,"2022-04-30"]
[null,null,null,null,null,null,null,"2022-05-01"]
[null,null,null,null,null,null,null,"2022-05-02"]
[null,null,null,null,null,null,null,"2022-05-03"]
[null,null,null,null,null,null,null,"2022-05-04"]
[null,null,null,null,null,null,null,"2022-05-05"]
[null,null,null,null,null,null,null,"2022-05-06"]
[null,null,null,null,null,null,null,"2022-05-07"]
[null,null,null,null,null,null,null,"2022-05-08"]
[null,null,null,null,null,null,null,"2022-05-09"]
[null,null,null,null,null,null,null,"2022-05-10"]
[null,null,null,null,null,null,null,"2022-05-11"]
[null,null,null,null,null,null,null,"2022-05-12"]
[null,null,null,null,null,null,null,"2022-05-13"]
[null,null,null,null,null,null,null,"2022-05-14"]
[null,null,null,null,null,null,null,"2022-05-15"]
[null,null,null,null,null,null,null,"2022-05-16"]
[null,null,null,null,null,null,null,"2022-05-17"]
[null,null,null,null,null,null,null,"2022-05-18"]
[null,null,null,null,null,null,null,"2022-05-19"]
[null,null,null,null,null,null,null,"2022-05-20"]
[null,null,null,null,null,null,null,"2022-05-21"]
[null,null,null,null,null,null,null,"2022-05-22"]
[null,null,null,null,null,null,null,"2022-05-23"]

{"sheet":"PVPC PCB","index":2,"n_rows":25,"n_cols":30,"rows_kept":25,"cut":false,"hidden":false,"merged":[]}
["Día","Hora","Peaje","Periodo","Término energía PVPC\nFEU = TEU + TCU\n€/MWh consumo","Peajes y cargos TEU\n€/MWh consumo","Precio producción\nTCU=CP x(1+PERD/100)\n€/MWh consumo","% coeficiente \npérdidas PVPC\nPERD","% coeficiente \npérdidas estándar","Coste producción\nCP\n€/MWh bc","Total\nOC\n€/MWh bc","Financiación OS\n€/MWh bc","Financiación OM\n€/MWh bc","Cargo capacidad\n€/MWh bc","Servicio \ninterrumpibilidad\n€/MWh bc","Excedente o deficit subastas renovables\n€/MWh bc","CCVh coste comercialización  RCVtovph\n€/MWh bc","CCVh coste comercialización  RFE\n€/MWh bc","CCVh coste comercialización  RMRv\n€/MWh bc","CCVh coste comercialización  Runitaria\n€/MWh bc","Total\nSAH\n€/MWh bc","Otros sistema\n€/MWh bc","Coste desvíos\n€/MWh bc","Coste banda\n€/MWh bc","Coste  reserva\n€/MWh bc","Coste restricciones\ntécnicas diario\n€/MWh bc","Total\nPMH\n€/MWh bc","Componente\nintradiario 1\n€/MWh bc","Mercado\ndiario\n€/MWh bc","Coeficiente\nperfilado"]
["2022-05-23",1,"2.0TD",3,246.28,3.03,243.24,16.8,18,208.26,4.1100000000000003,0.14000000000000001,0.03,0,0,0,3.12,0.26,0,0.56000000000000005,7.14,1.24,0.3,0.97,null,4.62,197.01,0,197.01,8.7911784000000004E-5]
["2022-05-23",2,"2.0TD",3,231.59,3.03,228.56,18.5,18,192.88,3.88,0.14000000000000001,0.03,0,0,0,2.89,0.26,0,0.56000000000000005,8.82,1.24,0.3,1.1499999999999999,null,6.13,180.18,0,180.18,7.2223875000000003E-5]
["2022-05-23",3,"2.0TD",3,223.1,3.03,220.06,19.3,18,184.46,3.75,0.14000000000000001,0.03,0,0,0,2.77,0.26,0,0.56000000000000005,9.16,1.24,0.3,0.57999999999999996,null,7.04,171.55,0,171.55,6.3858927000000007E-5]
["2022-05-23",4,"2.0TD",3,225.06,3.03,222.03,19.7,18,185.49,3.77,0.14000000000000001,0.03,0,0,0,2.78,0.26,0,0.56000000000000005,10.18,1.24,0.3,0.59,null,8.0500000000000007,171.54,0,171.54,5.9867727999999999E-5]
["2022-05-23",5,"2.0TD",3,224.82,3.03,221.78,19.600000000000001,18,185.44,3.77,0.14000000000000001,0.03,0,0,0,2.78,0.26,0,0.56000000000000005,10.18,1.24,0.3,0.59,null,8.0399999999999991,171.49,0,171.49,5.8281483999999997E-5]
["2022-05-23",6,"2.0TD",3,225.34,3.03,222.31,18.899999999999999,18,186.97,3.79,0.14000000000000001,0.03,0,0,0,2.81,0.26,0,0.56000000000000005,10.64,1.24,0.3,1.42,null,7.69,172.54,0,172.54,5.9055624999999999E-5]
["2022-05-23",7,"2.0TD",3,255.57,3.03,252.54,17.5,18,214.93,4.21,0.14000000000000001,0.03,0,0,0,3.22,0.26,0,0.56000000000000005,8.6199999999999992,1.24,0.3,2.71,null,4.38,202.1,-0.6,202.7,6.5320123000000001E-5]
["2022-05-23",8,"2.0TD",3,276.87,3.03,273.83999999999997,16.8,18,234.45,4.5,0.14000000000000001,0.03,0,0,0,3.52,0.26,0,0.56000000000000005,5.5,1.24,0.3,1.21,null,2.75,224.45,-0.51,224.96,7.9044685999999994E-5]
["2022-05-23",9,"2.0TD",2,312.87,28.47,284.39999999999998,18.8,16.3,239.4,4.82,0.14000000000000001,0.03,0.24,0,0,3.59,0.26,0,0.56000000000000005,5.0199999999999996,1.24,0.3,1.5,null,1.98,229.56,-0.46,230.02,9.3685358000000001E-5]
["2022-05-23",10,"2.0TD",2,292.41000000000003,28.47,263.94,15.5,16.3,228.52,4.6500000000000004,0.14000000000000001,0.03,0.24,0,0,3.43,0.26,0,0.56000000000000005,3.24,1.24,0.3,1.36,null,0.34,220.63,-0.34,220.97,1.00008541E-4]
["2022-05-23",11,"2.0TD",1,334.89,74.41,260.49,15.4,16.7,225.72,5.81,0.14000000000000001,0.03,1.44,0,0,3.39,0.26,0,0.56000000000000005,2.98,1.24,0.3,0.99,null,0.45,216.93,-0.26,217.19,1.06072759E-4]
["2022-05-23",12,"2.0TD",1,315.91000000000003,74.41,241.5,14.4,16.7,211.1,5.59,0.14000000000000001,0.03,1.44,0,0,3.17,0.26,0,0.56000000000000005,3.07,1.24,0.3,0.75,null,0.78,202.44,-0.24,202.68,1.08370013E-4]
["2022-05-23",13,"2.0TD",1,303.35000000000002,74.41,228.95,14.3,16.7,200.3,5.43,0.14000000000000001,0.03,1.44,0,0,3.01,0.26,0,0.56000000000000005,5.99,1.24,0.3,2,null,2.4500000000000002,188.88,0,188.88,1.1160790799999999E-4]
["2022-05-23",14,"2.0TD",1,301.8,74.41,227.4,14,16.7,199.47,5.42,0.14000000000000001,0.03,1.44,0,0,2.99,0.26,0,0.56000000000000005,6.14,1.24,0.3,2.13,null,2.4700000000000002,187.91,0,187.91,1.1846833900000001E-4]
["2022-05-23",15,"2.0TD",2,245.67,28.47,217.2,15.4,16.3,188.22,4.05,0.14000000000000001,0.03,0.24,0,0,2.82,0.26,0,0.56000000000000005,7.17,1.24,0.3,2.85,null,2.79,177,0,177,1.1668391E-4]
["2022-05-23",16,"2.0TD",2,250.88,28.47,222.41,17.600000000000001,16.3,189.12,4.0599999999999996,0.14000000000000001,0.03,0.24,0,0,2.84,0.26,0,0.56000000000000005,7.37,1.24,0.3,3.14,null,2.69,177.69,0.01,177.68,1.05849804E-4]
["2022-05-23",17,"2.0TD",2,249.16,28.47,220.69,18.3,16.3,186.55,4.0199999999999996,0.14000000000000001,0.03,0.24,0,0,2.8,0.26,0,0.56000000000000005,7.52,1.24,0.3,3.16,null,2.82,175.01,0,175.01,9.9409483000000004E-5]
["2022-05-23",18,"2.0TD",2,255.21,28.47,226.74,18.5,16.3,191.34,4.09,0.14000000000000001,0.03,0.24,0,0,2.87,0.26,0,0.56000000000000005,7.01,1.24,0.3,2.66,null,2.81,180.24,0.06,180.18,9.9355169999999998E-5]
["2022-05-23",19,"2.0TD",1,299.64,74.41,225.23,16.399999999999999,16.7,193.5,5.33,0.14000000000000001,0.03,1.44,0,0,2.9,0.26,0,0.56000000000000005,7.99,1.24,0.3,3.74,null,2.71,180.18,0,180.18,1.01431445E-4]
["2022-05-23",20,"2.0TD",1,335.9,74.41,261.49,16.399999999999999,16.7,224.65,5.8,0.14000000000000001,0.03,1.44,0,0,3.37,0.26,0,0.56000000000000005,4.5,1.24,0.3,1.95,null,1.01,214.35,-0.59,214.94,1.07447351E-4]
["2022-05-23",21,"2.0TD",1,331.29,74.41,256.88,16,16.7,221.45,5.75,0.14000000000000001,0.03,1.44,0,0,3.32,0.26,0,0.56000000000000005,6.08,1.24,0.3,1.74,null,2.8,209.62,-0.45,210.07,1.2170237999999999E-4]
["2022-05-23",22,"2.0TD",1,333.37,74.41,258.95999999999998,14.9,16.7,225.38,5.81,0.14000000000000001,0.03,1.44,0,0,3.38,0.26,0,0.56000000000000005,5,1.24,0.3,0.91,null,2.54,214.57,-0.43,215,1.4194448400000001E-4]
["2022-05-23",23,"2.0TD",2,284.68,28.47,256.20999999999998,16.600000000000001,16.3,219.73,4.5199999999999996,0.14000000000000001,0.03,0.24,0,0,3.3,0.26,0,0.56000000000000005,5.47,1.24,0.3,1.24,null,2.69,209.74,-0.27,210.01,1.3563158999999999E-4]
["2022-05-23",24,"2.0TD",2,255.51,28.47,227.04,17.5,16.3,193.22,4.12,0.14000000000000001,0.03,0.24,0,0,2.9,0.26,0,0.56000000000000005,9.01,1.24,0.3,3.23,null,4.24,180.09,-0.09,180.18,1.09133638E-4]

{"sheet":"PVPC CYM","index":3,"n_rows":25,"n_cols":30,"rows_kept":25,"cut":false,"hidden":false,"merged":[]}
["Día","Hora","Peaje","Periodo","Término energía PVPC\nFEU = TEU + TCU\n€/MWh consumo","Peajes y cargos TEU\n€/MWh consumo","Precio producción\nTCU=CP x(1+PERD/100)\n€/MWh consumo","% coeficiente \npérdidas PVPC\nPERD","% coeficiente \npérdidas estándar","Coste producción\nCP\n€/MWh bc","Total\nOC\n€/MWh bc","Financiación OS\n€/MWh bc","Financiación OM\n€/MWh bc","Cargo capacidad\n€/MWh bc","Servicio \ninterrumpibilidad\n€/MWh bc","Excedente o deficit subastas renovables\n€/MWh bc","CCVh coste comercialización  RCVtovph\n€/MWh bc","CCVh coste comercialización  RFE\n€/MWh bc","CCVh coste comercialización  RMRv\n€/MWh bc","CCVh coste comercialización  Runitaria\n€/MWh bc","Total\nSAH\n€/MWh bc","Otros sistema\n€/MWh bc","Coste desvíos\n€/MWh bc","Coste banda\n€/MWh bc","Coste  reserva\n€/MWh bc","Coste restricciones\ntécnicas diario\n€/MWh bc","Total\nPMH\n€/MWh bc","Componente\nintradiario 1\n€/MWh bc","Mercado\ndiario\n€/MWh bc","Coeficiente\nperfilado"]
["2022-05-23",1,"2.0TD",3,246.28,3.03,243.24,16.8,18,208.26,4.1100000000000003,0.14000000000000001,0.03,0,0,0,3.12,0.26,0,0.56000000000000005,7.14,1.24,0.3,0.97,null,4.62,197.01,0,197.01,8.7911784000000004E-5]
["2022-05-23",2,"2.0TD",3,231.59,3.03,228.56,18.5,18,192.88,3.88,0.14000000000000001,0.03,0,0,0,2.89,0.26,0,0.56000000000000005,8.82,1.24,0.3,1.1499999999999999,null,6.13,180.18,0,180.18,7.2223875000000003E-5]
["2022-05-23",3,"2.0TD",3,223.1,3.03,220.06,19.3,18,184.46,3.75,0.14000000000000001,0.03,0,0,0,2.77,0.26,0,0.56000000000000005,9.16,1.24,0.3,0.57999999999999996,null,7.04,171.55,0,171.55,6.3858927000000007E-5]
["2022-05-23",4,"2.0TD",3,225.06,3.03,222.03,19.7,18,185.49,3.77,0.14000000000000001,0.03,0,0,0,2.78,0.26,0,0.56000000000000005,10.18,1.24,0.3,0.59,null,8.0500000000000007,171.54,0,171.54,5.9867727999999999E-5]
["2022-05-23",5,"2.0TD",3,224.82,3.03,221.78,19.600000000000001,18,185.44,3.77,0.14000000000000001,0.03,0,0,0,2.78,0.26,0,0.56000000000000005,10.18,1.24,0.3,0.59,null,8.0399999999999991,171.49,0,171.49,5.8281483999999997E-5]
["2022-05-23",6,"2.0TD",3,225.34,3.03,222.31,18.899999999999999,18,186.97,3.79,0.14000000000000001,0.03,0,0,0,2.81,0.26,0,0.56000000000000005,10.64,1.24,0.3,1.42,null,7.69,172.54,0,172.54,5.9055624999999999E-5]
["2022-05-23",7,"2.0TD",3,255.57,3.03,252.54,17.5,18,214.93,4.21,0.14000000000000001,0.03,0,0,0,3.22,0.26,0,0.56000000000000005,8.6199999999999992,1.24,0.3,2.71,null,4.38,202.1,-0.6,202.7,6.5320123000000001E-5]
["2022-05-23",8,"2.0TD",3,276.87,3.03,273.83999999999997,16.8,18,234.45,4.5,0.14000000000000001,0.03,0,0,0,3.52,0.26,0,0.56000000000000005,5.5,1.24,0.3,1.21,null,2.75,224.45,-0.51,224.96,7.9044685999999994E-5]
["2022-05-23",9,"2.0TD",2,312.87,28.47,284.39999999999998,18.8,16.3,239.4,4.82,0.14000000000000001,0.03,0.24,0,0,3.59,0.26,0,0.56000000000000005,5.0199999999999996,1.24,0.3,1.5,null,1.98,229.56,-0.46,230.02,9.3685358000000001E-5]
["2022-05-23",10,"2.0TD",2,292.41000000000003,28.47,263.94,15.5,16.3,228.52,4.6500000000000004,0.14000000000000001,0.03,0.24,0,0,3.43,0.26,0,0.56000000000000005,3.24,1.24,0.3,1.36,null,0.34,220.63,-0.34,220.97,1.00008541E-4]
["2022-05-23",11,"2.0TD",2,286.64999999999998,28.47,258.18,15,16.3,225.71,5.8,0.14000000000000001,0.03,1.44,0,0,3.37,0.26,0,0.56000000000000005,2.98,1.24,0.3,0.99,null,0.45,216.93,-0.26,217.19,1.06072759E-4]
["2022-05-23",12,"2.0TD",1,315.91000000000003,74.41,241.5,14.4,16.7,211.1,5.59,0.14000000000000001,0.03,1.44,0,0,3.17,0.26,0,0.56000000000000005,3.07,1.24,0.3,0.75,null,0.78,202.44,-0.24,202.68,1.08370013E-4]
["2022-05-23",13,"2.0TD",1,303.35000000000002,74.41,228.95,14.3,16.7,200.3,5.43,0.14000000000000001,0.03,1.44,0,0,3.01,0.26,0,0.56000000000000005,5.99,1.24,0.3,2,null,2.4500000000000002,188.88,0,188.88,1.1160790799999999E-4]
["2022-05-23",14,"2.0TD",1,301.8,74.41,227.4,14,16.7,199.47,5.42,0.14000000000000001,0.03,1.44,0,0,2.99,0.26,0,0.56000000000000005,6.14,1.24,0.3,2.13,null,2.4700000000000002,187.91,0,187.91,1.1846833900000001E-4]
["2022-05-23",15,"2.0TD",1,293.58999999999997,74.41,219.18,15.7,16.7,189.44,5.27,0.14000000000000001,0.03,1.44,0,0,2.84,0.26,0,0.56000000000000005,7.17,1.24,0.3,2.85,null,2.79,177,0,177,1.1668391E-4]
["2022-05-23",16,"2.0TD",2,250.88,28.47,222.41,17.600000000000001,16.3,189.12,4.0599999999999996,0.14000000000000001,0.03,0.24,0,0,2.84,0.26,0,0.56000000000000005,7.37,1.24,0.3,3.14,null,2.69,177.69,0.01,177.68,1.05849804E-4]
["2022-05-23",17,"2.0TD",2,249.16,28.47,220.69,18.3,16.3,186.55,4.0199999999999996,0.14000000000000001,0.03,0.24,0,0,2.8,0.26,0,0.56000000000000005,7.52,1.24,0.3,3.16,null,2.82,175.01,0,175.01,9.9409483000000004E-5]
["2022-05-23",18,"2.0TD",2,255.21,28.47,226.74,18.5,16.3,191.34,4.09,0.14000000000000001,0.03,0.24,0,0,2.87,0.26,0,0.56000000000000005,7.01,1.24,0.3,2.66,null,2.81,180.24,0.06,180.18,9.9355169999999998E-5]
["2022-05-23",19,"2.0TD",2,251.51,28.47,223.04,16,16.3,193.48,5.31,0.14000000000000001,0.03,1.44,0,0,2.88,0.26,0,0.56000000000000005,7.99,1.24,0.3,3.74,null,2.71,180.18,0,180.18,1.01431445E-4]
["2022-05-23",20,"2.0TD",1,335.9,74.41,261.49,16.399999999999999,16.7,224.65,5.8,0.14000000000000001,0.03,1.44,0,0,3.37,0.26,0,0.56000000000000005,4.5,1.24,0.3,1.95,null,1.01,214.35,-0.59,214.94,1.07447351E-4]
["2022-05-23",21,"2.0TD",1,331.29,74.41,256.88,16,16.7,221.45,5.75,0.14000000000000001,0.03,1.44,0,0,3.32,0.26,0,0.56000000000000005,6.08,1.24,0.3,1.74,null,2.8,209.62,-0.45,210.07,1.2170237999999999E-4]
["2022-05-23",22,"2.0TD",1,333.37,74.41,258.95999999999998,14.9,16.7,225.38,5.81,0.14000000000000001,0.03,1.44,0,0,3.38,0.26,0,0.56000000000000005,5,1.24,0.3,0.91,null,2.54,214.57,-0.43,215,1.4194448400000001E-4]
["2022-05-23",23,"2.0TD",1,332.92,74.41,258.51,17,16.7,220.95,5.74,0.14000000000000001,0.03,1.44,0,0,3.31,0.26,0,0.56000000000000005,5.47,1.24,0.3,1.24,null,2.69,209.74,-0.27,210.01,1.3563158999999999E-4]
["2022-05-23",24,"2.0TD",2,255.51,28.47,227.04,17.5,16.3,193.22,4.12,0.14000000000000001,0.03,0.24,0,0,2.9,0.26,0,0.56000000000000005,9.01,1.24,0.3,3.23,null,4.24,180.09,-0.09,180.18,1.09133638E-4]