{"text_format":"1","workbook":"xlsx","n_sheets":5,"sheets":["Mundo","Relojes","Ciudades","Tiempos","Idiomas"],"not_rendered":{"charts":35,"images":6,"macros":1,"external_links":0,"defined_names":26,"comments":0,"pivot_tables":0},"unopened":[],"bounds":{"document_bytes":16777216,"sheet_cells":100000,"rows_first":2000,"rows_last":500,"rows_between":2000,"halvings":0,"cell_chars":16384,"cell_head_chars":4096},"cells_cut":0,"cells_raw":0,"read":"whole","date_system":"1900"}

{"sheet":"Mundo","index":0,"n_rows":41,"n_cols":32,"rows_kept":41,"cut":false,"hidden":false,"merged":[[2,29,3,29],[17,26,17,27],[18,26,18,27],[19,26,19,27],[20,26,20,27],[15,26,15,27],[16,26,16,27],[12,26,12,27],[13,26,13,27],[21,26,21,27],[1,26,1,27],[2,26,2,27],[5,28,6,28],[5,29,6,29],[8,26,8,27],[3,26,3,27],[4,26,4,27],[5,26,5,27],[6,26,6,27],[7,26,7,27],[11,26,11,27],[12,29,13,29],[12,28,13,28],[9,26,9,27],[14,26,14,27],[40,28,40,31],[27,28,27,31],[28,28,28,31],[30,28,30,31],[31,28,31,31],[32,28,32,31],[33,28,33,31],[35,28,35,31],[37,28,37,31],[38,28,38,31],[36,28,36,31],[5,31,6,31],[7,28,8,28],[7,29,8,29],[7,31,8,31],[10,26,10,27]]}
[]
[null,null,null,null,null,null,null,null,null,null,null,null,null,null,null,null,null,null,null,null,null,null,null,null,null,null,"Midway Atoll",null,null,{"$f":"miAhora","v":"2022-03-10T09:42:57"}]
[null,null,null,null,null,null,null,null,null,null,null,null,null,null,null,null,null,null,null,null,null,null,null,null,null,null,{"$f":"IF(miNuevaCiudad=\"\",\"Introduzca ciudad\",Ciudades!G2 & \" - \" & Ciudades!H2)","v":"Midway Atoll - United States"},null,null,{"$f":"miAhora","v":44630.404826388891}]
[null,null,null,null,null,null,null,null,null,null,null,null,null,null,null,null,null,null,null,null,null,null,null,null,null,null,{"$f":"IF(miNuevaCiudad=\"\",\"a geolocalizar\",Ciudades!G3 & \" - \" & Ciudades!H3)","v":"Midway Atoll - United States"}]
[null,null,null,null,null,null,null,null,null,null,null,null,null,null,null,null,null,null,null,null,null,null,null,null,null,null,{"$f":"IF(miNuevaCiudad=\"\",\"\",Ciudades!G4 & \" - \" & Ciudades!H4)","v":" - "}]
[null,"-11","-10","-9","-8","-7","-6","-5","-4","-3","-2","-1","0","+1","+2","+3","+4","+5","+6","+7","+8","+9","+10","+11","+12",null,{"$f":"IF(miNuevaCiudad=\"\",\"\",Ciudades!G5 & \" - \" & Ciudades!H5)","v":" - "},null,{"$f":"HYPERLINK(\"https://\" & VLOOKUP(Idiomas!$A$49,TablaIdiomas[],Total_Idiomas,FALSE) & \".wikipedia.org/wiki/\" & LEFT(miCiudad,IFERROR(FIND(\",\",miCiudad)-1,LEN(miCiudad))),VLOOKUP(Idiomas!$A$2,TablaIdiomas[],Total_Idiomas,FALSE))","v":"Ciudad"},"Zaragoza, Aragon",null,{"$f":"HYPERLINK(\"https://en.wikipedia.org/wiki/\" & LEFT(miCiudad,IFERROR(FIND(\",\",miCiudad)-1,LEN(miCiudad))),\"è\")","v":"è"}]
[null,null,null,null,null,null,null,null,null,null,null,null,null,null,null,null,null,null,null,null,null,null,null,null,null,null,{"$f":"IF(miNuevaCiudad=\"\",\"\",Ciudades!G6 & \" - \" & Ciudades!H6)","v":" - "}]
[null,null,null,null,null,null,null,null,null,null,null,null,null,null,null,null,null,null,null,null,null,null,null,null,null,null,{"$f":"IF(miNuevaCiudad=\"\",\"\",Ciudades!G7 & \" - \" & Ciudades!H7)","v":" - "},null,{"$f":"HYPERLINK(\"https://\" & VLOOKUP(Idiomas!$A$49,TablaIdiomas[],Total_Idiomas,FALSE) & \".wikipedia.org/wiki/\" & miPaís,VLOOKUP(Idiomas!$A$3,TablaIdiomas[],Total_Idiomas,FALSE))","v":"País"},"Spain",null,{"$f":"HYPERLINK(\"https://en.wikipedia.org/wiki/\" & miPaís,\"è\")","v":"è"}]
[null,null,null,null,null,null,null,null,null,null,null,null,null,null,null,null,null,null,null,null,null,null,null,null,null,null,{"$f":"IF(miNuevaCiudad=\"\",\"\",Ciudades!G8 & \" - \" & Ciudades!H8)","v":" - "}]
[null,null,null,null,null,null,null,null,null,null,null,null,null,null,null,null,null,null,null,null,null,null,null,null,null,null,{"$f":"IF(miNuevaCiudad=\"\",\"\",Ciudades!G9 & \" - \" & Ciudades!H9)","v":" - "},null,{"$f":"VLOOKUP(Idiomas!$A$25,TablaIdiomas[],Total_Idiomas,FALSE)","v":"Latitud"},{"$f":"IF(miReloj>0,ROUND(INDEX(Relojes!$T$3:$T$35,miReloj),2),\"\")","v":41.65}]
[null,null,null,null,null,null,null,null,null,null,null,null,null,null,null,null,null,null,null,null,null,null,null,null,null,null,{"$f":"IF(miNuevaCiudad=\"\",\"\",Ciudades!G10 & \" - \" & Ciudades!H10)","v":" - "},null,{"$f":"VLOOKUP(Idiomas!$A$26,TablaIdiomas[],Total_Idiomas,FALSE)","v":"Longitud"},{"$f":"IF(miReloj>0,ROUND(INDEX(Relojes!$U$3:$U$35,miReloj),2),\"\")","v":-0.88}]
[null,null,null,null,null,null,null,null,null,null,null,null,null,null,null,null,null,null,null,null,null,null,null,null,null,null,{"$f":"IF(miNuevaCiudad=\"\",\"\",Ciudades!G11 & \" - \" & Ciudades!H11)","v":" - "},null,{"$f":"VLOOKUP(Idiomas!$A$17,TablaIdiomas[],Total_Idiomas,FALSE)","v":"Fecha"},"2022-03-10"]
[null,null,null,null,null,null,null,null,null,null,null,null,null,null,null,null,null,null,null,null,null,null,null,null,null,null,{"$f":"IF(miNuevaCiudad=\"\",\"\",Ciudades!G12 & \" - \" & Ciudades!H12)","v":" - "},null,{"$f":"VLOOKUP(Idiomas!$A$16,TablaIdiomas[],Total_Idiomas,FALSE)","v":"Hora"},"09:42:57"]
[null,null,null,null,null,null,null,null,null,null,null,null,null,null,null,null,null,null,null,null,null,null,null,null,null,null,{"$f":"IF(miNuevaCiudad=\"\",\"\",Ciudades!G13 & \" - \" & Ciudades!H13)","v":" - "}]
[null,null,null,null,null,null,null,null,null,null,null,null,null,null,null,null,null,null,null,null,null,null,null,null,null,null,{"$f":"IF(miNuevaCiudad=\"\",\"\",Ciudades!G14 & \" - \" & Ciudades!H14)","v":" - "},null,{"$f":"VLOOKUP(Idiomas!$A$4,TablaIdiomas[],Total_Idiomas,FALSE)","v":"GMT"},1]
[null,null,null,null,null,null,null,null,null,null,null,null,null,null,null,null,null,null,null,null,null,null,null,null,null,null,{"$f":"IF(miNuevaCiudad=\"\",\"\",Ciudades!G15 & \" - \" & Ciudades!H15)","v":" - "},null,{"$f":"VLOOKUP(Idiomas!$A$5,TablaIdiomas[],Total_Idiomas,FALSE)","v":"Reloj Nº"},13]
[null,null,null,null,null,null,null,null,null,null,null,null,null,null,null,null,null,null,null,null,null,null,null,null,null,null,{"$f":"IF(miNuevaCiudad=\"\",\"\",Ciudades!G16 & \" - \" & Ciudades!H16)","v":" - "}]
[null,null,null,null,null,null,null,null,null,null,null,null,null,null,null,null,null,null,null,null,null,null,null,null,null,null,{"$f":"IF(miNuevaCiudad=\"\",\"\",Ciudades!G17 & \" - \" & Ciudades!H17)","v":" - "},null,{"$f":"VLOOKUP(Idiomas!$A$6,TablaIdiomas[],Total_Idiomas,FALSE)","v":"Idioma"},"Español"]
[null,null,null,null,null,null,null,null,null,null,null,null,null,null,null,null,null,null,null,null,null,null,null,null,null,null,{"$f":"IF(miNuevaCiudad=\"\",\"\",Ciudades!G18 & \" - \" & Ciudades!H18)","v":" - "},null,{"$f":"VLOOKUP(Idiomas!$A$43,TablaIdiomas[],Total_Idiomas,FALSE)","v":"Segundos"},1]
[null,null,null,null,null,null,null,null,null,null,null,null,null,null,null,null,null,null,null,null,null,null,null,null,null,null,{"$f":"IF(miNuevaCiudad=\"\",\"\",Ciudades!G19 & \" - \" & Ciudades!H19)","v":" - "},null,{"$f":"VLOOKUP(Idiomas!$A$48,TablaIdiomas[],Total_Idiomas,FALSE)","v":"Ratón sobre mapa"},"X"]
[null,null,null,null,null,null,null,null,null,null,null,null,null,null,null,null,null,null,null,null,null,null,null,null,null,null,{"$f":"IF(miNuevaCiudad=\"\",\"\",Ciudades!G20 & \" - \" & Ciudades!H20)","v":" - "},null,{"$f":"VLOOKUP(Idiomas!$A$50,TablaIdiomas[],Total_Idiomas,FALSE)","v":"Ver las ciudades"},"√"]
[null,null,null,null,null,null,null,null,null,null,null,null,null,null,null,null,null,null,null,null,null,null,null,null,null,null,{"$f":"IF(miNuevaCiudad=\"\",\"\",Ciudades!G21 & \" - \" & Ciudades!H21)","v":" - "},null,{"$f":"VLOOKUP(Idiomas!$A$51,TablaIdiomas[],Total_Idiomas,FALSE)","v":"Ver los relojes"},"√"]
[]
[]
[null,null,null,null,null,null,null,null,null,null,null,null,null,null,null,null,null,null,null,null,null,null,null,null,null,null,null,{"$f":"VLOOKUP(Idiomas!$A$7,TablaIdiomas[],Total_Idiomas,FALSE)","v":"RELOJES MUNDIALES Versión 3.6"}]
[null,null,null,null,null,null,null,null,null,null,null,null,null,null,null,null,null,null,null,null,null,null,null,null,null,null,null,{"$f":"VLOOKUP(Idiomas!$A$11,TablaIdiomas[],Total_Idiomas,FALSE)","v":"Clic en el reloj grande: Para/Arranca relojes."}]
[]
[null,null,null,null,null,null,null,null,null,null,null,null,null,null,null,null,null,null,null,null,null,null,null,null,null,null,null,{"$f":"VLOOKUP(Idiomas!$A$8,TablaIdiomas[],Total_Idiomas,FALSE)","v":"Autor"},"Excelente Mapa con Relojes Mundiales"]
[null,null,null,null,null,null,null,null,null,null,null,null,null,null,null,null,null,null,null,null,null,null,null,null,null,null,null,"Pedro Wave","Blog: #ExcelPedroWave"]
[]
[null,null,null,null,null,null,null,null,null,null,null,null,null,null,null,null,null,null,null,null,null,null,null,null,null,null,null,{"$f":"VLOOKUP(Idiomas!$A$9,TablaIdiomas[],Total_Idiomas,FALSE)","v":"Gracias a"},"How to Make an Analog Clock in Excel"]
[null,null,null,null,null,null,null,null,null,null,null,null,null,null,null,null,null,null,null,null,null,null,null,null,null,null,null,"George Lungu","Excel Unusual"]
[null,null,null,null,null,null,null,null,null,null,null,null,null,null,null,null,null,null,null,null,null,null,null,null,null,null,null,"Chip Pearson","Downloading a file from the Web"]
[null,null,null,null,null,null,null,null,null,null,null,null,null,null,null,null,null,null,null,null,null,null,null,null,null,null,null,null,"Time Zone and Daylight Savings Time"]
[null,null,null,null,null,null,null,null,null,null,null,null,null,null,null,null,null,null,null,null,null,null,null,null,null,null,null,{"$f":"VLOOKUP(Idiomas!$A$47,TablaIdiomas[],Total_Idiomas,FALSE)","v":"Servicios Web"}]
[null,null,null,null,null,null,null,null,null,null,null,null,null,null,null,null,null,null,null,null,null,null,null,null,null,null,null,"Earth Viewer","https://www.fourmilab.ch/earthview/"]
[null,"-11","-10","-9","-8","-7","-6","-5","-4","-3","-2","-1","0","+1","+2","+3","+4","+5","+6","+7","+8","+9","+10","+11","+12",null,null,"City Search API","https://nominatim.openstreetmap.org/ui/search.html"]
[null,null,null,null,null,null,null,null,null,null,null,null,null,null,null,null,null,null,null,null,null,null,null,null,null,null,null,"Time API","https://www.timeapi.io/swagger/index.html"]
[null,null,null,null,null,null,null,null,null,null,null,null,null,null,null,null,null,null,null,null,null,null,null,null,null,null,null,"Wikipedia","https://en.wikipedia.org/wiki/Zaragoza"]
[]
[null,null,null,null,null,null,null,null,null,null,null,null,null,null,null,null,null,null,null,null,null,null,null,null,null,null,null,"Copyright","https://creativecommons.org/licenses/by-nc-sa/3.0/"]

{"sheet":"Relojes","index":1,"n_rows":36,"n_cols":24,"rows_kept":36,"cut":false,"hidden":false,"merged":[[0,23,1,23],[0,18,1,18],[0,15,1,15],[0,16,1,16],[0,17,1,17],[0,22,1,22],[0,21,1,21],[0,19,1,19],[0,20,1,20]]}
[44630.404826388891,{"$f":"A1","v":"2022-03-10T09:42:57"},44630.363159722219,{"$f":"VLOOKUP(Idiomas!$A$19,TablaIdiomas[],Total_Idiomas,FALSE)","v":"Saeta de las horas:"},null,null,0.6,{"$f":"VLOOKUP(Idiomas!$A$20,TablaIdiomas[],Total_Idiomas,FALSE)","v":"Saeta de las minutos:"},null,null,0.9,{"$f":"VLOOKUP(Idiomas!$A$21,TablaIdiomas[],Total_Idiomas,FALSE)","v":"Saeta de las segundos:"},null,null,1.1000000000000001,"Loc X","Loc Y",{"$f":"VLOOKUP(Idiomas!$A$22,TablaIdiomas[],Total_Idiomas,FALSE)","v":"Ciudades"},{"$f":"VLOOKUP(Idiomas!$A$23,TablaIdiomas[],Total_Idiomas,FALSE)","v":"Países"},{"$f":"VLOOKUP(Idiomas!$A$27,TablaIdiomas[],Total_Idiomas,FALSE)","v":"Latitud decimal"},{"$f":"VLOOKUP(Idiomas!$A$28,TablaIdiomas[],Total_Idiomas,FALSE)","v":"Longitud decimal"},{"$f":"VLOOKUP(Idiomas!$A$16,TablaIdiomas[],Total_Idiomas,FALSE)","v":"Hora"},{"$f":"VLOOKUP(Idiomas!$A$29,TablaIdiomas[],Total_Idiomas,FALSE)","v":"Minuto"},{"$f":"VLOOKUP(Idiomas!$A$22,TablaIdiomas[],Total_Idiomas,FALSE)","v":"Ciudades"}]
[{"$f":"VLOOKUP(Idiomas!$A$16,TablaIdiomas[],Total_Idiomas,FALSE)","v":"Hora"},{"$f":"VLOOKUP(Idiomas!$A$17,TablaIdiomas[],Total_Idiomas,FALSE)","v":"Fecha"},{"$f":"VLOOKUP(Idiomas!$A$18,TablaIdiomas[],Total_Idiomas,FALSE)","v":"Hora GMT"},"Pos X","X","Pos Y","Y","Pos X","X","Pos Y","Y","Pos X","X","Pos Y","Y"]
[{"$f":"$C$1+$C3/24","v":44629.904826388884},{"$f":"A3","v":"2022-03-09T21:42:57"},-11,0,{"$f":"$D3+$G$1*INDEX(Tiempos!$C$3:$C$146,$V3)","v":-0.56399999999999995},0,{"$f":"$F3+$G$1*INDEX(Tiempos!$D$3:$D$146,$V3)","v":0.20400000000000001},{"$f":"$D$3","v":0},{"$f":"$H3+$K$1*INDEX(Tiempos!$H$3:$H$242,$W3)","v":-0.873},{"$f":"$F$3","v":0},{"$f":"$J3+$K$1*INDEX(Tiempos!$I$3:$I$242,$W3)","v":-0.20700000000000002},{"$f":"$D$3","v":0},{"$f":"$L3+$O$1*INDEX(Tiempos!$M$3:$M$62,SECOND($A3)+1)","v":-0.34100000000000003},{"$f":"$F$3","v":0},{"$f":"$N3+$O$1*INDEX(Tiempos!$N$3:$N$62,SECOND($A3)+1)","v":1.0449999999999999},10.595435724999991,199.46643249777779,"Midway Atoll","USA",28.241753599999999,-177.3754308,{"$f":"MATCH(HOUR($A3)*100+MINUTE($A3),Tiempos!$A$3:$A$146)","v":131},{"$f":"MATCH(MINUTE($A3)*100+SECOND($A3),Tiempos!$F$3:$F$242)","v":172},{"$f":"misCiudadesOrdenadas","v":"Anchorage, Alaska"}]
[{"$f":"$C$1+$C4/24","v":44629.946493055555},{"$f":"A4","v":"2022-03-09T22:42:57"},-10,{"$f":"$D$3","v":0},{"$f":"$D4+$G$1*INDEX(Tiempos!$C$3:$C$146,$V4)","v":-0.38400000000000001},{"$f":"$F$3","v":0},{"$f":"$F4+$G$1*INDEX(Tiempos!$D$3:$D$146,$V4)","v":0.46199999999999997},{"$f":"$D$3","v":0},{"$f":"$H4+$K$1*INDEX(Tiempos!$H$3:$H$242,$W4)","v":-0.873},{"$f":"$F$3","v":0},{"$f":"$J4+$K$1*INDEX(Tiempos!$I$3:$I$242,$W4)","v":-0.20700000000000002},{"$f":"$D$3","v":0},{"$f":"M3","v":-0.34100000000000003},{"$f":"$F$3","v":0},{"$f":"O3","v":1.0449999999999999},52.210468527777799,214.4585067611111,"Honolulu, Honolulu County, Hawaii","USA",21.304546999999999,-157.85567599999999,{"$f":"MATCH(HOUR($A4)*100+MINUTE($A4),Tiempos!$A$3:$A$146)","v":137},{"$f":"MATCH(MINUTE($A4)*100+SECOND($A4),Tiempos!$F$3:$F$242)","v":172},"Bangkok"]
[{"$f":"$C$1+$C5/24","v":44629.988159722219},{"$f":"A5","v":"2022-03-09T23:42:57"},-9,{"$f":"$D$3","v":0},{"$f":"$D5+$G$1*INDEX(Tiempos!$C$3:$C$146,$V5)","v":-0.108},{"$f":"$F$3","v":0},{"$f":"$F5+$G$1*INDEX(Tiempos!$D$3:$D$146,$V5)","v":0.58799999999999997},{"$f":"$D$3","v":0},{"$f":"$H5+$K$1*INDEX(Tiempos!$H$3:$H$242,$W5)","v":-0.873},{"$f":"$F$3","v":0},{"$f":"$J5+$K$1*INDEX(Tiempos!$I$3:$I$242,$W5)","v":-0.20700000000000002},{"$f":"$D$3","v":0},{"$f":"M4","v":-0.34100000000000003},{"$f":"$F$3","v":0},{"$f":"O4","v":1.0449999999999999},70.854200534027783,128.29213010611113,"Anchorage, Alaska","USA",61.175878099999998,-149.11073329999999,{"$f":"MATCH(HOUR($A5)*100+MINUTE($A5),Tiempos!$A$3:$A$146)","v":143},{"$f":"MATCH(MINUTE($A5)*100+SECOND($A5),Tiempos!$F$3:$F$242)","v":172},"Bogota, Bogota Capital District - Department"]
[44630.029826388884,"2022-03-10T00:42:57",-8,0,{"$f":"$D6+$G$1*INDEX(Tiempos!$C$3:$C$146,$V6)","v":0.20400000000000001},0,{"$f":"$F6+$G$1*INDEX(Tiempos!$D$3:$D$146,$V6)","v":0.56399999999999995},0,{"$f":"$H6+$K$1*INDEX(Tiempos!$H$3:$H$242,$W6)","v":-0.873},0,{"$f":"$J6+$K$1*INDEX(Tiempos!$I$3:$I$242,$W6)","v":-0.20700000000000002},0,-0.34100000000000003,0,1.0449999999999999,143.25976102777778,182.3385414161111,"Las Vegas, Clark County, Nevada","USA",36.167255900000001,-115.148516,{"$f":"MATCH(HOUR($A6)*100+MINUTE($A6),Tiempos!$A$3:$A$146)","v":5},{"$f":"MATCH(MINUTE($A6)*100+SECOND($A6),Tiempos!$F$3:$F$242)","v":172},"Brisbane, Brisbane City, Queensland"]
[44630.071493055555,"2022-03-10T01:42:57",-7,0,{"$f":"$D7+$G$1*INDEX(Tiempos!$C$3:$C$146,$V7)","v":0.45599999999999996},0,{"$f":"$F7+$G$1*INDEX(Tiempos!$D$3:$D$146,$V7)","v":0.38400000000000001},0,{"$f":"$H7+$K$1*INDEX(Tiempos!$H$3:$H$242,$W7)","v":-0.873},0,{"$f":"$J7+$K$1*INDEX(Tiempos!$I$3:$I$242,$W7)","v":-0.20700000000000002},0,-0.34100000000000003,0,1.0449999999999999,144.90376947916667,125.529792265,"Yellowknife, North Slave Region, Northwest Territories","Canada",62.454080699999999,-114.377385,{"$f":"MATCH(HOUR($A7)*100+MINUTE($A7),Tiempos!$A$3:$A$146)","v":11},{"$f":"MATCH(MINUTE($A7)*100+SECOND($A7),Tiempos!$F$3:$F$242)","v":172},"Buenos Aires"]
[44630.113159722219,"2022-03-10T02:42:57",-6,0,{"$f":"$D8+$G$1*INDEX(Tiempos!$C$3:$C$146,$V8)","v":0.59399999999999997},0,{"$f":"$F8+$G$1*INDEX(Tiempos!$D$3:$D$146,$V8)","v":0.10200000000000001},0,{"$f":"$H8+$K$1*INDEX(Tiempos!$H$3:$H$242,$W8)","v":-0.873},0,{"$f":"$J8+$K$1*INDEX(Tiempos!$I$3:$I$242,$W8)","v":-0.20700000000000002},0,-0.34100000000000003,0,1.0449999999999999,177.36447830533203,218.74566452333335,"Mexico City","Mexico",19.3207722,-99.151515061994104,{"$f":"MATCH(HOUR($A8)*100+MINUTE($A8),Tiempos!$A$3:$A$146)","v":17},{"$f":"MATCH(MINUTE($A8)*100+SECOND($A8),Tiempos!$F$3:$F$242)","v":172},"Cairo"]
[44630.154826388884,"2022-03-10T03:42:57",-5,0,{"$f":"$D9+$G$1*INDEX(Tiempos!$C$3:$C$146,$V9)","v":0.56399999999999995},0,{"$f":"$F9+$G$1*INDEX(Tiempos!$D$3:$D$146,$V9)","v":-0.20400000000000001},0,{"$f":"$H9+$K$1*INDEX(Tiempos!$H$3:$H$242,$W9)","v":-0.873},0,{"$f":"$J9+$K$1*INDEX(Tiempos!$I$3:$I$242,$W9)","v":-0.20700000000000002},0,-0.34100000000000003,0,1.0449999999999999,230.97328703888888,172.51527093944443,"New York","USA",40.7127281,-74.006015199999993,{"$f":"MATCH(HOUR($A9)*100+MINUTE($A9),Tiempos!$A$3:$A$146)","v":23},{"$f":"MATCH(MINUTE($A9)*100+SECOND($A9),Tiempos!$F$3:$F$242)","v":172},"Denver, Colorado"]
[44630.196493055555,"2022-03-10T04:42:57",-4,0,{"$f":"$D10+$G$1*INDEX(Tiempos!$C$3:$C$146,$V10)","v":0.39},0,{"$f":"$F10+$G$1*INDEX(Tiempos!$D$3:$D$146,$V10)","v":-0.45599999999999996},0,{"$f":"$H10+$K$1*INDEX(Tiempos!$H$3:$H$242,$W10)","v":-0.873},0,{"$f":"$J10+$K$1*INDEX(Tiempos!$I$3:$I$242,$W10)","v":-0.20700000000000002},0,-0.34100000000000003,0,1.0449999999999999,239.82692399722222,220.38144820722221,"Santo Domingo","Dominican Republic",18.563854299999999,-69.853169199999996,{"$f":"MATCH(HOUR($A10)*100+MINUTE($A10),Tiempos!$A$3:$A$146)","v":29},{"$f":"MATCH(MINUTE($A10)*100+SECOND($A10),Tiempos!$F$3:$F$242)","v":172},"Dubai"]
[44630.238159722219,"2022-03-10T05:42:57",-3,0,{"$f":"$D11+$G$1*INDEX(Tiempos!$C$3:$C$146,$V11)","v":0.10200000000000001},0,{"$f":"$F11+$G$1*INDEX(Tiempos!$D$3:$D$146,$V11)","v":-0.59399999999999997},0,{"$f":"$H11+$K$1*INDEX(Tiempos!$H$3:$H$242,$W11)","v":-0.873},0,{"$f":"$J11+$K$1*INDEX(Tiempos!$I$3:$I$242,$W11)","v":-0.20700000000000002},0,-0.34100000000000003,0,1.0449999999999999,260.55201907774625,340.78493275638891,"Buenos Aires","Argentina",-37.149840349999998,-60.1319519635327,{"$f":"MATCH(HOUR($A11)*100+MINUTE($A11),Tiempos!$A$3:$A$146)","v":35},{"$f":"MATCH(MINUTE($A11)*100+SECOND($A11),Tiempos!$F$3:$F$242)","v":172},"Hong Kong"]
[44630.279826388884,"2022-03-10T06:42:57",-2,0,{"$f":"$D12+$G$1*INDEX(Tiempos!$C$3:$C$146,$V12)","v":-0.20400000000000001},0,{"$f":"$F12+$G$1*INDEX(Tiempos!$D$3:$D$146,$V12)","v":-0.56399999999999995},0,{"$f":"$H12+$K$1*INDEX(Tiempos!$H$3:$H$242,$W12)","v":-0.873},0,{"$f":"$J12+$K$1*INDEX(Tiempos!$I$3:$I$242,$W12)","v":-0.20700000000000002},0,-0.34100000000000003,0,1.0449999999999999,310.94546459374999,377.81277225000002,"King Edward Point, South Georgia, SIQQ 1ZZ","South Georgia and the South Sandwich Islands",-54.283544999999997,-36.494635500000001,{"$f":"MATCH(HOUR($A12)*100+MINUTE($A12),Tiempos!$A$3:$A$146)","v":41},{"$f":"MATCH(MINUTE($A12)*100+SECOND($A12),Tiempos!$F$3:$F$242)","v":172},"Honolulu, Honolulu County, Hawaii"]
[44630.321493055555,"2022-03-10T07:42:57",-1,0,{"$f":"$D13+$G$1*INDEX(Tiempos!$C$3:$C$146,$V13)","v":-0.45599999999999996},0,{"$f":"$F13+$G$1*INDEX(Tiempos!$D$3:$D$146,$V13)","v":-0.39},0,{"$f":"$H13+$K$1*INDEX(Tiempos!$H$3:$H$242,$W13)","v":-0.873},0,{"$f":"$J13+$K$1*INDEX(Tiempos!$I$3:$I$242,$W13)","v":-0.20700000000000002},0,-0.34100000000000003,0,1.0449999999999999,334.02647866249998,178.94088899111111,"Ponta Delgada, Azores","Portugal",37.7394344,-25.6683618,{"$f":"MATCH(HOUR($A13)*100+MINUTE($A13),Tiempos!$A$3:$A$146)","v":47},{"$f":"MATCH(MINUTE($A13)*100+SECOND($A13),Tiempos!$F$3:$F$242)","v":172},"Karachi, Karāchi District, Sindh"]
[44630.363159722219,"2022-03-10T08:42:57",0,0,{"$f":"$D14+$G$1*INDEX(Tiempos!$C$3:$C$146,$V14)","v":-0.59399999999999997},0,{"$f":"$F14+$G$1*INDEX(Tiempos!$D$3:$D$146,$V14)","v":-0.10200000000000001},0,{"$f":"$H14+$K$1*INDEX(Tiempos!$H$3:$H$242,$W14)","v":-0.873},0,{"$f":"$J14+$K$1*INDEX(Tiempos!$I$3:$I$242,$W14)","v":-0.20700000000000002},0,-0.34100000000000003,0,1.0449999999999999,369.23881128441127,176.76979808499999,"Lisbon","Portugal",38.7440523,-9.1518279317419395,{"$f":"MATCH(HOUR($A14)*100+MINUTE($A14),Tiempos!$A$3:$A$146)","v":53},{"$f":"MATCH(MINUTE($A14)*100+SECOND($A14),Tiempos!$F$3:$F$242)","v":172},"Kathmandu, Bagmati Pradesh"]
[44630.404826388884,"2022-03-10T09:42:57",1,0,{"$f":"$D15+$G$1*INDEX(Tiempos!$C$3:$C$146,$V15)","v":-0.56399999999999995},0,{"$f":"$F15+$G$1*INDEX(Tiempos!$D$3:$D$146,$V15)","v":0.20400000000000001},0,{"$f":"$H15+$K$1*INDEX(Tiempos!$H$3:$H$242,$W15)","v":-0.873},0,{"$f":"$J15+$K$1*INDEX(Tiempos!$I$3:$I$242,$W15)","v":-0.20700000000000002},0,-0.34100000000000003,0,1.0449999999999999,386.87187889166665,170.48510997888889,"Zaragoza, Aragon","Spain",41.652134199999999,-0.88094280000000003,{"$f":"MATCH(HOUR($A15)*100+MINUTE($A15),Tiempos!$A$3:$A$146)","v":59},{"$f":"MATCH(MINUTE($A15)*100+SECOND($A15),Tiempos!$F$3:$F$242)","v":172},"King Edward Point, South Georgia, SIQQ 1ZZ"]
[44630.446493055555,"2022-03-10T10:42:57",2,0,{"$f":"$D16+$G$1*INDEX(Tiempos!$C$3:$C$146,$V16)","v":-0.38400000000000001},0,{"$f":"$F16+$G$1*INDEX(Tiempos!$D$3:$D$146,$V16)","v":0.46199999999999997},0,{"$f":"$H16+$K$1*INDEX(Tiempos!$H$3:$H$242,$W16)","v":-0.873},0,{"$f":"$J16+$K$1*INDEX(Tiempos!$I$3:$I$242,$W16)","v":-0.20700000000000002},0,-0.34100000000000003,0,1.0449999999999999,456.04135182609485,195.59057977944445,"Cairo","Egypt",30.0352073,31.563370237647099,{"$f":"MATCH(HOUR($A16)*100+MINUTE($A16),Tiempos!$A$3:$A$146)","v":65},{"$f":"MATCH(MINUTE($A16)*100+SECOND($A16),Tiempos!$F$3:$F$242)","v":172},"Las Vegas, Clark County, Nevada"]
[44630.488159722219,"2022-03-10T11:42:57",3,0,{"$f":"$D17+$G$1*INDEX(Tiempos!$C$3:$C$146,$V17)","v":-0.10200000000000001},0,{"$f":"$F17+$G$1*INDEX(Tiempos!$D$3:$D$146,$V17)","v":0.59399999999999997},0,{"$f":"$H17+$K$1*INDEX(Tiempos!$H$3:$H$242,$W17)","v":-0.873},0,{"$f":"$J17+$K$1*INDEX(Tiempos!$I$3:$I$242,$W17)","v":-0.20700000000000002},0,-0.34100000000000003,0,1.0449999999999999,468.94840798680559,140.01709148388889,"Moscow, Central Federal District","Russia",55.750446099999998,37.617494299999997,{"$f":"MATCH(HOUR($A17)*100+MINUTE($A17),Tiempos!$A$3:$A$146)","v":71},{"$f":"MATCH(MINUTE($A17)*100+SECOND($A17),Tiempos!$F$3:$F$242)","v":172},"Lima"]
[44630.529826388884,"2022-03-10T12:42:57",4,0,{"$f":"$D18+$G$1*INDEX(Tiempos!$C$3:$C$146,$V18)","v":0.20400000000000001},0,{"$f":"$F18+$G$1*INDEX(Tiempos!$D$3:$D$146,$V18)","v":0.56399999999999995},0,{"$f":"$H18+$K$1*INDEX(Tiempos!$H$3:$H$242,$W18)","v":-0.873},0,{"$f":"$J18+$K$1*INDEX(Tiempos!$I$3:$I$242,$W18)","v":-0.20700000000000002},0,-0.34100000000000003,0,1.0449999999999999,506.40889838105727,206.31168981027798,"Dubai","United Arab Emirates",25.074282349999901,55.188538654307003,{"$f":"MATCH(HOUR($A18)*100+MINUTE($A18),Tiempos!$A$3:$A$146)","v":77},{"$f":"MATCH(MINUTE($A18)*100+SECOND($A18),Tiempos!$F$3:$F$242)","v":172},"Lisbon"]
[44630.571493055555,"2022-03-10T13:42:57",5,0,{"$f":"$D19+$G$1*INDEX(Tiempos!$C$3:$C$146,$V19)","v":0.46199999999999997},0,{"$f":"$F19+$G$1*INDEX(Tiempos!$D$3:$D$146,$V19)","v":0.38400000000000001},0,{"$f":"$H19+$K$1*INDEX(Tiempos!$H$3:$H$242,$W19)","v":-0.873},0,{"$f":"$J19+$K$1*INDEX(Tiempos!$I$3:$I$242,$W19)","v":-0.20700000000000002},0,-0.34100000000000003,0,1.0449999999999999,532.0831379494316,206.346701215,"Karachi, Karāchi District, Sindh","Pakistan",25.058081699999999,67.231178712437,{"$f":"MATCH(HOUR($A19)*100+MINUTE($A19),Tiempos!$A$3:$A$146)","v":83},{"$f":"MATCH(MINUTE($A19)*100+SECOND($A19),Tiempos!$F$3:$F$242)","v":172},"Majuro"]
[44630.613159722219,"2022-03-10T14:42:57",6,0,{"$f":"$D20+$G$1*INDEX(Tiempos!$C$3:$C$146,$V20)","v":0.58799999999999997},0,{"$f":"$F20+$G$1*INDEX(Tiempos!$D$3:$D$146,$V20)","v":0.10200000000000001},0,{"$f":"$H20+$K$1*INDEX(Tiempos!$H$3:$H$242,$W20)","v":-0.873},0,{"$f":"$J20+$K$1*INDEX(Tiempos!$I$3:$I$242,$W20)","v":-0.20700000000000002},0,-0.34100000000000003,0,1.0449999999999999,545.18040547794249,141.67561329833333,"Omsk, Omsk Oblast, Siberian Federal District","Russia",54.983006699999997,73.374522439165204,{"$f":"MATCH(HOUR($A20)*100+MINUTE($A20),Tiempos!$A$3:$A$146)","v":89},{"$f":"MATCH(MINUTE($A20)*100+SECOND($A20),Tiempos!$F$3:$F$242)","v":172},"Mexico City"]
[44630.654826388884,"2022-03-10T15:42:57",7,0,{"$f":"$D21+$G$1*INDEX(Tiempos!$C$3:$C$146,$V21)","v":0.56399999999999995},0,{"$f":"$F21+$G$1*INDEX(Tiempos!$D$3:$D$146,$V21)","v":-0.20400000000000001},0,{"$f":"$H21+$K$1*INDEX(Tiempos!$H$3:$H$242,$W21)","v":-0.873},0,{"$f":"$J21+$K$1*INDEX(Tiempos!$I$3:$I$242,$W21)","v":-0.20700000000000002},0,-0.34100000000000003,0,1.0449999999999999,603.27146537569445,230.62354741999999,"Bangkok","Thailand",13.8245796,100.62244629999999,{"$f":"MATCH(HOUR($A21)*100+MINUTE($A21),Tiempos!$A$3:$A$146)","v":95},{"$f":"MATCH(MINUTE($A21)*100+SECOND($A21),Tiempos!$F$3:$F$242)","v":172},"Midway Atoll"]
[44630.696493055555,"2022-03-10T16:42:57",8,0,{"$f":"$D22+$G$1*INDEX(Tiempos!$C$3:$C$146,$V22)","v":0.38400000000000001},0,{"$f":"$F22+$G$1*INDEX(Tiempos!$D$3:$D$146,$V22)","v":-0.46199999999999997},0,{"$f":"$H22+$K$1*INDEX(Tiempos!$H$3:$H$242,$W22)","v":-0.873},0,{"$f":"$J22+$K$1*INDEX(Tiempos!$I$3:$I$242,$W22)","v":-0.20700000000000002},0,-0.34100000000000003,0,1.0449999999999999,632.18589751875004,212.19781165000001,"Hong Kong","China",22.350626999999999,114.1849161,{"$f":"MATCH(HOUR($A22)*100+MINUTE($A22),Tiempos!$A$3:$A$146)","v":101},{"$f":"MATCH(MINUTE($A22)*100+SECOND($A22),Tiempos!$F$3:$F$242)","v":172},"Moscow, Central Federal District"]
[44630.738159722219,"2022-03-10T17:42:57",9,0,{"$f":"$D23+$G$1*INDEX(Tiempos!$C$3:$C$146,$V23)","v":0.10200000000000001},0,{"$f":"$F23+$G$1*INDEX(Tiempos!$D$3:$D$146,$V23)","v":-0.58799999999999997},0,{"$f":"$H23+$K$1*INDEX(Tiempos!$H$3:$H$242,$W23)","v":-0.873},0,{"$f":"$J23+$K$1*INDEX(Tiempos!$I$3:$I$242,$W23)","v":-0.20700000000000002},0,-0.34100000000000003,0,1.0449999999999999,686.70939343263899,183.38542080944444,"Tokyo","Japan",35.682838699999998,139.75945490000001,{"$f":"MATCH(HOUR($A23)*100+MINUTE($A23),Tiempos!$A$3:$A$146)","v":107},{"$f":"MATCH(MINUTE($A23)*100+SECOND($A23),Tiempos!$F$3:$F$242)","v":172},"New York"]
[44630.779826388884,"2022-03-10T18:42:57",10,0,{"$f":"$D24+$G$1*INDEX(Tiempos!$C$3:$C$146,$V24)","v":-0.20400000000000001},0,{"$f":"$F24+$G$1*INDEX(Tiempos!$D$3:$D$146,$V24)","v":-0.56399999999999995},0,{"$f":"$H24+$K$1*INDEX(Tiempos!$H$3:$H$242,$W24)","v":-0.873},0,{"$f":"$J24+$K$1*INDEX(Tiempos!$I$3:$I$242,$W24)","v":-0.20700000000000002},0,-0.34100000000000003,0,1.0449999999999999,714.98759877569444,319.8634923877778,"Brisbane, Brisbane City, Queensland","Australia",-27.468968199999999,153.02349910000001,{"$f":"MATCH(HOUR($A24)*100+MINUTE($A24),Tiempos!$A$3:$A$146)","v":113},{"$f":"MATCH(MINUTE($A24)*100+SECOND($A24),Tiempos!$F$3:$F$242)","v":172},"Omsk, Omsk Oblast, Siberian Federal District"]
[44630.821493055555,"2022-03-10T19:42:57",11,0,{"$f":"$D25+$G$1*INDEX(Tiempos!$C$3:$C$146,$V25)","v":-0.46199999999999997},0,{"$f":"$F25+$G$1*INDEX(Tiempos!$D$3:$D$146,$V25)","v":-0.38400000000000001},0,{"$f":"$H25+$K$1*INDEX(Tiempos!$H$3:$H$242,$W25)","v":-0.873},0,{"$f":"$J25+$K$1*INDEX(Tiempos!$I$3:$I$242,$W25)","v":-0.20700000000000002},0,-0.34100000000000003,0,1.0449999999999999,747.58826391736125,298.84134672666664,"Port Vila, Shefa Province, PMB 9054","Vanuatu",-17.741497200000001,168.3150163,{"$f":"MATCH(HOUR($A25)*100+MINUTE($A25),Tiempos!$A$3:$A$146)","v":119},{"$f":"MATCH(MINUTE($A25)*100+SECOND($A25),Tiempos!$F$3:$F$242)","v":172},"Ponta Delgada, Azores"]
[44630.863159722219,"2022-03-10T20:42:57",12,0,{"$f":"$D26+$G$1*INDEX(Tiempos!$C$3:$C$146,$V26)","v":-0.58799999999999997},0,{"$f":"$F26+$G$1*INDEX(Tiempos!$D$3:$D$146,$V26)","v":-0.10200000000000001},0,{"$f":"$H26+$K$1*INDEX(Tiempos!$H$3:$H$242,$W26)","v":-0.873},0,{"$f":"$J26+$K$1*INDEX(Tiempos!$I$3:$I$242,$W26)","v":-0.20700000000000002},0,-0.34100000000000003,0,1.0449999999999999,754.12612547083324,245.17557753555553,"Majuro","Marshall Islands",7.0909924000000002,171.38163539999999,{"$f":"MATCH(HOUR($A26)*100+MINUTE($A26),Tiempos!$A$3:$A$146)","v":125},{"$f":"MATCH(MINUTE($A26)*100+SECOND($A26),Tiempos!$F$3:$F$242)","v":172},"Port Vila, Shefa Province, PMB 9054"]
[44630.071493055555,"2022-03-10T01:42:57",-7,0,{"$f":"$D27+$G$1*INDEX(Tiempos!$C$3:$C$146,$V27)","v":0.45599999999999996},0,{"$f":"$F27+$G$1*INDEX(Tiempos!$D$3:$D$146,$V27)","v":0.38400000000000001},0,{"$f":"$H27+$K$1*INDEX(Tiempos!$H$3:$H$242,$W27)","v":-0.873},0,{"$f":"$J27+$K$1*INDEX(Tiempos!$I$3:$I$242,$W27)","v":-0.20700000000000002},0,-0.34100000000000003,0,1.0449999999999999,164.92810606875,174.61909466888889,"Denver, Colorado","USA",39.739236400000003,-104.9848623,{"$f":"MATCH(HOUR($A27)*100+MINUTE($A27),Tiempos!$A$3:$A$146)","v":11},{"$f":"MATCH(MINUTE($A27)*100+SECOND($A27),Tiempos!$F$3:$F$242)","v":172},"Santiago, Provincia de Santiago Metropolitan Region"]
[44630.113159722219,"2022-03-10T02:42:57",-6,0,{"$f":"$D28+$G$1*INDEX(Tiempos!$C$3:$C$146,$V28)","v":0.59399999999999997},0,{"$f":"$F28+$G$1*INDEX(Tiempos!$D$3:$D$146,$V28)","v":0.10200000000000001},0,{"$f":"$H28+$K$1*INDEX(Tiempos!$H$3:$H$242,$W28)","v":-0.873},0,{"$f":"$J28+$K$1*INDEX(Tiempos!$I$3:$I$242,$W28)","v":-0.20700000000000002},0,-0.34100000000000003,0,1.0449999999999999,202.82955530832109,230.08454685888887,"Tegucigalpa, Francisco Morazán","Honduras",14.0739886,-87.2069838293217,{"$f":"MATCH(HOUR($A28)*100+MINUTE($A28),Tiempos!$A$3:$A$146)","v":17},{"$f":"MATCH(MINUTE($A28)*100+SECOND($A28),Tiempos!$F$3:$F$242)","v":172},"Santo Domingo"]
[44630.029826388884,"2022-03-10T00:42:57",-8,0,{"$f":"$D29+$G$1*INDEX(Tiempos!$C$3:$C$146,$V29)","v":0.20400000000000001},0,{"$f":"$F29+$G$1*INDEX(Tiempos!$D$3:$D$146,$V29)","v":0.56399999999999995},0,{"$f":"$H29+$K$1*INDEX(Tiempos!$H$3:$H$242,$W29)","v":-0.873},0,{"$f":"$J29+$K$1*INDEX(Tiempos!$I$3:$I$242,$W29)","v":-0.20700000000000002},0,-0.34100000000000003,0,1.0449999999999999,139.38783865277776,190.26168714888888,"Tijuana, Municipio de Baja California, 22105","Mexico",32.501018799999997,-116.964662,{"$f":"MATCH(HOUR($A29)*100+MINUTE($A29),Tiempos!$A$3:$A$146)","v":5},{"$f":"MATCH(MINUTE($A29)*100+SECOND($A29),Tiempos!$F$3:$F$242)","v":172},"Stockholm, Solna kommun, Stockholm County"]
[44630.154826388884,"2022-03-10T03:42:57",-5,0,{"$f":"$D30+$G$1*INDEX(Tiempos!$C$3:$C$146,$V30)","v":0.56399999999999995},0,{"$f":"$F30+$G$1*INDEX(Tiempos!$D$3:$D$146,$V30)","v":-0.20400000000000001},0,{"$f":"$H30+$K$1*INDEX(Tiempos!$H$3:$H$242,$W30)","v":-0.873},0,{"$f":"$J30+$K$1*INDEX(Tiempos!$I$3:$I$242,$W30)","v":-0.20700000000000002},0,-0.34100000000000003,0,1.0449999999999999,226.11449461597221,286.86579176499998,"Lima","Peru",-12.200109299999999,-76.285057899999998,{"$f":"MATCH(HOUR($A30)*100+MINUTE($A30),Tiempos!$A$3:$A$146)","v":23},{"$f":"MATCH(MINUTE($A30)*100+SECOND($A30),Tiempos!$F$3:$F$242)","v":172},"Tegucigalpa, Francisco Morazán"]
[44630.154826388884,"2022-03-10T03:42:57",-5,0,{"$f":"$D31+$G$1*INDEX(Tiempos!$C$3:$C$146,$V31)","v":0.56399999999999995},0,{"$f":"$F31+$G$1*INDEX(Tiempos!$D$3:$D$146,$V31)","v":-0.20400000000000001},0,{"$f":"$H31+$K$1*INDEX(Tiempos!$H$3:$H$242,$W31)","v":-0.873},0,{"$f":"$J31+$K$1*INDEX(Tiempos!$I$3:$I$242,$W31)","v":-0.20700000000000002},0,-0.34100000000000003,0,1.0449999999999999,230.80776969444443,250.44363121444439,"Bogota, Bogota Capital District - Department","Colombia",4.6533325999999997,-74.083652000000001,{"$f":"MATCH(HOUR($A31)*100+MINUTE($A31),Tiempos!$A$3:$A$146)","v":23},{"$f":"MATCH(MINUTE($A31)*100+SECOND($A31),Tiempos!$F$3:$F$242)","v":172},"Tijuana, Municipio de Baja California, 22105"]
[44630.238159722219,"2022-03-10T05:42:57",-3,0,{"$f":"$D32+$G$1*INDEX(Tiempos!$C$3:$C$146,$V32)","v":0.10200000000000001},0,{"$f":"$F32+$G$1*INDEX(Tiempos!$D$3:$D$146,$V32)","v":-0.59399999999999997},0,{"$f":"$H32+$K$1*INDEX(Tiempos!$H$3:$H$242,$W32)","v":-0.873},0,{"$f":"$J32+$K$1*INDEX(Tiempos!$I$3:$I$242,$W32)","v":-0.20700000000000002},0,-0.34100000000000003,0,1.0449999999999999,238.11881691593277,332.79359575583334,"Santiago, Provincia de Santiago Metropolitan Region","Chile",-33.452049449999997,-70.654366006858893,{"$f":"MATCH(HOUR($A32)*100+MINUTE($A32),Tiempos!$A$3:$A$146)","v":35},{"$f":"MATCH(MINUTE($A32)*100+SECOND($A32),Tiempos!$F$3:$F$242)","v":172},"Tokyo"]
[44630.404826388884,"2022-03-10T09:42:57",1,0,{"$f":"$D33+$G$1*INDEX(Tiempos!$C$3:$C$146,$V33)","v":-0.56399999999999995},0,{"$f":"$F33+$G$1*INDEX(Tiempos!$D$3:$D$146,$V33)","v":0.20400000000000001},0,{"$f":"$H33+$K$1*INDEX(Tiempos!$H$3:$H$242,$W33)","v":-0.873},0,{"$f":"$J33+$K$1*INDEX(Tiempos!$I$3:$I$242,$W33)","v":-0.20700000000000002},0,-0.34100000000000003,0,1.0449999999999999,427.27656739236107,132.29183005111111,"Stockholm, Solna kommun, Stockholm County","Sweden",59.325117200000001,18.0710935,{"$f":"MATCH(HOUR($A33)*100+MINUTE($A33),Tiempos!$A$3:$A$146)","v":59},{"$f":"MATCH(MINUTE($A33)*100+SECOND($A33),Tiempos!$F$3:$F$242)","v":172},"Visakhapatnam, Andhra Pradesh"]
[44630.592326388884,"2022-03-10T14:12:57",5.5,0,{"$f":"$D34+$G$1*INDEX(Tiempos!$C$3:$C$146,$V34)","v":0.54600000000000004},0,{"$f":"$F34+$G$1*INDEX(Tiempos!$D$3:$D$146,$V34)","v":0.252},0,{"$f":"$H34+$K$1*INDEX(Tiempos!$H$3:$H$242,$W34)","v":0.873},0,{"$f":"$J34+$K$1*INDEX(Tiempos!$I$3:$I$242,$W34)","v":0.20700000000000002},0,-0.34100000000000003,0,1.0449999999999999,564.77233026578972,221.81747163861112,"Visakhapatnam, Andhra Pradesh","India",17.899370449999999,82.564220059523507,{"$f":"MATCH(HOUR($A34)*100+MINUTE($A34),Tiempos!$A$3:$A$146)","v":86},{"$f":"MATCH(MINUTE($A34)*100+SECOND($A34),Tiempos!$F$3:$F$242)","v":52},"Yellowknife, North Slave Region, Northwest Territories"]
[44630.602743055555,"2022-03-10T14:27:57",5.75,0,{"$f":"$D35+$G$1*INDEX(Tiempos!$C$3:$C$146,$V35)","v":0.56399999999999995},0,{"$f":"$F35+$G$1*INDEX(Tiempos!$D$3:$D$146,$V35)","v":0.21},0,{"$f":"$H35+$K$1*INDEX(Tiempos!$H$3:$H$242,$W35)","v":0.20700000000000002},0,{"$f":"$J35+$K$1*INDEX(Tiempos!$I$3:$I$242,$W35)","v":-0.873},0,-0.34100000000000003,0,1.0449999999999999,570.65759020137909,200.61615852055556,"Kathmandu, Bagmati Pradesh","Nepal",27.7097467,85.324732863187606,{"$f":"MATCH(HOUR($A35)*100+MINUTE($A35),Tiempos!$A$3:$A$146)","v":87},{"$f":"MATCH(MINUTE($A35)*100+SECOND($A35),Tiempos!$F$3:$F$242)","v":112},"Zaragoza, Aragon"]
[{"$f":"miAhora","v":44630.404826388891},{"$f":"miAhora","v":"2022-03-10T09:42:57"},{"$f":"(A36-$C$1)*24","v":1.0000000001164153},0,{"$f":"$D36+$G$1*INDEX(Tiempos!$C$3:$C$146,$V36)","v":-0.56399999999999995},0,{"$f":"$F36+$G$1*INDEX(Tiempos!$D$3:$D$146,$V36)","v":0.20400000000000001},0,{"$f":"$H36+$K$1*INDEX(Tiempos!$H$3:$H$242,$W36)","v":-0.873},0,{"$f":"$J36+$K$1*INDEX(Tiempos!$I$3:$I$242,$W36)","v":-0.20700000000000002},0,-0.34100000000000003,0,1.0449999999999999,570.65759020137909,null,null,null,null,null,{"$f":"MATCH(HOUR($A36)*100+MINUTE($A36),Tiempos!$A$3:$A$146)","v":59},{"$f":"MATCH(MINUTE($A36)*100+SECOND($A36),Tiempos!$F$3:$F$242)","v":172}]

{"sheet":"Ciudades","index":2,"n_rows":61,"n_cols":11,"rows_kept":61,"cut":false,"hidden":false,"merged":[]}
["<?xml version=\"1.0\" encoding=\"UTF-8\" ?>\n<searchresults timestamp='Fri, 25 Feb 22 08:42:02 +0000' attribution='Data © OpenStreetMap contributors, ODbL 1.0. http://www.openstreetmap.org/copyright' querystring='Midway Atoll' exclude_place_ids='3911214,285377706' more_url='https://nominatim.openstreetmap.org/search/?q=Midway+Atoll&amp;exclude_place_ids=3911214%2C285377706&amp;format=xml&amp;accept-language=es-ES%2Ces%3Bq%3D0.5'>\n<place place_id='3911214' osm_type='node' osm_id='522248134' place_rank='17' address_rank='0' boundingbox=\"27.9217536,28.5617536,-177.6954308,-177.0554308\" lat='28.2417536' lon='-177.3754308' display_name='Midway Atoll, United States' class='place' type='island' importance='0.525'/><place place_id='285377706' osm_type='relation' osm_id='8161698' place_rank='25' address_rank='0' boundingbox=\"27.9911406,28.4801332,-177.6505562,-177.0875122\" lat='28.23605105' lon='-177.36856316535344' display_name='Midway Atoll, United States' class='boundary' type='region' importance='0.325'/></searchresults>","lat=",{"$f":"IFERROR(FIND(B1,A1),\"\")","v":586},{"$f":"IFERROR(LEFT(A2,FIND(MiAcento,A2)-1),\"\")","v":"28.2417536"},"'","Nombre Aux","Región","País","Lat","Long","Aux"]
[{"$f":"IFERROR(MID(A1,C1+LEN(B1)+1,LEN(A1)-C1-LEN(B1)),\"\")","v":"28.2417536' lon='-177.3754308' display_name='Midway Atoll, United States' class='place' type='island' importance='0.525'/><place place_id='285377706' osm_type='relation' osm_id='8161698' place_rank='25' address_rank='0' boundingbox=\"27.9911406,28.4801332,-177.6505562,-177.0875122\" lat='28.23605105' lon='-177.36856316535344' display_name='Midway Atoll, United States' class='boundary' type='region' importance='0.325'/></searchresults>"},"lon=",{"$f":"IFERROR(FIND(B2,A2),\"\")","v":13},{"$f":"IFERROR(LEFT(A3,FIND(MiAcento,A3)-1),\"\")","v":"-177.3754308"},null,{"$f":"IFERROR(SUBSTITUTE(SUBSTITUTE(D3,\", \",\"|\",LEN(D3)-LEN(SUBSTITUTE(D3,\",\",\"\"))),miNuevaCiudad&\", \",\"\"),miNuevaCiudad)","v":"Midway Atoll|United States"},{"$f":"IFERROR(MID(TablaCiudades[[#This Row],[Aux]],FIND(\"¡\",TablaCiudades[[#This Row],[Aux]])+1,FIND(\"|\",TablaCiudades[[#This Row],[Aux]])-FIND(\"¡\",TablaCiudades[[#This Row],[Aux]])-1),TablaCiudades[[#This Row],[Nombre Aux]])","v":"Midway Atoll"},{"$f":"IFERROR(MID(TablaCiudades[[#This Row],[Nombre Aux]],FIND(\"|\",TablaCiudades[[#This Row],[Nombre Aux]])+1,100),TablaCiudades[[#This Row],[Nombre Aux]])","v":"United States"},{"$f":"IFERROR(--SUBSTITUTE(D1,\".\",\",\"),IFERROR(--D1,\"\"))","v":28.241753599999999},{"$f":"IFERROR(--SUBSTITUTE(D2,\".\",\",\"),IFERROR(--D2,\"\"))","v":-177.3754308},{"$f":"IFERROR(SUBSTITUTE(TablaCiudades[[#This Row],[Nombre Aux]],\", \",\"¡\",LEN(TablaCiudades[[#This Row],[Nombre Aux]])-LEN(SUBSTITUTE(TablaCiudades[[#This Row],[Nombre Aux]],\",\",\"\"))-1),\"¡\"&TablaCiudades[[#This Row],[Nombre Aux]])","v":"¡Midway Atoll|United States"}]
[{"$f":"IFERROR(MID(A2,C2+LEN(B2)+1,LEN(A2)-C2-LEN(B2)),\"\")","v":"-177.3754308' display_name='Midway Atoll, United States' class='place' type='island' importance='0.525'/><place place_id='285377706' osm_type='relation' osm_id='8161698' place_rank='25' address_rank='0' boundingbox=\"27.9911406,28.4801332,-177.6505562,-177.0875122\" lat='28.23605105' lon='-177.36856316535344' display_name='Midway Atoll, United States' class='boundary' type='region' importance='0.325'/></searchresults>"},"display_name=",15,{"$f":"IFERROR(LEFT(A4,FIND(MiAcento,A4)-1),\"\")","v":"Midway Atoll, United States"},null,{"$f":"IFERROR(SUBSTITUTE(SUBSTITUTE(D6,\", \",\"|\",LEN(D6)-LEN(SUBSTITUTE(D6,\",\",\"\"))),miNuevaCiudad&\", \",\"\"),\"\")","v":"Midway Atoll|United States"},{"$f":"IFERROR(MID(TablaCiudades[[#This Row],[Aux]],FIND(\"¡\",TablaCiudades[[#This Row],[Aux]])+1,FIND(\"|\",TablaCiudades[[#This Row],[Aux]])-FIND(\"¡\",TablaCiudades[[#This Row],[Aux]])-1),TablaCiudades[[#This Row],[Nombre Aux]])","v":"Midway Atoll"},{"$f":"IFERROR(MID(TablaCiudades[[#This Row],[Nombre Aux]],FIND(\"|\",TablaCiudades[[#This Row],[Nombre Aux]])+1,100),TablaCiudades[[#This Row],[Nombre Aux]])","v":"United States"},{"$f":"IFERROR(--SUBSTITUTE(D4,\".\",\",\"),IFERROR(--D4,\"\"))","v":28.23605105},{"$f":"IFERROR(--SUBSTITUTE(D5,\".\",\",\"),IFERROR(--D5,\"\"))","v":-177.36856316535301},{"$f":"IFERROR(SUBSTITUTE(TablaCiudades[[#This Row],[Nombre Aux]],\", \",\"¡\",LEN(TablaCiudades[[#This Row],[Nombre Aux]])-LEN(SUBSTITUTE(TablaCiudades[[#This Row],[Nombre Aux]],\",\",\"\"))-1),\"¡\"&TablaCiudades[[#This Row],[Nombre Aux]])","v":"¡Midway Atoll|United States"}]
["Midway Atoll, United States' class='place' type='island' importance='0.525'/><place place_id='285377706' osm_type='relation' osm_id='8161698' place_rank='25' address_rank='0' boundingbox=\"27.9911406,28.4801332,-177.6505562,-177.0875122\" lat='28.23605105' lon='-177.36856316535344' display_name='Midway Atoll, United States' class='boundary' type='region' importance='0.325'/></searchresults>","lat=",238,{"$f":"IFERROR(LEFT(A5,FIND(MiAcento,A5)-1),\"\")","v":"28.23605105"},null,{"$f":"IFERROR(SUBSTITUTE(SUBSTITUTE(D9,\", \",\"|\",LEN(D9)-LEN(SUBSTITUTE(D9,\",\",\"\"))),miNuevaCiudad&\", \",\"\"),\"\")","v":""},{"$f":"IFERROR(MID(TablaCiudades[[#This Row],[Aux]],FIND(\"¡\",TablaCiudades[[#This Row],[Aux]])+1,FIND(\"|\",TablaCiudades[[#This Row],[Aux]])-FIND(\"¡\",TablaCiudades[[#This Row],[Aux]])-1),TablaCiudades[[#This Row],[Nombre Aux]])","v":""},{"$f":"IFERROR(MID(TablaCiudades[[#This Row],[Nombre Aux]],FIND(\"|\",TablaCiudades[[#This Row],[Nombre Aux]])+1,100),TablaCiudades[[#This Row],[Nombre Aux]])","v":""},{"$f":"IFERROR(--SUBSTITUTE(D7,\".\",\",\"),IFERROR(--D7,\"\"))","v":""},{"$f":"IFERROR(--SUBSTITUTE(D8,\".\",\",\"),IFERROR(--D8,\"\"))","v":""},{"$f":"IFERROR(SUBSTITUTE(TablaCiudades[[#This Row],[Nombre Aux]],\", \",\"¡\",LEN(TablaCiudades[[#This Row],[Nombre Aux]])-LEN(SUBSTITUTE(TablaCiudades[[#This Row],[Nombre Aux]],\",\",\"\"))-1),\"¡\"&TablaCiudades[[#This Row],[Nombre Aux]])","v":"¡"}]
["28.23605105' lon='-177.36856316535344' display_name='Midway Atoll, United States' class='boundary' type='region' importance='0.325'/></searchresults>","lon=",14,{"$f":"IFERROR(LEFT(A6,FIND(MiAcento,A6)-1),\"\")","v":"-177.36856316535344"},null,{"$f":"IFERROR(SUBSTITUTE(SUBSTITUTE(D12,\", \",\"|\",LEN(D12)-LEN(SUBSTITUTE(D12,\",\",\"\"))),miNuevaCiudad&\", \",\"\"),\"\")","v":""},{"$f":"IFERROR(MID(TablaCiudades[[#This Row],[Aux]],FIND(\"¡\",TablaCiudades[[#This Row],[Aux]])+1,FIND(\"|\",TablaCiudades[[#This Row],[Aux]])-FIND(\"¡\",TablaCiudades[[#This Row],[Aux]])-1),TablaCiudades[[#This Row],[Nombre Aux]])","v":""},{"$f":"IFERROR(MID(TablaCiudades[[#This Row],[Nombre Aux]],FIND(\"|\",TablaCiudades[[#This Row],[Nombre Aux]])+1,100),TablaCiudades[[#This Row],[Nombre Aux]])","v":""},{"$f":"IFERROR(--SUBSTITUTE(D10,\".\",\",\"),IFERROR(--D10,\"\"))","v":""},{"$f":"IFERROR(--SUBSTITUTE(D11,\".\",\",\"),IFERROR(--D11,\"\"))","v":""},{"$f":"IFERROR(SUBSTITUTE(TablaCiudades[[#This Row],[Nombre Aux]],\", \",\"¡\",LEN(TablaCiudades[[#This Row],[Nombre Aux]])-LEN(SUBSTITUTE(TablaCiudades[[#This Row],[Nombre Aux]],\",\",\"\"))-1),\"¡\"&TablaCiudades[[#This Row],[Nombre Aux]])","v":"¡"}]
["-177.36856316535344' display_name='Midway Atoll, United States' class='boundary' type='region' importance='0.325'/></searchresults>","display_name=",22,{"$f":"IFERROR(LEFT(A7,FIND(MiAcento,A7)-1),\"\")","v":"Midway Atoll, United States"},null,{"$f":"IFERROR(SUBSTITUTE(SUBSTITUTE(D15,\", \",\"|\",LEN(D15)-LEN(SUBSTITUTE(D15,\",\",\"\"))),miNuevaCiudad&\", \",\"\"),\"\")","v":""},{"$f":"IFERROR(MID(TablaCiudades[[#This Row],[Aux]],FIND(\"¡\",TablaCiudades[[#This Row],[Aux]])+1,FIND(\"|\",TablaCiudades[[#This Row],[Aux]])-FIND(\"¡\",TablaCiudades[[#This Row],[Aux]])-1),TablaCiudades[[#This Row],[Nombre Aux]])","v":""},{"$f":"IFERROR(MID(TablaCiudades[[#This Row],[Nombre Aux]],FIND(\"|\",TablaCiudades[[#This Row],[Nombre Aux]])+1,100),TablaCiudades[[#This Row],[Nombre Aux]])","v":""},{"$f":"IFERROR(--SUBSTITUTE(D13,\".\",\",\"),IFERROR(--D13,\"\"))","v":""},{"$f":"IFERROR(--SUBSTITUTE(D14,\".\",\",\"),IFERROR(--D14,\"\"))","v":""},{"$f":"IFERROR(SUBSTITUTE(TablaCiudades[[#This Row],[Nombre Aux]],\", \",\"¡\",LEN(TablaCiudades[[#This Row],[Nombre Aux]])-LEN(SUBSTITUTE(TablaCiudades[[#This Row],[Nombre Aux]],\",\",\"\"))-1),\"¡\"&TablaCiudades[[#This Row],[Nombre Aux]])","v":"¡"}]
["Midway Atoll, United States' class='boundary' type='region' importance='0.325'/></searchresults>","lat=","",{"$f":"IFERROR(LEFT(A8,FIND(MiAcento,A8)-1),\"\")","v":""},null,{"$f":"IFERROR(SUBSTITUTE(SUBSTITUTE(D18,\", \",\"|\",LEN(D18)-LEN(SUBSTITUTE(D18,\",\",\"\"))),miNuevaCiudad&\", \",\"\"),\"\")","v":""},{"$f":"IFERROR(MID(TablaCiudades[[#This Row],[Aux]],FIND(\"¡\",TablaCiudades[[#This Row],[Aux]])+1,FIND(\"|\",TablaCiudades[[#This Row],[Aux]])-FIND(\"¡\",TablaCiudades[[#This Row],[Aux]])-1),TablaCiudades[[#This Row],[Nombre Aux]])","v":""},{"$f":"IFERROR(MID(TablaCiudades[[#This Row],[Nombre Aux]],FIND(\"|\",TablaCiudades[[#This Row],[Nombre Aux]])+1,100),TablaCiudades[[#This Row],[Nombre Aux]])","v":""},{"$f":"IFERROR(--SUBSTITUTE(D16,\".\",\",\"),IFERROR(--D16,\"\"))","v":""},{"$f":"IFERROR(--SUBSTITUTE(D17,\".\",\",\"),IFERROR(--D17,\"\"))","v":""},{"$f":"IFERROR(SUBSTITUTE(TablaCiudades[[#This Row],[Nombre Aux]],\", \",\"¡\",LEN(TablaCiudades[[#This Row],[Nombre Aux]])-LEN(SUBSTITUTE(TablaCiudades[[#This Row],[Nombre Aux]],\",\",\"\"))-1),\"¡\"&TablaCiudades[[#This Row],[Nombre Aux]])","v":"¡"}]
["","lon=","",{"$f":"IFERROR(LEFT(A9,FIND(MiAcento,A9)-1),\"\")","v":""},null,{"$f":"IFERROR(SUBSTITUTE(SUBSTITUTE(D21,\", \",\"|\",LEN(D21)-LEN(SUBSTITUTE(D21,\",\",\"\"))),miNuevaCiudad&\", \",\"\"),\"\")","v":""},{"$f":"IFERROR(MID(TablaCiudades[[#This Row],[Aux]],FIND(\"¡\",TablaCiudades[[#This Row],[Aux]])+1,FIND(\"|\",TablaCiudades[[#This Row],[Aux]])-FIND(\"¡\",TablaCiudades[[#This Row],[Aux]])-1),TablaCiudades[[#This Row],[Nombre Aux]])","v":""},{"$f":"IFERROR(MID(TablaCiudades[[#This Row],[Nombre Aux]],FIND(\"|\",TablaCiudades[[#This Row],[Nombre Aux]])+1,100),TablaCiudades[[#This Row],[Nombre Aux]])","v":""},{"$f":"IFERROR(--SUBSTITUTE(D19,\".\",\",\"),IFERROR(--D19,\"\"))","v":""},{"$f":"IFERROR(--SUBSTITUTE(D20,\".\",\",\"),IFERROR(--D20,\"\"))","v":""},{"$f":"IFERROR(SUBSTITUTE(TablaCiudades[[#This Row],[Nombre Aux]],\", \",\"¡\",LEN(TablaCiudades[[#This Row],[Nombre Aux]])-LEN(SUBSTITUTE(TablaCiudades[[#This Row],[Nombre Aux]],\",\",\"\"))-1),\"¡\"&TablaCiudades[[#This Row],[Nombre Aux]])","v":"¡"}]
["","display_name=","",{"$f":"IFERROR(LEFT(A10,FIND(MiAcento,A10)-1),\"\")","v":""},null,{"$f":"IFERROR(SUBSTITUTE(SUBSTITUTE(D24,\", \",\"|\",LEN(D24)-LEN(SUBSTITUTE(D24,\",\",\"\"))),miNuevaCiudad&\", \",\"\"),\"\")","v":""},{"$f":"IFERROR(MID(TablaCiudades[[#This Row],[Aux]],FIND(\"¡\",TablaCiudades[[#This Row],[Aux]])+1,FIND(\"|\",TablaCiudades[[#This Row],[Aux]])-FIND(\"¡\",TablaCiudades[[#This Row],[Aux]])-1),TablaCiudades[[#This Row],[Nombre Aux]])","v":""},{"$f":"IFERROR(MID(TablaCiudades[[#This Row],[Nombre Aux]],FIND(\"|\",TablaCiudades[[#This Row],[Nombre Aux]])+1,100),TablaCiudades[[#This Row],[Nombre Aux]])","v":""},{"$f":"IFERROR(--SUBSTITUTE(D22,\".\",\",\"),IFERROR(--D22,\"\"))","v":""},{"$f":"IFERROR(--SUBSTITUTE(D23,\".\",\",\"),IFERROR(--D23,\"\"))","v":""},{"$f":"IFERROR(SUBSTITUTE(TablaCiudades[[#This Row],[Nombre Aux]],\", \",\"¡\",LEN(TablaCiudades[[#This Row],[Nombre Aux]])-LEN(SUBSTITUTE(TablaCiudades[[#This Row],[Nombre Aux]],\",\",\"\"))-1),\"¡\"&TablaCiudades[[#This Row],[Nombre Aux]])","v":"¡"}]
["","lat=","",{"$f":"IFERROR(LEFT(A11,FIND(MiAcento,A11)-1),\"\")","v":""},null,{"$f":"IFERROR(SUBSTITUTE(SUBSTITUTE(D27,\", \",\"|\",LEN(D27)-LEN(SUBSTITUTE(D27,\",\",\"\"))),miNuevaCiudad&\", \",\"\"),\"\")","v":""},{"$f":"IFERROR(MID(TablaCiudades[[#This Row],[Aux]],FIND(\"¡\",TablaCiudades[[#This Row],[Aux]])+1,FIND(\"|\",TablaCiudades[[#This Row],[Aux]])-FIND(\"¡\",TablaCiudades[[#This Row],[Aux]])-1),TablaCiudades[[#This Row],[Nombre Aux]])","v":""},{"$f":"IFERROR(MID(TablaCiudades[[#This Row],[Nombre Aux]],FIND(\"|\",TablaCiudades[[#This Row],[Nombre Aux]])+1,100),TablaCiudades[[#This Row],[Nombre Aux]])","v":""},{"$f":"IFERROR(--SUBSTITUTE(D25,\".\",\",\"),IFERROR(--D25,\"\"))","v":""},{"$f":"IFERROR(--SUBSTITUTE(D26,\".\",\",\"),IFERROR(--D26,\"\"))","v":""},{"$f":"IFERROR(SUBSTITUTE(TablaCiudades[[#This Row],[Nombre Aux]],\", \",\"¡\",LEN(TablaCiudades[[#This Row],[Nombre Aux]])-LEN(SUBSTITUTE(TablaCiudades[[#This Row],[Nombre Aux]],\",\",\"\"))-1),\"¡\"&TablaCiudades[[#This Row],[Nombre Aux]])","v":"¡"}]
["","lon=","",{"$f":"IFERROR(LEFT(A12,FIND(MiAcento,A12)-1),\"\")","v":""},null,{"$f":"IFERROR(SUBSTITUTE(SUBSTITUTE(D30,\", \",\"|\",LEN(D30)-LEN(SUBSTITUTE(D30,\",\",\"\"))),miNuevaCiudad&\", \",\"\"),\"\")","v":""},{"$f":"IFERROR(MID(TablaCiudades[[#This Row],[Aux]],FIND(\"¡\",TablaCiudades[[#This Row],[Aux]])+1,FIND(\"|\",TablaCiudades[[#This Row],[Aux]])-FIND(\"¡\",TablaCiudades[[#This Row],[Aux]])-1),TablaCiudades[[#This Row],[Nombre Aux]])","v":""},{"$f":"IFERROR(MID(TablaCiudades[[#This Row],[Nombre Aux]],FIND(\"|\",TablaCiudades[[#This Row],[Nombre Aux]])+1,100),TablaCiudades[[#This Row],[Nombre Aux]])","v":""},{"$f":"IFERROR(--SUBSTITUTE(D28,\".\",\",\"),IFERROR(--D28,\"\"))","v":""},{"$f":"IFERROR(--SUBSTITUTE(D29,\".\",\",\"),IFERROR(--D29,\"\"))","v":""},{"$f":"IFERROR(SUBSTITUTE(TablaCiudades[[#This Row],[Nombre Aux]],\", \",\"¡\",LEN(TablaCiudades[[#This Row],[Nombre Aux]])-LEN(SUBSTITUTE(TablaCiudades[[#This Row],[Nombre Aux]],\",\",\"\"))-1),\"¡\"&TablaCiudades[[#This Row],[Nombre Aux]])","v":"¡"}]
["","display_name=","",{"$f":"IFERROR(LEFT(A13,FIND(MiAcento,A13)-1),\"\")","v":""},null,{"$f":"IFERROR(SUBSTITUTE(SUBSTITUTE(D33,\", \",\"|\",LEN(D33)-LEN(SUBSTITUTE(D33,\",\",\"\"))),miNuevaCiudad&\", \",\"\"),\"\")","v":""},{"$f":"IFERROR(MID(TablaCiudades[[#This Row],[Aux]],FIND(\"¡\",TablaCiudades[[#This Row],[Aux]])+1,FIND(\"|\",TablaCiudades[[#This Row],[Aux]])-FIND(\"¡\",TablaCiudades[[#This Row],[Aux]])-1),TablaCiudades[[#This Row],[Nombre Aux]])","v":""},{"$f":"IFERROR(MID(TablaCiudades[[#This Row],[Nombre Aux]],FIND(\"|\",TablaCiudades[[#This Row],[Nombre Aux]])+1,100),TablaCiudades[[#This Row],[Nombre Aux]])","v":""},{"$f":"IFERROR(--SUBSTITUTE(D31,\".\",\",\"),IFERROR(--D31,\"\"))","v":""},{"$f":"IFERROR(--SUBSTITUTE(D32,\".\",\",\"),IFERROR(--D32,\"\"))","v":""},{"$f":"IFERROR(SUBSTITUTE(TablaCiudades[[#This Row],[Nombre Aux]],\", \",\"¡\",LEN(TablaCiudades[[#This Row],[Nombre Aux]])-LEN(SUBSTITUTE(TablaCiudades[[#This Row],[Nombre Aux]],\",\",\"\"))-1),\"¡\"&TablaCiudades[[#This Row],[Nombre Aux]])","v":"¡"}]
["","lat=","",{"$f":"IFERROR(LEFT(A14,FIND(MiAcento,A14)-1),\"\")","v":""},null,{"$f":"IFERROR(SUBSTITUTE(SUBSTITUTE(D36,\", \",\"|\",LEN(D36)-LEN(SUBSTITUTE(D36,\",\",\"\"))),miNuevaCiudad&\", \",\"\"),\"\")","v":""},{"$f":"IFERROR(MID(TablaCiudades[[#This Row],[Aux]],FIND(\"¡\",TablaCiudades[[#This Row],[Aux]])+1,FIND(\"|\",TablaCiudades[[#This Row],[Aux]])-FIND(\"¡\",TablaCiudades[[#This Row],[Aux]])-1),TablaCiudades[[#This Row],[Nombre Aux]])","v":""},{"$f":"IFERROR(MID(TablaCiudades[[#This Row],[Nombre Aux]],FIND(\"|\",TablaCiudades[[#This Row],[Nombre Aux]])+1,100),TablaCiudades[[#This Row],[Nombre Aux]])","v":""},{"$f":"IFERROR(--SUBSTITUTE(D34,\".\",\",\"),IFERROR(--D34,\"\"))","v":""},{"$f":"IFERROR(--SUBSTITUTE(D35,\".\",\",\"),IFERROR(--D35,\"\"))","v":""},{"$f":"IFERROR(SUBSTITUTE(TablaCiudades[[#This Row],[Nombre Aux]],\", \",\"¡\",LEN(TablaCiudades[[#This Row],[Nombre Aux]])-LEN(SUBSTITUTE(TablaCiudades[[#This Row],[Nombre Aux]],\",\",\"\"))-1),\"¡\"&TablaCiudades[[#This Row],[Nombre Aux]])","v":"¡"}]
["","lon=","",{"$f":"IFERROR(LEFT(A15,FIND(MiAcento,A15)-1),\"\")","v":""},null,{"$f":"IFERROR(SUBSTITUTE(SUBSTITUTE(D39,\", \",\"|\",LEN(D39)-LEN(SUBSTITUTE(D39,\",\",\"\"))),miNuevaCiudad&\", \",\"\"),\"\")","v":""},{"$f":"IFERROR(MID(TablaCiudades[[#This Row],[Aux]],FIND(\"¡\",TablaCiudades[[#This Row],[Aux]])+1,FIND(\"|\",TablaCiudades[[#This Row],[Aux]])-FIND(\"¡\",TablaCiudades[[#This Row],[Aux]])-1),TablaCiudades[[#This Row],[Nombre Aux]])","v":""},{"$f":"IFERROR(MID(TablaCiudades[[#This Row],[Nombre Aux]],FIND(\"|\",TablaCiudades[[#This Row],[Nombre Aux]])+1,100),TablaCiudades[[#This Row],[Nombre Aux]])","v":""},{"$f":"IFERROR(--SUBSTITUTE(D37,\".\",\",\"),IFERROR(--D37,\"\"))","v":""},{"$f":"IFERROR(--SUBSTITUTE(D38,\".\",\",\"),IFERROR(--D38,\"\"))","v":""},{"$f":"IFERROR(SUBSTITUTE(TablaCiudades[[#This Row],[Nombre Aux]],\", \",\"¡\",LEN(TablaCiudades[[#This Row],[Nombre Aux]])-LEN(SUBSTITUTE(TablaCiudades[[#This Row],[Nombre Aux]],\",\",\"\"))-1),\"¡\"&TablaCiudades[[#This Row],[Nombre Aux]])","v":"¡"}]
["","display_name=","",{"$f":"IFERROR(LEFT(A16,FIND(MiAcento,A16)-1),\"\")","v":""},null,{"$f":"IFERROR(SUBSTITUTE(SUBSTITUTE(D42,\", \",\"|\",LEN(D42)-LEN(SUBSTITUTE(D42,\",\",\"\"))),miNuevaCiudad&\", \",\"\"),\"\")","v":""},{"$f":"IFERROR(MID(TablaCiudades[[#This Row],[Aux]],FIND(\"¡\",TablaCiudades[[#This Row],[Aux]])+1,FIND(\"|\",TablaCiudades[[#This Row],[Aux]])-FIND(\"¡\",TablaCiudades[[#This Row],[Aux]])-1),TablaCiudades[[#This Row],[Nombre Aux]])","v":""},{"$f":"IFERROR(MID(TablaCiudades[[#This Row],[Nombre Aux]],FIND(\"|\",TablaCiudades[[#This Row],[Nombre Aux]])+1,100),TablaCiudades[[#This Row],[Nombre Aux]])","v":""},{"$f":"IFERROR(--SUBSTITUTE(D40,\".\",\",\"),IFERROR(--D40,\"\"))","v":""},{"$f":"IFERROR(--SUBSTITUTE(D41,\".\",\",\"),IFERROR(--D41,\"\"))","v":""},{"$f":"IFERROR(SUBSTITUTE(TablaCiudades[[#This Row],[Nombre Aux]],\", \",\"¡\",LEN(TablaCiudades[[#This Row],[Nombre Aux]])-LEN(SUBSTITUTE(TablaCiudades[[#This Row],[Nombre Aux]],\",\",\"\"))-1),\"¡\"&TablaCiudades[[#This Row],[Nombre Aux]])","v":"¡"}]
["","lat=","",{"$f":"IFERROR(LEFT(A17,FIND(MiAcento,A17)-1),\"\")","v":""},null,{"$f":"IFERROR(SUBSTITUTE(SUBSTITUTE(D45,\", \",\"|\",LEN(D45)-LEN(SUBSTITUTE(D45,\",\",\"\"))),miNuevaCiudad&\", \",\"\"),\"\")","v":""},{"$f":"IFERROR(MID(TablaCiudades[[#This Row],[Aux]],FIND(\"¡\",TablaCiudades[[#This Row],[Aux]])+1,FIND(\"|\",TablaCiudades[[#This Row],[Aux]])-FIND(\"¡\",TablaCiudades[[#This Row],[Aux]])-1),TablaCiudades[[#This Row],[Nombre Aux]])","v":""},{"$f":"IFERROR(MID(TablaCiudades[[#This Row],[Nombre Aux]],FIND(\"|\",TablaCiudades[[#This Row],[Nombre Aux]])+1,100),TablaCiudades[[#This Row],[Nombre Aux]])","v":""},{"$f":"IFERROR(--SUBSTITUTE(D43,\".\",\",\"),IFERROR(--D43,\"\"))","v":""},{"$f":"IFERROR(--SUBSTITUTE(D44,\".\",\",\"),IFERROR(--D44,\"\"))","v":""},{"$f":"IFERROR(SUBSTITUTE(TablaCiudades[[#This Row],[Nombre Aux]],\", \",\"¡\",LEN(TablaCiudades[[#This Row],[Nombre Aux]])-LEN(SUBSTITUTE(TablaCiudades[[#This Row],[Nombre Aux]],\",\",\"\"))-1),\"¡\"&TablaCiudades[[#This Row],[Nombre Aux]])","v":"¡"}]
["","lon=","",{"$f":"IFERROR(LEFT(A18,FIND(MiAcento,A18)-1),\"\")","v":""},null,{"$f":"IFERROR(SUBSTITUTE(SUBSTITUTE(D48,\", \",\"|\",LEN(D48)-LEN(SUBSTITUTE(D48,\",\",\"\"))),miNuevaCiudad&\", \",\"\"),\"\")","v":""},{"$f":"IFERROR(MID(TablaCiudades[[#This Row],[Aux]],FIND(\"¡\",TablaCiudades[[#This Row],[Aux]])+1,FIND(\"|\",TablaCiudades[[#This Row],[Aux]])-FIND(\"¡\",TablaCiudades[[#This Row],[Aux]])-1),TablaCiudades[[#This Row],[Nombre Aux]])","v":""},{"$f":"IFERROR(MID(TablaCiudades[[#This Row],[Nombre Aux]],FIND(\"|\",TablaCiudades[[#This Row],[Nombre Aux]])+1,100),TablaCiudades[[#This Row],[Nombre Aux]])","v":""},{"$f":"IFERROR(--SUBSTITUTE(D46,\".\",\",\"),IFERROR(--D46,\"\"))","v":""},{"$f":"IFERROR(--SUBSTITUTE(D47,\".\",\",\"),IFERROR(--D47,\"\"))","v":""},{"$f":"IFERROR(SUBSTITUTE(TablaCiudades[[#This Row],[Nombre Aux]],\", \",\"¡\",LEN(TablaCiudades[[#This Row],[Nombre Aux]])-LEN(SUBSTITUTE(TablaCiudades[[#This Row],[Nombre Aux]],\",\",\"\"))-1),\"¡\"&TablaCiudades[[#This Row],[Nombre Aux]])","v":"¡"}]
["","display_name=","",{"$f":"IFERROR(LEFT(A19,FIND(MiAcento,A19)-1),\"\")","v":""},null,{"$f":"IFERROR(SUBSTITUTE(SUBSTITUTE(D51,\", \",\"|\",LEN(D51)-LEN(SUBSTITUTE(D51,\",\",\"\"))),miNuevaCiudad&\", \",\"\"),\"\")","v":""},{"$f":"IFERROR(MID(TablaCiudades[[#This Row],[Aux]],FIND(\"¡\",TablaCiudades[[#This Row],[Aux]])+1,FIND(\"|\",TablaCiudades[[#This Row],[Aux]])-FIND(\"¡\",TablaCiudades[[#This Row],[Aux]])-1),TablaCiudades[[#This Row],[Nombre Aux]])","v":""},{"$f":"IFERROR(MID(TablaCiudades[[#This Row],[Nombre Aux]],FIND(\"|\",TablaCiudades[[#This Row],[Nombre Aux]])+1,100),TablaCiudades[[#This Row],[Nombre Aux]])","v":""},{"$f":"IFERROR(--SUBSTITUTE(D49,\".\",\",\"),IFERROR(--D49,\"\"))","v":""},{"$f":"IFERROR(--SUBSTITUTE(D50,\".\",\",\"),IFERROR(--D50,\"\"))","v":""},{"$f":"IFERROR(SUBSTITUTE(TablaCiudades[[#This Row],[Nombre Aux]],\", \",\"¡\",LEN(TablaCiudades[[#This Row],[Nombre Aux]])-LEN(SUBSTITUTE(TablaCiudades[[#This Row],[Nombre Aux]],\",\",\"\"))-1),\"¡\"&TablaCiudades[[#This Row],[Nombre Aux]])","v":"¡"}]
["","lat=","",{"$f":"IFERROR(LEFT(A20,FIND(MiAcento,A20)-1),\"\")","v":""},null,{"$f":"IFERROR(SUBSTITUTE(SUBSTITUTE(D54,\", \",\"|\",LEN(D54)-LEN(SUBSTITUTE(D54,\",\",\"\"))),miNuevaCiudad&\", \",\"\"),\"\")","v":""},{"$f":"IFERROR(MID(TablaCiudades[[#This Row],[Aux]],FIND(\"¡\",TablaCiudades[[#This Row],[Aux]])+1,FIND(\"|\",TablaCiudades[[#This Row],[Aux]])-FIND(\"¡\",TablaCiudades[[#This Row],[Aux]])-1),TablaCiudades[[#This Row],[Nombre Aux]])","v":""},{"$f":"IFERROR(MID(TablaCiudades[[#This Row],[Nombre Aux]],FIND(\"|\",TablaCiudades[[#This Row],[Nombre Aux]])+1,100),TablaCiudades[[#This Row],[Nombre Aux]])","v":""},{"$f":"IFERROR(--SUBSTITUTE(D52,\".\",\",\"),IFERROR(--D52,\"\"))","v":""},{"$f":"IFERROR(--SUBSTITUTE(D53,\".\",\",\"),IFERROR(--D53,\"\"))","v":""},{"$f":"IFERROR(SUBSTITUTE(TablaCiudades[[#This Row],[Nombre Aux]],\", \",\"¡\",LEN(TablaCiudades[[#This Row],[Nombre Aux]])-LEN(SUBSTITUTE(TablaCiudades[[#This Row],[Nombre Aux]],\",\",\"\"))-1),\"¡\"&TablaCiudades[[#This Row],[Nombre Aux]])","v":"¡"}]
["","lon=","",{"$f":"IFERROR(LEFT(A21,FIND(MiAcento,A21)-1),\"\")","v":""},null,{"$f":"IFERROR(SUBSTITUTE(SUBSTITUTE(D57,\", \",\"|\",LEN(D57)-LEN(SUBSTITUTE(D57,\",\",\"\"))),miNuevaCiudad&\", \",\"\"),\"\")","v":""},{"$f":"IFERROR(MID(TablaCiudades[[#This Row],[Aux]],FIND(\"¡\",TablaCiudades[[#This Row],[Aux]])+1,FIND(\"|\",TablaCiudades[[#This Row],[Aux]])-FIND(\"¡\",TablaCiudades[[#This Row],[Aux]])-1),TablaCiudades[[#This Row],[Nombre Aux]])","v":""},{"$f":"IFERROR(MID(TablaCiudades[[#This Row],[Nombre Aux]],FIND(\"|\",TablaCiudades[[#This Row],[Nombre Aux]])+1,100),TablaCiudades[[#This Row],[Nombre Aux]])","v":""},{"$f":"IFERROR(--SUBSTITUTE(D55,\".\",\",\"),IFERROR(--D55,\"\"))","v":""},{"$f":"IFERROR(--SUBSTITUTE(D56,\".\",\",\"),IFERROR(--D56,\"\"))","v":""},{"$f":"IFERROR(SUBSTITUTE(TablaCiudades[[#This Row],[Nombre Aux]],\", \",\"¡\",LEN(TablaCiudades[[#This Row],[Nombre Aux]])-LEN(SUBSTITUTE(TablaCiudades[[#This Row],[Nombre Aux]],\",\",\"\"))-1),\"¡\"&TablaCiudades[[#This Row],[Nombre Aux]])","v":"¡"}]
["","display_name=","",{"$f":"IFERROR(LEFT(A22,FIND(MiAcento,A22)-1),\"\")","v":""},null,{"$f":"IFERROR(SUBSTITUTE(SUBSTITUTE(D60,\", \",\"|\",LEN(D60)-LEN(SUBSTITUTE(D60,\",\",\"\"))),miNuevaCiudad&\", \",\"\"),\"\")","v":""},{"$f":"IFERROR(MID(TablaCiudades[[#This Row],[Aux]],FIND(\"¡\",TablaCiudades[[#This Row],[Aux]])+1,FIND(\"|\",TablaCiudades[[#This Row],[Aux]])-FIND(\"¡\",TablaCiudades[[#This Row],[Aux]])-1),TablaCiudades[[#This Row],[Nombre Aux]])","v":""},{"$f":"IFERROR(MID(TablaCiudades[[#This Row],[Nombre Aux]],FIND(\"|\",TablaCiudades[[#This Row],[Nombre Aux]])+1,100),TablaCiudades[[#This Row],[Nombre Aux]])","v":""},{"$f":"IFERROR(--SUBSTITUTE(D58,\".\",\",\"),IFERROR(--D58,\"\"))","v":""},{"$f":"IFERROR(--SUBSTITUTE(D59,\".\",\",\"),IFERROR(--D59,\"\"))","v":""},{"$f":"IFERROR(SUBSTITUTE(TablaCiudades[[#This Row],[Nombre Aux]],\", \",\"¡\",LEN(TablaCiudades[[#This Row],[Nombre Aux]])-LEN(SUBSTITUTE(TablaCiudades[[#This Row],[Nombre Aux]],\",\",\"\"))-1),\"¡\"&TablaCiudades[[#This Row],[Nombre Aux]])","v":"¡"}]
["","lat=","",{"$f":"IFERROR(LEFT(A23,FIND(MiAcento,A23)-1),\"\")","v":""}]
["","lon=","",{"$f":"IFERROR(LEFT(A24,FIND(MiAcento,A24)-1),\"\")","v":""},null,{"$f":"miNuevaCiudad","v":"Midway Atoll"}]
["","display_name=","",{"$f":"IFERROR(LEFT(A25,FIND(MiAcento,A25)-1),\"\")","v":""},2,{"$f":"MiRegión & \" - \" & MiNuevoPaís","v":"Midway Atoll - United States"},{"$f":"INDEX(TablaCiudades[Región],MiNúmRegión)","v":"Midway Atoll"},{"$f":"INDEX(TablaCiudades[País],MiNúmRegión)","v":"United States"},{"$f":"INDEX(TablaCiudades[Lat],MiNúmRegión)","v":28.23605105},{"$f":"INDEX(TablaCiudades[Long],MiNúmRegión)","v":-177.36856316535301}]
["","lat=","",{"$f":"IFERROR(LEFT(A26,FIND(MiAcento,A26)-1),\"\")","v":""}]
["","lon=","",{"$f":"IFERROR(LEFT(A27,FIND(MiAcento,A27)-1),\"\")","v":""}]
["","display_name=","",{"$f":"IFERROR(LEFT(A28,FIND(MiAcento,A28)-1),\"\")","v":""}]
["","lat=","",{"$f":"IFERROR(LEFT(A29,FIND(MiAcento,A29)-1),\"\")","v":""}]
["","lon=","",{"$f":"IFERROR(LEFT(A30,FIND(MiAcento,A30)-1),\"\")","v":""}]
["","display_name=","",{"$f":"IFERROR(LEFT(A31,FIND(MiAcento,A31)-1),\"\")","v":""}]
[{"$f":"IFERROR(MID(A30,C30+LEN(B30)+1,LEN(A30)-C30-LEN(B30)),\"\")","v":""},"lat=",{"$f":"IFERROR(FIND(B31,A31),\"\")","v":""},{"$f":"IFERROR(LEFT(A32,FIND(MiAcento,A32)-1),\"\")","v":""}]
["","lon=","",{"$f":"IFERROR(LEFT(A33,FIND(MiAcento,A33)-1),\"\")","v":""}]
["","display_name=","",{"$f":"IFERROR(LEFT(A34,FIND(MiAcento,A34)-1),\"\")","v":""}]
[{"$f":"IFERROR(MID(A33,C33+LEN(B33)+1,LEN(A33)-C33-LEN(B33)),\"\")","v":""},"lat=",{"$f":"IFERROR(FIND(B34,A34),\"\")","v":""},{"$f":"IFERROR(LEFT(A35,FIND(MiAcento,A35)-1),\"\")","v":""}]
["","lon=","",{"$f":"IFERROR(LEFT(A36,FIND(MiAcento,A36)-1),\"\")","v":""}]
["","display_name=","",{"$f":"IFERROR(LEFT(A37,FIND(MiAcento,A37)-1),\"\")","v":""}]
["","lat=","",{"$f":"IFERROR(LEFT(A38,FIND(MiAcento,A38)-1),\"\")","v":""}]
["","lon=","",{"$f":"IFERROR(LEFT(A39,FIND(MiAcento,A39)-1),\"\")","v":""}]
["","display_name=","",{"$f":"IFERROR(LEFT(A40,FIND(MiAcento,A40)-1),\"\")","v":""}]
["","lat=","",{"$f":"IFERROR(LEFT(A41,FIND(MiAcento,A41)-1),\"\")","v":""}]
["","lon=","",{"$f":"IFERROR(LEFT(A42,FIND(MiAcento,A42)-1),\"\")","v":""}]
[{"$f":"IFERROR(MID(A41,C41+LEN(B41)+1,LEN(A41)-C41-LEN(B41)),\"\")","v":""},"display_name=",{"$f":"IFERROR(FIND(B42,A42),\"\")","v":""},{"$f":"IFERROR(LEFT(A43,FIND(MiAcento,A43)-1),\"\")","v":""}]
["","lat=","",{"$f":"IFERROR(LEFT(A44,FIND(MiAcento,A44)-1),\"\")","v":""}]
["","lon=","",{"$f":"IFERROR(LEFT(A45,FIND(MiAcento,A45)-1),\"\")","v":""}]
["","display_name=","",{"$f":"IFERROR(LEFT(A46,FIND(MiAcento,A46)-1),\"\")","v":""}]
["","lat=","",{"$f":"IFERROR(LEFT(A47,FIND(MiAcento,A47)-1),\"\")","v":""}]
["","lon=","",{"$f":"IFERROR(LEFT(A48,FIND(MiAcento,A48)-1),\"\")","v":""}]
["","display_name=","",{"$f":"IFERROR(LEFT(A49,FIND(MiAcento,A49)-1),\"\")","v":""}]
["","lat=","",{"$f":"IFERROR(LEFT(A50,FIND(MiAcento,A50)-1),\"\")","v":""}]
["","lon=","",{"$f":"IFERROR(LEFT(A51,FIND(MiAcento,A51)-1),\"\")","v":""}]
["","display_name=","",{"$f":"IFERROR(LEFT(A52,FIND(MiAcento,A52)-1),\"\")","v":""}]
["","lat=","",{"$f":"IFERROR(LEFT(A53,FIND(MiAcento,A53)-1),\"\")","v":""}]
["","lon=","",{"$f":"IFERROR(LEFT(A54,FIND(MiAcento,A54)-1),\"\")","v":""}]
["","display_name=","",{"$f":"IFERROR(LEFT(A55,FIND(MiAcento,A55)-1),\"\")","v":""}]
["","lat=","",{"$f":"IFERROR(LEFT(A56,FIND(MiAcento,A56)-1),\"\")","v":""}]
["","lon=","",{"$f":"IFERROR(LEFT(A57,FIND(MiAcento,A57)-1),\"\")","v":""}]
["","display_name=","",{"$f":"IFERROR(LEFT(A58,FIND(MiAcento,A58)-1),\"\")","v":""}]
["","lat=","",{"$f":"IFERROR(LEFT(A59,FIND(MiAcento,A59)-1),\"\")","v":""}]
["","lon=","",{"$f":"IFERROR(LEFT(A60,FIND(MiAcento,A60)-1),\"\")","v":""}]
["","display_name=","",{"$f":"IFERROR(LEFT(A61,FIND(MiAcento,A61)-1),\"\")","v":""}]
["","lat=","",{"$f":"IFERROR(LEFT(A62,FIND(MiAcento,A62)-1),\"\")","v":""}]

{"sheet":"Tiempos","index":3,"n_rows":242,"n_cols":14,"rows_kept":242,"cut":false,"hidden":false,"merged":[[0,0,1,0],[0,5,1,5],[0,10,1,10],[0,1,1,1],[0,6,1,6],[0,13,1,13],[0,11,1,11],[0,2,1,2],[0,3,1,3],[0,4,1,4],[0,9,1,9],[0,7,1,7],[0,8,1,8],[0,12,1,12]]}
[{"$f":"VLOOKUP(Idiomas!$A$33,TablaIdiomas[],Total_Idiomas,FALSE)","v":"Hora Minuto"},{"$f":"VLOOKUP(Idiomas!$A$34,TablaIdiomas[],Total_Idiomas,FALSE)","v":"Radianes Horas"},{"$f":"VLOOKUP(Idiomas!$A$35,TablaIdiomas[],Total_Idiomas,FALSE)","v":"Seno Horas"},{"$f":"VLOOKUP(Idiomas!$A$36,TablaIdiomas[],Total_Idiomas,FALSE)","v":"Coseno Horas"},{"$f":"VLOOKUP(Idiomas!$A$37,TablaIdiomas[],Total_Idiomas,FALSE)","v":"hh:mm"},{"$f":"VLOOKUP(Idiomas!$A$38,TablaIdiomas[],Total_Idiomas,FALSE)","v":"Minuto Segundo"},{"$f":"VLOOKUP(Idiomas!$A$39,TablaIdiomas[],Total_Idiomas,FALSE)","v":"Radianes Minutos"},{"$f":"VLOOKUP(Idiomas!$A$40,TablaIdiomas[],Total_Idiomas,FALSE)","v":"Seno Minutos"},{"$f":"VLOOKUP(Idiomas!$A$41,TablaIdiomas[],Total_Idiomas,FALSE)","v":"Coseno Minutos"},{"$f":"VLOOKUP(Idiomas!$A$42,TablaIdiomas[],Total_Idiomas,FALSE)","v":"mm:ss"},{"$f":"VLOOKUP(Idiomas!$A$43,TablaIdiomas[],Total_Idiomas,FALSE)","v":"Segundos"},{"$f":"VLOOKUP(Idiomas!$A$44,TablaIdiomas[],Total_Idiomas,FALSE)","v":"Radianes Segundos"},{"$f":"VLOOKUP(Idiomas!$A$45,TablaIdiomas[],Total_Idiomas,FALSE)","v":"Seno Segundos"},{"$f":"VLOOKUP(Idiomas!$A$46,TablaIdiomas[],Total_Idiomas,FALSE)","v":"Coseno Segundos"}]
[]
[{"$f":"HOUR($E3)*100+MINUTE($E3)","v":0},{"$f":"ROUND(RADIANS(30*INT($A3/100)+($A3-INT($A3/100)*100)/2),2)","v":0},{"$f":"ROUND(SIN($B3),2)","v":0},{"$f":"ROUND(COS($B3),2)","v":1},"00:00:00",{"$f":"MINUTE($J3)*100+SECOND($J3)","v":0},{"$f":"ROUND(RADIANS(6*INT($F3/100)+($F3-INT($F3/100)*100)/10),2)","v":0},{"$f":"ROUND(SIN($G3),2)","v":0},{"$f":"ROUND(COS($G3),2)","v":1},"00:00:00",0,{"$f":"ROUND(RADIANS(6*$K3),2)","v":0},{"$f":"ROUND(SIN($L3),2)","v":0},{"$f":"ROUND(COS($L3),2)","v":1}]
[{"$f":"HOUR($E4)*100+MINUTE($E4)","v":10},{"$f":"ROUND(RADIANS(30*INT($A4/100)+($A4-INT($A4/100)*100)/2),2)","v":0.09},{"$f":"ROUND(SIN($B4),2)","v":0.09},{"$f":"ROUND(COS($B4),2)","v":1},"00:10:00",{"$f":"MINUTE($J4)*100+SECOND($J4)","v":15},{"$f":"ROUND(RADIANS(6*INT($F4/100)+($F4-INT($F4/100)*100)/10),2)","v":0.03},{"$f":"ROUND(SIN($G4),2)","v":0.03},{"$f":"ROUND(COS($G4),2)","v":1},"00:00:15",1,{"$f":"ROUND(RADIANS(6*$K4),2)","v":0.1},{"$f":"ROUND(SIN($L4),2)","v":0.1},{"$f":"ROUND(COS($L4),2)","v":1}]
[20,0.17,0.17,0.99,"00:20:00",30,0.05,0.05,1,"00:00:30",2,0.21,0.21,0.98]
[30,0.26,0.26,0.97,"00:30:00",45,0.08,0.08,1,"00:00:45",3,0.31,0.31,0.95]
[40,0.35,0.34,0.94,"00:40:00",100,0.1,0.1,1,"00:01:00",4,0.42,0.41,0.91]
[50,0.44,0.43,0.9,"00:50:00",115,0.13,0.13,0.99,"00:01:15",5,0.52,0.5,0.87]
[100,0.52,0.5,0.87,"01:00:00",130,0.16,0.16,0.99,"00:01:30",6,0.63,0.59,0.81]
[110,0.61,0.56999999999999995,0.82,"01:10:00",145,0.18,0.18,0.98,"00:01:45",7,0.73,0.67,0.75]
[120,0.7,0.64,0.76,"01:20:00",200,0.21,0.21,0.98,"00:02:00",8,0.84,0.74,0.67]
[130,0.79,0.71,0.7,"01:30:00",215,0.24,0.24,0.97,"00:02:15",9,0.94,0.81,0.59]
[140,0.87,0.76,0.64,"01:40:00",230,0.26,0.26,0.97,"00:02:30",10,1.05,0.87,0.5]
[150,0.96,0.82,0.56999999999999995,"01:50:00",245,0.28999999999999998,0.28999999999999998,0.96,"00:02:45",11,1.1499999999999999,0.91,0.41]
[200,1.05,0.87,0.5,"02:00:00",300,0.31,0.31,0.95,"00:03:00",12,1.26,0.95,0.31]
[210,1.1299999999999999,0.9,0.43,"02:10:00",315,0.34,0.33,0.94,"00:03:15",13,1.36,0.98,0.21]
[220,1.22,0.94,0.34,"02:20:00",330,0.37,0.36,0.93,"00:03:30",14,1.47,0.99,0.1]
[230,1.31,0.97,0.26,"02:30:00",345,0.39,0.38,0.92,"00:03:45",15,1.57,1,0]
[240,1.4,0.99,0.17,"02:40:00",400,0.42,0.41,0.91,"00:04:00",16,1.68,0.99,-0.11]
[250,1.48,1,0.09,"02:50:00",415,0.45,0.43,0.9,"00:04:15",17,1.78,0.98,-0.21]
[300,1.57,1,0,"03:00:00",430,0.47,0.45,0.89,"00:04:30",18,1.88,0.95,-0.3]
[310,1.66,1,-0.09,"03:10:00",445,0.5,0.48,0.88,"00:04:45",19,1.99,0.91,-0.41]
[320,1.75,0.98,-0.18,"03:20:00",500,0.52,0.5,0.87,"00:05:00",20,2.09,0.87,-0.5]
[330,1.83,0.97,-0.26,"03:30:00",515,0.55000000000000004,0.52,0.85,"00:05:15",21,2.2000000000000002,0.81,-0.59]
[340,1.92,0.94,-0.34,"03:40:00",530,0.57999999999999996,0.55000000000000004,0.84,"00:05:30",22,2.2999999999999998,0.75,-0.67]
[350,2.0099999999999998,0.91,-0.43,"03:50:00",545,0.6,0.56000000000000005,0.83,"00:05:45",23,2.41,0.67,-0.74]
[400,2.09,0.87,-0.5,"04:00:00",600,0.63,0.59,0.81,"00:06:00",24,2.5099999999999998,0.59,-0.81]
[410,2.1800000000000002,0.82,-0.56999999999999995,"04:10:00",615,0.65,0.61,0.8,"00:06:15",25,2.62,0.5,-0.87]
[420,2.27,0.77,-0.64,"04:20:00",630,0.68,0.63,0.78,"00:06:30",26,2.72,0.41,-0.91]
[430,2.36,0.7,-0.71,"04:30:00",645,0.71,0.65,0.76,"00:06:45",27,2.83,0.31,-0.95]
[440,2.44,0.65,-0.76,"04:40:00",700,0.73,0.67,0.75,"00:07:00",28,2.93,0.21,-0.98]
[450,2.5299999999999998,0.56999999999999995,-0.82,"04:50:00",715,0.76,0.69,0.72,"00:07:15",29,3.04,0.1,-0.99]
[500,2.62,0.5,-0.87,"05:00:00",730,0.79,0.71,0.7,"00:07:30",30,3.14,0,-1]
[510,2.71,0.42,-0.91,"05:10:00",745,0.81,0.72,0.69,"00:07:45",31,3.25,-0.11,-0.99]
[520,2.79,0.34,-0.94,"05:20:00",800,0.84,0.74,0.67,"00:08:00",32,3.35,-0.21,-0.98]
[530,2.88,0.26,-0.97,"05:30:00",815,0.86,0.76,0.65,"00:08:15",33,3.46,-0.31,-0.95]
[540,2.97,0.17,-0.99,"05:40:00",830,0.89,0.78,0.63,"00:08:30",34,3.56,-0.41,-0.91]
[550,3.05,0.09,-1,"05:50:00",845,0.92,0.8,0.61,"00:08:45",35,3.67,-0.5,-0.86]
[600,3.14,0,-1,"06:00:00",900,0.94,0.81,0.59,"00:09:00",36,3.77,-0.59,-0.81]
[610,3.23,-0.09,-1,"06:10:00",915,0.97,0.82,0.56999999999999995,"00:09:15",37,3.87,-0.67,-0.75]
[620,3.32,-0.18,-0.98,"06:20:00",930,0.99,0.84,0.55000000000000004,"00:09:30",38,3.98,-0.74,-0.67]
[630,3.4,-0.26,-0.97,"06:30:00",945,1.02,0.85,0.52,"00:09:45",39,4.08,-0.81,-0.59]
[640,3.49,-0.34,-0.94,"06:40:00",1000,1.05,0.87,0.5,"00:10:00",40,4.1900000000000004,-0.87,-0.5]
[650,3.58,-0.42,-0.91,"06:50:00",1015,1.07,0.88,0.48,"00:10:15",41,4.29,-0.91,-0.41]
[700,3.67,-0.5,-0.86,"07:00:00",1030,1.1000000000000001,0.89,0.45,"00:10:30",42,4.4000000000000004,-0.95,-0.31]
[710,3.75,-0.56999999999999995,-0.82,"07:10:00",1045,1.1299999999999999,0.9,0.43,"00:10:45",43,4.5,-0.98,-0.21]
[720,3.84,-0.64,-0.77,"07:20:00",1100,1.1499999999999999,0.91,0.41,"00:11:00",44,4.6100000000000003,-0.99,-0.1]
[730,3.93,-0.71,-0.7,"07:30:00",1115,1.18,0.92,0.38,"00:11:15",45,4.71,-1,0]
[740,4.01,-0.76,-0.65,"07:40:00",1130,1.2,0.93,0.36,"00:11:30",46,4.82,-0.99,0.11]
[750,4.0999999999999996,-0.82,-0.56999999999999995,"07:50:00",1145,1.23,0.94,0.33,"00:11:45",47,4.92,-0.98,0.21]
[800,4.1900000000000004,-0.87,-0.5,"08:00:00",1200,1.26,0.95,0.31,"00:12:00",48,5.03,-0.95,0.31]
[810,4.28,-0.91,-0.42,"08:10:00",1215,1.28,0.96,0.28999999999999998,"00:12:15",49,5.13,-0.91,0.41]
[820,4.3600000000000003,-0.94,-0.35,"08:20:00",1230,1.31,0.97,0.26,"00:12:30",50,5.24,-0.86,0.5]
[830,4.45,-0.97,-0.26,"08:30:00",1245,1.34,0.97,0.23,"00:12:45",51,5.34,-0.81,0.59]
[840,4.54,-0.99,-0.17,"08:40:00",1300,1.36,0.98,0.21,"00:13:00",52,5.45,-0.74,0.67]
[850,4.63,-1,-0.08,"08:50:00",1315,1.39,0.98,0.18,"00:13:15",53,5.55,-0.67,0.74]
[900,4.71,-1,0,"09:00:00",1330,1.41,0.99,0.16,"00:13:30",54,5.65,-0.59,0.81]
[910,4.8,-1,0.09,"09:10:00",1345,1.44,0.99,0.13,"00:13:45",55,5.76,-0.5,0.87]
[920,4.8899999999999997,-0.98,0.18,"09:20:00",1400,1.47,0.99,0.1,"00:14:00",56,5.86,-0.41,0.91]
[930,4.97,-0.97,0.25,"09:30:00",1415,1.49,1,0.08,"00:14:15",57,5.97,-0.31,0.95]
[940,5.0599999999999996,-0.94,0.34,"09:40:00",1430,1.52,1,0.05,"00:14:30",58,6.07,-0.21,0.98]
[950,5.15,-0.91,0.42,"09:50:00",1445,1.54,1,0.03,"00:14:45",59,6.18,-0.1,0.99]
[1000,5.24,-0.86,0.5,"10:00:00",1500,1.57,1,0,"00:15:00"]
[1010,5.32,-0.82,0.56999999999999995,"10:10:00",1515,1.6,1,-0.03,"00:15:15"]
[1020,5.41,-0.77,0.64,"10:20:00",1530,1.62,1,-0.05,"00:15:30"]
[1030,5.5,-0.71,0.71,"10:30:00",1545,1.65,1,-0.08,"00:15:45"]
[1040,5.59,-0.64,0.77,"10:40:00",1600,1.68,0.99,-0.11,"00:16:00"]
[{"$f":"HOUR($E68)*100+MINUTE($E68)","v":1050},5.67,-0.57999999999999996,0.82,"10:50:00",{"$f":"MINUTE($J68)*100+SECOND($J68)","v":1615},1.7,0.99,-0.13,"00:16:15"]
[1100,5.76,-0.5,0.87,"11:00:00",1630,1.73,0.99,-0.16,"00:16:30"]
[1110,5.85,-0.42,0.91,"11:10:00",1645,1.75,0.98,-0.18,"00:16:45"]
[1120,5.93,-0.35,0.94,"11:20:00",1700,1.78,0.98,-0.21,"00:17:00"]
[1130,6.02,-0.26,0.97,"11:30:00",1715,1.81,0.97,-0.24,"00:17:15"]
[1140,6.11,-0.17,0.99,"11:40:00",1730,1.83,0.97,-0.26,"00:17:30"]
[1150,6.2,-0.08,1,"11:50:00",1745,1.86,0.96,-0.28999999999999998,"00:17:45"]
[1200,6.28,0,1,"12:00:00",1800,1.88,0.95,-0.3,"00:18:00"]
[1210,6.37,0.09,1,"12:10:00",1815,1.91,0.94,-0.33,"00:18:15"]
[1220,6.46,0.18,0.98,"12:20:00",1830,1.94,0.93,-0.36,"00:18:30"]
[1230,6.54,0.25,0.97,"12:30:00",1845,1.96,0.93,-0.38,"00:18:45"]
[1240,6.63,0.34,0.94,"12:40:00",1900,1.99,0.91,-0.41,"00:19:00"]
[1250,6.72,0.42,0.91,"12:50:00",1915,2.02,0.9,-0.43,"00:19:15"]
[1300,6.81,0.5,0.86,"13:00:00",1930,2.04,0.89,-0.45,"00:19:30"]
[1310,6.89,0.56999999999999995,0.82,"13:10:00",1945,2.0699999999999998,0.88,-0.48,"00:19:45"]
[1320,6.98,0.64,0.77,"13:20:00",2000,2.09,0.87,-0.5,"00:20:00"]
[1330,7.07,0.71,0.71,"13:30:00",2015,2.12,0.85,-0.52,"00:20:15"]
[1340,7.16,0.77,0.64,"13:40:00",2030,2.15,0.84,-0.55000000000000004,"00:20:30"]
[1350,7.24,0.82,0.57999999999999996,"13:50:00",2045,2.17,0.83,-0.56000000000000005,"00:20:45"]
[1400,7.33,0.87,0.5,"14:00:00",2100,2.2000000000000002,0.81,-0.59,"00:21:00"]
[1410,7.42,0.91,0.42,"14:10:00",2115,2.23,0.79,-0.61,"00:21:15"]
[1420,7.5,0.94,0.35,"14:20:00",2130,2.25,0.78,-0.63,"00:21:30"]
[1430,7.59,0.97,0.26,"14:30:00",2145,2.2799999999999998,0.76,-0.65,"00:21:45"]
[1440,7.68,0.98,0.17,"14:40:00",2200,2.2999999999999998,0.75,-0.67,"00:22:00"]
[1450,7.77,1,0.08,"14:50:00",2215,2.33,0.73,-0.69,"00:22:15"]
[1500,7.85,1,0,"15:00:00",2230,2.36,0.7,-0.71,"00:22:30"]
[1510,7.94,1,-0.09,"15:10:00",2245,2.38,0.69,-0.72,"00:22:45"]
[1520,8.0299999999999994,0.98,-0.18,"15:20:00",2300,2.41,0.67,-0.74,"00:23:00"]
[1530,8.1199999999999992,0.96,-0.26,"15:30:00",2315,2.4300000000000002,0.65,-0.76,"00:23:15"]
[1540,8.1999999999999993,0.94,-0.34,"15:40:00",2330,2.46,0.63,-0.78,"00:23:30"]
[1550,8.2899999999999991,0.91,-0.42,"15:50:00",2345,2.4900000000000002,0.61,-0.8,"00:23:45"]
[1600,8.3800000000000008,0.86,-0.5,"16:00:00",2400,2.5099999999999998,0.59,-0.81,"00:24:00"]
[1610,8.4600000000000009,0.82,-0.56999999999999995,"16:10:00",2415,2.54,0.56999999999999995,-0.82,"00:24:15"]
[1620,8.5500000000000007,0.77,-0.64,"16:20:00",2430,2.57,0.54,-0.84,"00:24:30"]
[1630,8.64,0.71,-0.71,"16:30:00",2445,2.59,0.52,-0.85,"00:24:45"]
[1640,8.73,0.64,-0.77,"16:40:00",2500,2.62,0.5,-0.87,"00:25:00"]
[1650,8.81,0.57999999999999996,-0.82,"16:50:00",2515,2.64,0.48,-0.88,"00:25:15"]
[1700,8.9,0.5,-0.87,"17:00:00",2530,2.67,0.45,-0.89,"00:25:30"]
[1710,8.99,0.42,-0.91,"17:10:00",2545,2.7,0.43,-0.9,"00:25:45"]
[1720,9.08,0.34,-0.94,"17:20:00",2600,2.72,0.41,-0.91,"00:26:00"]
[1730,9.16,0.26,-0.97,"17:30:00",2615,2.75,0.38,-0.92,"00:26:15"]
[1740,9.25,0.17,-0.98,"17:40:00",2630,2.78,0.35,-0.94,"00:26:30"]
[1750,9.34,0.08,-1,"17:50:00",2645,2.8,0.33,-0.94,"00:26:45"]
[1800,9.42,0,-1,"18:00:00",2700,2.83,0.31,-0.95,"00:27:00"]
[1810,9.51,-0.09,-1,"18:10:00",2715,2.85,0.28999999999999998,-0.96,"00:27:15"]
[1820,9.6,-0.17,-0.98,"18:20:00",2730,2.88,0.26,-0.97,"00:27:30"]
[1830,9.69,-0.26,-0.97,"18:30:00",2745,2.91,0.23,-0.97,"00:27:45"]
[1840,9.77,-0.34,-0.94,"18:40:00",2800,2.93,0.21,-0.98,"00:28:00"]
[1850,9.86,-0.42,-0.91,"18:50:00",2815,2.96,0.18,-0.98,"00:28:15"]
[1900,9.9499999999999993,-0.5,-0.87,"19:00:00",2830,2.98,0.16,-0.99,"00:28:30"]
[1910,10.039999999999999,-0.57999999999999996,-0.82,"19:10:00",2845,3.01,0.13,-0.99,"00:28:45"]
[1920,10.119999999999999,-0.64,-0.77,"19:20:00",2900,3.04,0.1,-0.99,"00:29:00"]
[1930,10.210000000000001,-0.71,-0.71,"19:30:00",2915,3.06,0.08,-1,"00:29:15"]
[1940,10.3,-0.77,-0.64,"19:40:00",2930,3.09,0.05,-1,"00:29:30"]
[1950,10.38,-0.82,-0.57999999999999996,"19:50:00",2945,3.12,0.02,-1,"00:29:45"]
[2000,10.47,-0.87,-0.5,"20:00:00",3000,3.14,0,-1,"00:30:00"]
[2010,10.56,-0.91,-0.42,"20:10:00",3015,3.17,-0.03,-1,"00:30:15"]
[2020,10.65,-0.94,-0.34,"20:20:00",3030,3.19,-0.05,-1,"00:30:30"]
[2030,10.73,-0.96,-0.26,"20:30:00",3045,3.22,-0.08,-1,"00:30:45"]
[2040,10.82,-0.98,-0.17,"20:40:00",3100,3.25,-0.11,-0.99,"00:31:00"]
[2050,10.91,-1,-0.09,"20:50:00",3115,3.27,-0.13,-0.99,"00:31:15"]
[2100,11,-1,0,"21:00:00",3130,3.3,-0.16,-0.99,"00:31:30"]
[2110,11.08,-1,0.08,"21:10:00",3145,3.32,-0.18,-0.98,"00:31:45"]
[2120,11.17,-0.98,0.17,"21:20:00",3200,3.35,-0.21,-0.98,"00:32:00"]
[{"$f":"HOUR($E132)*100+MINUTE($E132)","v":2130},11.26,-0.97,0.26,"21:30:00",{"$f":"MINUTE($J132)*100+SECOND($J132)","v":3215},3.38,-0.24,-0.97,"00:32:15"]
[2140,11.34,-0.94,0.34,"21:40:00",3230,3.4,-0.26,-0.97,"00:32:30"]
[2150,11.43,-0.91,0.42,"21:50:00",3245,3.43,-0.28000000000000003,-0.96,"00:32:45"]
[2200,11.52,-0.87,0.5,"22:00:00",3300,3.46,-0.31,-0.95,"00:33:00"]
[2210,11.61,-0.82,0.57999999999999996,"22:10:00",3315,3.48,-0.33,-0.94,"00:33:15"]
[2220,11.69,-0.77,0.64,"22:20:00",3330,3.51,-0.36,-0.93,"00:33:30"]
[2230,11.78,-0.71,0.71,"22:30:00",3345,3.53,-0.38,-0.93,"00:33:45"]
[2240,11.87,-0.64,0.77,"22:40:00",3400,3.56,-0.41,-0.91,"00:34:00"]
[2250,11.96,-0.56999999999999995,0.82,"22:50:00",3415,3.59,-0.43,-0.9,"00:34:15"]
[2300,12.04,-0.5,0.86,"23:00:00",3430,3.61,-0.45,-0.89,"00:34:30"]
[2310,12.13,-0.42,0.91,"23:10:00",3445,3.64,-0.48,-0.88,"00:34:45"]
[2320,12.22,-0.34,0.94,"23:20:00",3500,3.67,-0.5,-0.86,"00:35:00"]
[2330,12.3,-0.26,0.96,"23:30:00",3515,3.69,-0.52,-0.85,"00:35:15"]
[2340,12.39,-0.18,0.98,"23:40:00",3530,3.72,-0.55000000000000004,-0.84,"00:35:30"]
[2350,12.48,-0.09,1,"23:50:00",3545,3.74,-0.56000000000000005,-0.83,"00:35:45"]
[null,null,null,null,null,3600,3.77,-0.59,-0.81,"00:36:00"]
[null,null,null,null,null,3615,3.8,-0.61,-0.79,"00:36:15"]
[null,null,null,null,null,3630,3.82,-0.63,-0.78,"00:36:30"]
[null,null,null,null,null,3645,3.85,-0.65,-0.76,"00:36:45"]
[null,null,null,null,null,3700,3.87,-0.67,-0.75,"00:37:00"]
[null,null,null,null,null,3715,3.9,-0.69,-0.73,"00:37:15"]
[null,null,null,null,null,3730,3.93,-0.71,-0.7,"00:37:30"]
[null,null,null,null,null,3745,3.95,-0.72,-0.69,"00:37:45"]
[null,null,null,null,null,3800,3.98,-0.74,-0.67,"00:38:00"]
[null,null,null,null,null,3815,4.01,-0.76,-0.65,"00:38:15"]
[null,null,null,null,null,3830,4.03,-0.78,-0.63,"00:38:30"]
[null,null,null,null,null,3845,4.0599999999999996,-0.79,-0.61,"00:38:45"]
[null,null,null,null,null,3900,4.08,-0.81,-0.59,"00:39:00"]
[null,null,null,null,null,3915,4.1100000000000003,-0.82,-0.56999999999999995,"00:39:15"]
[null,null,null,null,null,3930,4.1399999999999997,-0.84,-0.54,"00:39:30"]
[null,null,null,null,null,3945,4.16,-0.85,-0.52,"00:39:45"]
[null,null,null,null,null,4000,4.1900000000000004,-0.87,-0.5,"00:40:00"]
[null,null,null,null,null,4015,4.21,-0.88,-0.48,"00:40:15"]
[null,null,null,null,null,4030,4.24,-0.89,-0.46,"00:40:30"]
[null,null,null,null,null,4045,4.2699999999999996,-0.9,-0.43,"00:40:45"]
[null,null,null,null,null,4100,4.29,-0.91,-0.41,"00:41:00"]
[null,null,null,null,null,4115,4.32,-0.92,-0.38,"00:41:15"]
[null,null,null,null,null,4130,4.3499999999999996,-0.94,-0.35,"00:41:30"]
[null,null,null,null,null,4145,4.37,-0.94,-0.34,"00:41:45"]
[null,null,null,null,null,4200,4.4000000000000004,-0.95,-0.31,"00:42:00"]
[null,null,null,null,null,4215,4.42,-0.96,-0.28999999999999998,"00:42:15"]
[null,null,null,null,null,4230,4.45,-0.97,-0.26,"00:42:30"]
[null,null,null,null,null,4245,4.4800000000000004,-0.97,-0.23,"00:42:45"]
[null,null,null,null,null,4300,4.5,-0.98,-0.21,"00:43:00"]
[null,null,null,null,null,4315,4.53,-0.98,-0.18,"00:43:15"]
[null,null,null,null,null,4330,4.5599999999999996,-0.99,-0.15,"00:43:30"]
[null,null,null,null,null,4345,4.58,-0.99,-0.13,"00:43:45"]
[null,null,null,null,null,4400,4.6100000000000003,-0.99,-0.1,"00:44:00"]
[null,null,null,null,null,4415,4.63,-1,-0.08,"00:44:15"]
[null,null,null,null,null,4430,4.66,-1,-0.05,"00:44:30"]
[null,null,null,null,null,4445,4.6900000000000004,-1,-0.02,"00:44:45"]
[null,null,null,null,null,4500,4.71,-1,0,"00:45:00"]
[null,null,null,null,null,4515,4.74,-1,0.03,"00:45:15"]
[null,null,null,null,null,4530,4.76,-1,0.05,"00:45:30"]
[null,null,null,null,null,4545,4.79,-1,0.08,"00:45:45"]
[null,null,null,null,null,4600,4.82,-0.99,0.11,"00:46:00"]
[null,null,null,null,null,4615,4.84,-0.99,0.13,"00:46:15"]
[null,null,null,null,null,4630,4.87,-0.99,0.16,"00:46:30"]
[null,null,null,null,null,4645,4.9000000000000004,-0.98,0.19,"00:46:45"]
[null,null,null,null,null,4700,4.92,-0.98,0.21,"00:47:00"]
[null,null,null,null,null,4715,4.95,-0.97,0.24,"00:47:15"]
[null,null,null,null,null,4730,4.97,-0.97,0.25,"00:47:30"]
[null,null,null,null,null,4745,5,-0.96,0.28000000000000003,"00:47:45"]
[null,null,null,null,null,4800,5.03,-0.95,0.31,"00:48:00"]
[null,null,null,null,null,{"$f":"MINUTE($J196)*100+SECOND($J196)","v":4815},5.05,-0.94,0.33,"00:48:15"]
[null,null,null,null,null,4830,5.08,-0.93,0.36,"00:48:30"]
[null,null,null,null,null,4845,5.1100000000000003,-0.92,0.39,"00:48:45"]
[null,null,null,null,null,4900,5.13,-0.91,0.41,"00:49:00"]
[null,null,null,null,null,4915,5.16,-0.9,0.43,"00:49:15"]
[null,null,null,null,null,4930,5.18,-0.89,0.45,"00:49:30"]
[null,null,null,null,null,4945,5.21,-0.88,0.48,"00:49:45"]
[null,null,null,null,null,5000,5.24,-0.86,0.5,"00:50:00"]
[null,null,null,null,null,5015,5.26,-0.85,0.52,"00:50:15"]
[null,null,null,null,null,5030,5.29,-0.84,0.55000000000000004,"00:50:30"]
[null,null,null,null,null,5045,5.31,-0.83,0.56000000000000005,"00:50:45"]
[null,null,null,null,null,5100,5.34,-0.81,0.59,"00:51:00"]
[null,null,null,null,null,5115,5.37,-0.79,0.61,"00:51:15"]
[null,null,null,null,null,5130,5.39,-0.78,0.63,"00:51:30"]
[null,null,null,null,null,5145,5.42,-0.76,0.65,"00:51:45"]
[null,null,null,null,null,5200,5.45,-0.74,0.67,"00:52:00"]
[null,null,null,null,null,5215,5.47,-0.73,0.69,"00:52:15"]
[null,null,null,null,null,5230,5.5,-0.71,0.71,"00:52:30"]
[null,null,null,null,null,5245,5.52,-0.69,0.72,"00:52:45"]
[null,null,null,null,null,5300,5.55,-0.67,0.74,"00:53:00"]
[null,null,null,null,null,5315,5.58,-0.65,0.76,"00:53:15"]
[null,null,null,null,null,5330,5.6,-0.63,0.78,"00:53:30"]
[null,null,null,null,null,5345,5.63,-0.61,0.79,"00:53:45"]
[null,null,null,null,null,5400,5.65,-0.59,0.81,"00:54:00"]
[null,null,null,null,null,5415,5.68,-0.56999999999999995,0.82,"00:54:15"]
[null,null,null,null,null,5430,5.71,-0.54,0.84,"00:54:30"]
[null,null,null,null,null,5445,5.73,-0.53,0.85,"00:54:45"]
[null,null,null,null,null,5500,5.76,-0.5,0.87,"00:55:00"]
[null,null,null,null,null,5515,5.79,-0.47,0.88,"00:55:15"]
[null,null,null,null,null,5530,5.81,-0.46,0.89,"00:55:30"]
[null,null,null,null,null,5545,5.84,-0.43,0.9,"00:55:45"]
[null,null,null,null,null,5600,5.86,-0.41,0.91,"00:56:00"]
[null,null,null,null,null,5615,5.89,-0.38,0.92,"00:56:15"]
[null,null,null,null,null,5630,5.92,-0.36,0.93,"00:56:30"]
[null,null,null,null,null,5645,5.94,-0.34,0.94,"00:56:45"]
[null,null,null,null,null,5700,5.97,-0.31,0.95,"00:57:00"]
[null,null,null,null,null,5715,6,-0.28000000000000003,0.96,"00:57:15"]
[null,null,null,null,null,5730,6.02,-0.26,0.97,"00:57:30"]
[null,null,null,null,null,5745,6.05,-0.23,0.97,"00:57:45"]
[null,null,null,null,null,5800,6.07,-0.21,0.98,"00:58:00"]
[null,null,null,null,null,5815,6.1,-0.18,0.98,"00:58:15"]
[null,null,null,null,null,5830,6.13,-0.15,0.99,"00:58:30"]
[null,null,null,null,null,5845,6.15,-0.13,0.99,"00:58:45"]
[null,null,null,null,null,5900,6.18,-0.1,0.99,"00:59:00"]
[null,null,null,null,null,5915,6.2,-0.08,1,"00:59:15"]
[null,null,null,null,null,5930,6.23,-0.05,1,"00:59:30"]
[null,null,null,null,null,5945,6.26,-0.02,1,"00:59:45"]

{"sheet":"Idiomas","index":4,"n_rows":58,"n_cols":9,"rows_kept":58,"cut":false,"hidden":false,"merged":[]}
["English","Español","Français","Català","Euskara","Galego","Italiano","Português","Deutsche"]
["City","Ciudad","Ville","Ciutat","Hiria","Cidade","Città","Cidade","Stadt"]
["Country","País","Pays","País","Herrialdea","País","Nazione","País","Land"]
["GMT","GMT","GMT","GMT","GMT","GMT","GMT","GMT","GMT"]
["Clock #","Reloj Nº","L'horloge #","Rellotge #","Erlojua #","Reloxo #","Orologio #","Relógio #","Uhr #"]
["Language","Idioma","Langue","Llenguatge","Hizkuntza","Lingua","Lingua","Língua","Sprache"]
["WORLD CLOCKS Version 3.6","RELOJES MUNDIALES Versión 3.6","HORLOGES DU MONDE Version 3.6","RELLOTGES MUNDIALS Versió 3.6","MUNDUKO ERLOUAK 3.6 bertsioa","RELOXOS MUNDIAIS Versión 3.6","OROLOGI MONDIALI Versione 3.6","RELÓGIOS MUNDIAIS versão 3.6","WELTUHREN Version 3.6"]
["Author","Autor","Auteur","Autor","Egilea","Autor","Autore","Autor","Autor"]
["Thanks to","Gracias a","Grâce à","Gràcies a","Eskerrak","Grazas a","Grazie a","Graças a","Dank an"]
["WORLD CLOCKS HELP:","RELOJES MUNDIALES AYUDA:","AIDE DES HORLOGES DU MONDE :","AJUDA ELS RELOJELLS MUNDIALS:","MUNDUKO ERLOGIAK LAGUNTZA:","AXUDA DO RELOXO MUNDIAL:","AIUTO OROLOGI MONDIALI:","AJUDA DO RELÓGIO MUNDIAL:","WELTUHREN HILFEN:"]
["Click on the big clock: Stop/Start clocks.","Clic en el reloj grande: Para/Arranca relojes.","Cliquez sur la grande horloge: Arrêter/Démarrer horloges.","Clic al rellotge gran: Per/Arrenca rellotges.","Egin klik erloju handian: Gelditu/Hasi erlojuak.","Fai clic no reloxo grande: Deter/Iniciar reloxos.","Fare clic sull'orologio grande: Stop/Avvia orologi.","Clique no relógio grande: relógios stop/start.","Klicken Sie auf die große Uhr: Stopp/Start-Uhren."]
["To create a new city on the map:","Para crear una nueva ciudad en el mapa:","Pour créer une nouvelle ville sur la carte :","Per crear una ciutat nova al mapa:","Mapan hiri berri bat sortzeko:","Para crear unha nova cidade no mapa:","Per creare una nuova città sulla mappa:","Para criar uma nova cidade no mapa:","So erstellen Sie eine neue Stadt auf der Karte:"]
["1) Stop the clocks","1) Parar los relojes","1) Arrêtez les horloges","1) Atureu els rellotges","1) Erlojuak gelditu","1) Parar os reloxos","1) Ferma gli orologi","1) Pare os relógios","1) Stoppen Sie die Uhren"]
["2) Right mouse button on the map","2) Botón derecho del ratón sobre el mapa","2) Bouton droit de la souris sur la carte","2) Botó dret del ratolí al mapa","2) Saguaren eskuineko botoia mapan","2) Botón dereito do rato no mapa","2) Tasto destro del mouse sulla mappa","2) Botão direito do mouse no mapa","2) Rechte Maustaste auf der Karte"]
["3) Select a city or country on the 'Relojes' sheet","3) Seleccionar una ciudad o pais en la hoja 'Relojes'","3) Sélectionnez une ville ou un pays sur la feuille 'Relojes'","3) Seleccioneu una ciutat o país al full de 'Relojes'","3) Hautatu hiri edo herrialde bat 'Relojes' orrian","3) Seleccione unha cidade ou país na folla 'Reloxes'","3) Seleziona una città o un paese sul foglio 'Relojes'","3) Selecione uma cidade ou país na planilha 'Relojes'","3) Wählen Sie eine Stadt oder ein Land auf dem Blatt 'Relojes' aus"]
["Hour","Hora","Heure","Hores","Ordua","Hora","Ora","Hora","Stunde"]
["Date","Fecha","Date","Data","Data","Data","Data","Encontro","Datum"]
["GMT Hour","Hora GMT","Heure GMT","Hora GMT","GMT ordua","Hora GMT","Ora GMT","Hora GMT","GMT-Stunde"]
["Hours hand:","Saeta de las horas:","Aiguille des heures :","Agulla de les hores:","Orduen eskua:","Man de horas:","Lancetta delle ore:","Ponteiro de horas:","Stundenzeiger:"]
["Minutes hand:","Saeta de las minutos:","Aiguille des minutes :","Man dels minuts:","Minutu eskua:","Manexo de minutos:","Lancetta dei minuti:","Mão dos minutos:","Minutenzeiger:"]
["Seconds hand:","Saeta de las segundos:","Aiguille des secondes :","Man dels segons:","Segundoen eskua:","Agulla dos segundos:","Lancetta dei secondi:","Mão dos segundos:","Sekundenzeiger:"]
["Cities","Ciudades","Villes","Ciutats","Hiriak","Cidades","Città","Cidades","Städte"]
["Countries","Países","Des pays","Països","Herrialdeak","Países","Paesi","Países","Länder"]
["City #","Núm. Ciudad","Ville #","Ciutat #","Hiria #","Cidade #","Città #","Cidade #","Stadt #"]
["Latitude","Latitud","Latitude","Latitud","Latitudea","Latitude","Latitudine","Latitude","Breite"]
["Longitude","Longitud","Longitude","Longitud","Luzera","Lonxitude","Longitudine","Longitude","Längengrad"]
["Decimal latitude","Latitud decimal","Latitude décimale","Latitud decimal","Latitude hamartarra","Latitude decimal","latitudine decimale","Latitude decimal","Dezimaler Breitengrad"]
["Decimal longitude","Longitud decimal","Longitude décimale","Longitud decimal","Longitude hamartarra","Lonxitude decimal","Longitudine decimale","Longitude decimal","Dezimaler Längengrad"]
["Minute","Minuto","Minute","Minut","Minutua","Minuto","Minuto","Minuto","Minute"]
["Province","Provincia","Province","Província","Probintzia","Provincia","Provincia","Província","Provinz"]
["UTC","UTC","UTC","UTC","UTC","UTC","UTC","UTC","UTC"]
["Day","Día","Jour","Dia","Eguna","Día","Giorno","Dia","Tag"]
["Hour Minute","Hora Minuto","Heure Minute","Hora Minut","Ordua Minutua","Hora Minuto","Ora Minuto","Hora minuto","Stunde Minute"]
["Hours radians","Radianes Horas","Heures en radians","Hores radians","Orduak radianak","Horas radiáns","Ore radianti","Horas radianos","Stunden im Bogenmaß"]
["Hours Sine","Seno Horas","Heures sinus","Hores Sine","Orduak Sine","Horas Sine","Ore Sine","Horas Seno","Stunden Sinus"]
["Hours Cosine","Coseno Horas","Heures Cosinus","Hores cosinus","Orduak kosinua","Horas Coseno","Ore Coseno","Horas Coseno","Stunden Cosinus"]
["hh:mm","hh:mm","hh:mm","hh:mm","hh:mm","hh:mm","hh:mm","hh:mm","hh:mm"]
["Minute Second","Minuto Segundo","Minute seconde","Minut segon","Minutua Bigarrena","Minuto Segundo","Minuto Secondo","Segundo minuto","Minute Sekunde"]
["Minutes radians","Radianes Minutos","Minutes radians","Minuts radians","Minutu radianak","Minutos radiáns","Minuti radianti","Radianos de minutos","Minuten im Bogenmaß"]
["Minutes Sine","Seno Minutos","Minutes sinus","Minuts Sine","Minutu Sine","Minutos Sine","Minuti seno","Minutos Seno","Minuten Sinus"]
["Minutes Cosine","Coseno Minutos","Minutes Cosinus","Minuts cosinus","Minutu kosinua","Minutos Coseno","Minuti Coseno","Minutos Cosseno","Minuten Cosinus"]
["mm:ss","mm:ss","mm:ss","mm:ss","mm:ss","mm:ss","mm:ss","mm:ss","mm:ss"]
["Seconds","Segundos","Secondes","Segons","Segundoak","Segundos","Secondi","Segundos","Sekunden"]
["Radians Seconds","Radianes Segundos","Radians secondes","Radians segons","Radianak segundoak","Radiáns Segundos","Radianti secondi","Radianos segundos","Bogenmaß Sekunden"]
["Seconds Sine","Seno Segundos","Secondes sinus","Segons Sine","Segundoak Sine","Segundos Sine","Secondi seno","Segundos Seno","Sekunden Sinus"]
["Seconds Cosine","Coseno Segundos","Cosinus des secondes","Cosinus segons","Segundo kosinua","Segundos coseno","Secondi coseno","Cosseno de segundos","Sekunden Kosinus"]
["Web Services","Servicios Web","Services Web","Serveis web","Web Zerbitzuak","Servizos web","Servizi web","Serviços web","Internetdienste"]
["Mouse over map","Ratón sobre mapa","Survolez la carte","Ratolí sobre el mapa","Sagua pasa","Pasa o rato sobre","Passa il mouse","Mouse sobre o mapa","Maus über Karte"]
["en","es","fr","ca","eu","gl","it","pt","de"]
["See the cities","Ver las ciudades","Voir les villes","Veure les ciutats","Ikusi hiriak","Ver as cidades","Vedi le città","Veja as cidades","Sehen Sie die Städte"]
["See the clocks","Ver los relojes","Voir les horloges","Veure els rellotges","Ikus erlojuak","Ver os reloxos","Vedere gli orologi","Veja os relógios","Siehe die Uhren"]
["The destination file exists","El archivo de destino existe","Le fichier de destination existe","El fitxer de destinació existeix","Helmuga fitxategia badago","O ficheiro de destino existe","Il file di destinazione esiste","O arquivo de destino existe","Die Zieldatei existiert"]
["Do you want to overwrite the existing file?","¿Desea sobrescribir el archivo existente?","Voulez-vous écraser le fichier existant ?","Voleu sobreescriure el fitxer existent?","Lehendik dagoen fitxategia gainidatzi nahi duzu?","Queres sobrescribir o ficheiro existente?","Vuoi sovrascrivere il file esistente?","Deseja substituir o arquivo existente?","Möchten Sie die vorhandene Datei überschreiben?"]
["World map","Mapamundi","Carte du monde","Mapa del Món","Munduko mapa","Mapa do mundo","Mappa del mondo","Mapa mundial","Weltkarte"]
["File not found","Archivo no encontrado","Fichier introuvable","Arxiu no trobat","Fitxategia ez da aurkitu","Arquivo non atopado","File non trovato","Arquivo não encontrado","Datei nicht gefunden"]
["Do you want to add the city to the map?","¿Quiere añadir la ciudad al mapa?","Voulez-vous ajouter la ville à la carte ?","Vols afegir la ciutat al mapa?","Hiria mapan gehitu nahi al duzu?","Queres engadir a cidade ao mapa?","Vuoi aggiungere la città alla mappa?","Deseja adicionar a cidade ao mapa?","Möchten Sie die Stadt zur Karte hinzufügen?"]
["Are you sure you want to remove","¿Estás seguro de que quieres quitar","Êtes-vous sûr de vouloir supprimer","Estàs segura que vols treure","Ziur kendu nahi duzula","Seguro que queres eliminalo","Sei sicuro di voler rimuovere","Você tem certeza que deseja remover","Sind Sie sich sicher, dass Sie das entfernen wollen"]
["Select the city to remove.","Seleccione la ciudad a quitar.","Sélectionnez la ville à supprimer.","Seleccioneu la ciutat a treure.","Hautatu kendu nahi duzun hiria.","Selecciona a cidade que queres eliminar.","Seleziona la città da rimuovere.","Selecione a cidade a ser removida.","Wählen Sie die zu entfernende Stadt aus."]