{"text_format":"1","workbook":"xlsx","n_sheets":5,"sheets":["Mundo","Relojes","Ciudades","Tiempos","Idiomas"],"not_rendered":{"charts":35,"images":6,"macros":1,"external_links":0,"defined_names":26,"comments":0,"pivot_tables":0},"unopened":[],"bounds":{"document_bytes":16777216,"sheet_cells":100000,"rows_first":2000,"rows_last":500,"rows_between":2000,"halvings":0,"cell_chars":16384,"cell_head_chars":4096},"cells_cut":0,"cells_raw":0,"read":"whole","date_system":"1900"}

{"sheet":"Mundo","index":0,"n_rows":41,"n_cols":32,"rows_kept":41,"cut":false,"hidden":false,"merged":[[2,29,3,29],[17,26,17,27],[18,26,18,27],[19,26,19,27],[20,26,20,27],[15,26,15,27],[16,26,16,27],[12,26,12,27],[13,26,13,27],[21,26,21,27],[1,26,1,27],[2,26,2,27],[5,28,6,28],[5,29,6,29],[8,26,8,27],[3,26,3,27],[4,26,4,27],[5,26,5,27],[6,26,6,27],[7,26,7,27],[11,26,11,27],[12,29,13,29],[12,28,13,28],[9,26,9,27],[14,26,14,27],[40,28,40,31],[27,28,27,31],[28,28,28,31],[30,28,30,31],[31,28,31,31],[32,28,32,31],[33,28,33,31],[35,28,35,31],[37,28,37,31],[38,28,38,31],[36,28,36,31],[5,31,6,31],[7,28,8,28],[7,29,8,29],[7,31,8,31],[10,26,10,27]]}
[]
[null,null,null,null,null,null,null,null,null,null,null,null,null,null,null,null,null,null,null,null,null,null,null,null,null,null,"Midway Atoll",null,null,{"$f":"miAhora","v":"2022-03-10T09:42:57"}]
[null,null,null,null,null,null,null,null,null,null,null,null,null,null,null,null,null,null,null,null,null,null,null,null,null,null,{"$f":"IF(miNuevaCiudad=\"\",\"Introduzca ciudad\",Ciudades!G2 & \" - \" & Ciudades!H2)","v":"Midway Atoll - United States"},null,null,{"$f":"miAhora","v":44630.404826388891}]
[null,null,null,null,null,null,null,null,null,null,null,null,null,null,null,null,null,null,null,null,null,null,null,null,null,null,{"$f":"IF(miNuevaCiudad=\"\",\"a geolocalizar\",Ciudades!G3 & \" - \" & Ciudades!H3)","v":"Midway Atoll - United States"}]
[null,null,null,null,null,null,null,null,null,null,null,null,null,null,null,null,null,null,null,null,null,null,null,null,null,null,{"$f":"IF(miNuevaCiudad=\"\",\"\",Ciudades!G4 & \" - \" & Ciudades!H4)","v":" - "}]
[null,"-11","-10","-9","-8","-7","-6","-5","-4","-3","-2","-1","0","+1","+2","+3","+4","+5","+6","+7","+8","+9","+10","+11","+12",null,{"$f":"IF(miNuevaCiudad=\"\",\"\",Ciudades!G5 & \" - \" & Ciudades!H5)","v":" - "},null,{"$f":"HYPERLINK(\"https://\" & VLOOKUP(Idiomas!$A$49,TablaIdiomas[],Total_Idiomas,FALSE) & \".wikipedia.org/wiki/\" & LEFT(miCiudad,IFERROR(FIND(\",\",miCiudad)-1,LEN(miCiudad))),VLOOKUP(Idiomas!$A$2,TablaIdiomas[],Total_Idiomas,FALSE))","v":"Ciudad"},"Zaragoza, Aragon",null,{"$f":"HYPERLINK(\"https://en.wikipedia.org/wiki/\" & LEFT(miCiudad,IFERROR(FIND(\",\",miCiudad)-1,LEN(miCiudad))),\"è\")","v":"è"}]
[null,null,null,null,null,null,null,null,null,null,null,null,null,null,null,null,null,null,null,null,null,null,null,null,null,null,{"$f":"IF(miNuevaCiudad=\"\",\"\",Ciudades!G6 & \" - \" & Ciudades!H6)","v":" - "}]
[null,null,null,null,null,null,null,null,null,null,null,null,null,null,null,null,null,null,null,null,null,null,null,null,null,null,{"$f":"IF(miNuevaCiudad=\"\",\"\",Ciudades!G7 & \" - \" & Ciudades!H7)","v":" - "},null,{"$f":"HYPERLINK(\"https://\" & VLOOKUP(Idiomas!$A$49,TablaIdiomas[],Total_Idiomas,FALSE) & \".wikipedia.org/wiki/\" & miPaís,VLOOKUP(Idiomas!$A$3,TablaIdiomas[],Total_Idiomas,FALSE))","v":"País"},"Spain",null,{"$f":"HYPERLINK(\"https://en.wikipedia.org/wiki/\" & miPaís,\"è\")","v":"è"}]
{"$rows_left_out":34}
{"sheet":"Relojes","index":1,"n_rows":36,"n_cols":24,"rows_kept":36,"cut":false,"hidden":false,"merged":[[0,23,1,23],[0,18,1,18],[0,15,1,15],[0,16,1,16],[0,17,1,17],[0,22,1,22],[0,21,1,21],[0,19,1,19],[0,20,1,20]]}
[44630.404826388891,{"$f":"A1","v":"2022-03-10T09:42:57"},44630.363159722219,{"$f":"VLOOKUP(Idiomas!$A$19,TablaIdiomas[],Total_Idiomas,FALSE)","v":"Saeta de las horas:"},null,null,0.6,{"$f":"VLOOKUP(Idiomas!$A$20,TablaIdiomas[],Total_Idiomas,FALSE)","v":"Saeta de las minutos:"},null,null,0.9,{"$f":"VLOOKUP(Idiomas!$A$21,TablaIdiomas[],Total_Idiomas,FALSE)","v":"Saeta de las segundos:"},null,null,1.1000000000000001,"Loc X","Loc Y",{"$f":"VLOOKUP(Idiomas!$A$22,TablaIdiomas[],Total_Idiomas,FALSE)","v":"Ciudades"},{"$f":"VLOOKUP(Idiomas!$A$23,TablaIdiomas[],Total_Idiomas,FALSE)","v":"Países"},{"$f":"VLOOKUP(Idiomas!$A$27,TablaIdiomas[],Total_Idiomas,FALSE)","v":"Latitud decimal"},{"$f":"VLOOKUP(Idiomas!$A$28,TablaIdiomas[],Total_Idiomas,FALSE)","v":"Longitud decimal"},{"$f":"VLOOKUP(Idiomas!$A$16,TablaIdiomas[],Total_Idiomas,FALSE)","v":"Hora"},{"$f":"VLOOKUP(Idiomas!$A$29,TablaIdiomas[],Total_Idiomas,FALSE)","v":"Minuto"},{"$f":"VLOOKUP(Idiomas!$A$22,TablaIdiomas[],Total_Idiomas,FALSE)","v":"Ciudades"}]
[{"$f":"VLOOKUP(Idiomas!$A$16,TablaIdiomas[],Total_Idiomas,FALSE)","v":"Hora"},{"$f":"VLOOKUP(Idiomas!$A$17,TablaIdiomas[],Total_Idiomas,FALSE)","v":"Fecha"},{"$f":"VLOOKUP(Idiomas!$A$18,TablaIdiomas[],Total_Idiomas,FALSE)","v":"Hora GMT"},"Pos X","X","Pos Y","Y","Pos X","X","Pos Y","Y","Pos X","X","Pos Y","Y"]
[{"$f":"$C$1+$C3/24","v":44629.904826388884},{"$f":"A3","v":"2022-03-09T21:42:57"},-11,0,{"$f":"$D3+$G$1*INDEX(Tiempos!$C$3:$C$146,$V3)","v":-0.56399999999999995},0,{"$f":"$F3+$G$1*INDEX(Tiempos!$D$3:$D$146,$V3)","v":0.20400000000000001},{"$f":"$D$3","v":0},{"$f":"$H3+$K$1*INDEX(Tiempos!$H$3:$H$242,$W3)","v":-0.873},{"$f":"$F$3","v":0},{"$f":"$J3+$K$1*INDEX(Tiempos!$I$3:$I$242,$W3)","v":-0.20700000000000002},{"$f":"$D$3","v":0},{"$f":"$L3+$O$1*INDEX(Tiempos!$M$3:$M$62,SECOND($A3)+1)","v":-0.34100000000000003},{"$f":"$F$3","v":0},{"$f":"$N3+$O$1*INDEX(Tiempos!$N$3:$N$62,SECOND($A3)+1)","v":1.0449999999999999},10.595435724999991,199.46643249777779,"Midway Atoll","USA",28.241753599999999,-177.3754308,{"$f":"MATCH(HOUR($A3)*100+MINUTE($A3),Tiempos!$A$3:$A$146)","v":131},{"$f":"MATCH(MINUTE($A3)*100+SECOND($A3),Tiempos!$F$3:$F$242)","v":172},{"$f":"misCiudadesOrdenadas","v":"Anchorage, Alaska"}]
[{"$f":"$C$1+$C4/24","v":44629.946493055555},{"$f":"A4","v":"2022-03-09T22:42:57"},-10,{"$f":"$D$3","v":0},{"$f":"$D4+$G$1*INDEX(Tiempos!$C$3:$C$146,$V4)","v":-0.38400000000000001},{"$f":"$F$3","v":0},{"$f":"$F4+$G$1*INDEX(Tiempos!$D$3:$D$146,$V4)","v":0.46199999999999997},{"$f":"$D$3","v":0},{"$f":"$H4+$K$1*INDEX(Tiempos!$H$3:$H$242,$W4)","v":-0.873},{"$f":"$F$3","v":0},{"$f":"$J4+$K$1*INDEX(Tiempos!$I$3:$I$242,$W4)","v":-0.20700000000000002},{"$f":"$D$3","v":0},{"$f":"M3","v":-0.34100000000000003},{"$f":"$F$3","v":0},{"$f":"O3","v":1.0449999999999999},52.210468527777799,214.4585067611111,"Honolulu, Honolulu County, Hawaii","USA",21.304546999999999,-157.85567599999999,{"$f":"MATCH(HOUR($A4)*100+MINUTE($A4),Tiempos!$A$3:$A$146)","v":137},{"$f":"MATCH(MINUTE($A4)*100+SECOND($A4),Tiempos!$F$3:$F$242)","v":172},"Bangkok"]
[{"$f":"$C$1+$C5/24","v":44629.988159722219},{"$f":"A5","v":"2022-03-09T23:42:57"},-9,{"$f":"$D$3","v":0},{"$f":"$D5+$G$1*INDEX(Tiempos!$C$3:$C$146,$V5)","v":-0.108},{"$f":"$F$3","v":0},{"$f":"$F5+$G$1*INDEX(Tiempos!$D$3:$D$146,$V5)","v":0.58799999999999997},{"$f":"$D$3","v":0},{"$f":"$H5+$K$1*INDEX(Tiempos!$H$3:$H$242,$W5)","v":-0.873},{"$f":"$F$3","v":0},{"$f":"$J5+$K$1*INDEX(Tiempos!$I$3:$I$242,$W5)","v":-0.20700000000000002},{"$f":"$D$3","v":0},{"$f":"M4","v":-0.34100000000000003},{"$f":"$F$3","v":0},{"$f":"O4","v":1.0449999999999999},70.854200534027783,128.29213010611113,"Anchorage, Alaska","USA",61.175878099999998,-149.11073329999999,{"$f":"MATCH(HOUR($A5)*100+MINUTE($A5),Tiempos!$A$3:$A$146)","v":143},{"$f":"MATCH(MINUTE($A5)*100+SECOND($A5),Tiempos!$F$3:$F$242)","v":172},"Bogota, Bogota Capital District - Department"]
[44630.029826388884,"2022-03-10T00:42:57",-8,0,{"$f":"$D6+$G$1*INDEX(Tiempos!$C$3:$C$146,$V6)","v":0.20400000000000001},0,{"$f":"$F6+$G$1*INDEX(Tiempos!$D$3:$D$146,$V6)","v":0.56399999999999995},0,{"$f":"$H6+$K$1*INDEX(Tiempos!$H$3:$H$242,$W6)","v":-0.873},0,{"$f":"$J6+$K$1*INDEX(Tiempos!$I$3:$I$242,$W6)","v":-0.20700000000000002},0,-0.34100000000000003,0,1.0449999999999999,143.25976102777778,182.3385414161111,"Las Vegas, Clark County, Nevada","USA",36.167255900000001,-115.148516,{"$f":"MATCH(HOUR($A6)*100+MINUTE($A6),Tiempos!$A$3:$A$146)","v":5},{"$f":"MATCH(MINUTE($A6)*100+SECOND($A6),Tiempos!$F$3:$F$242)","v":172},"Brisbane, Brisbane City, Queensland"]
[44630.071493055555,"2022-03-10T01:42:57",-7,0,{"$f":"$D7+$G$1*INDEX(Tiempos!$C$3:$C$146,$V7)","v":0.45599999999999996},0,{"$f":"$F7+$G$1*INDEX(Tiempos!$D$3:$D$146,$V7)","v":0.38400000000000001},0,{"$f":"$H7+$K$1*INDEX(Tiempos!$H$3:$H$242,$W7)","v":-0.873},0,{"$f":"$J7+$K$1*INDEX(Tiempos!$I$3:$I$242,$W7)","v":-0.20700000000000002},0,-0.34100000000000003,0,1.0449999999999999,144.90376947916667,125.529792265,"Yellowknife, North Slave Region, Northwest Territories","Canada",62.454080699999999,-114.377385,{"$f":"MATCH(HOUR($A7)*100+MINUTE($A7),Tiempos!$A$3:$A$146)","v":11},{"$f":"MATCH(MINUTE($A7)*100+SECOND($A7),Tiempos!$F$3:$F$242)","v":172},"Buenos Aires"]
[44630.113159722219,"2022-03-10T02:42:57",-6,0,{"$f":"$D8+$G$1*INDEX(Tiempos!$C$3:$C$146,$V8)","v":0.59399999999999997},0,{"$f":"$F8+$G$1*INDEX(Tiempos!$D$3:$D$146,$V8)","v":0.10200000000000001},0,{"$f":"$H8+$K$1*INDEX(Tiempos!$H$3:$H$242,$W8)","v":-0.873},0,{"$f":"$J8+$K$1*INDEX(Tiempos!$I$3:$I$242,$W8)","v":-0.20700000000000002},0,-0.34100000000000003,0,1.0449999999999999,177.36447830533203,218.74566452333335,"Mexico City","Mexico",19.3207722,-99.151515061994104,{"$f":"MATCH(HOUR($A8)*100+MINUTE($A8),Tiempos!$A$3:$A$146)","v":17},{"$f":"MATCH(MINUTE($A8)*100+SECOND($A8),Tiempos!$F$3:$F$242)","v":172},"Cairo"]
{"$rows_left_out":29}
{"sheet":"Ciudades","index":2,"n_rows":61,"n_cols":11,"rows_kept":61,"cut":false,"hidden":false,"merged":[]}
["<?xml version=\"1.0\" encoding=\"UTF-8\" ?>\n<searchresults timestamp='Fri, 25 Feb 22 08:42:02 +0000' attribution='Data © OpenStreetMap contributors, ODbL 1.0. http://www.openstreetmap.org/copyright' querystring='Midway Atoll' exclude_place_ids='3911214,285377706' more_url='https://nominatim.openstreetmap.org/search/?q=Midway+Atoll&amp;exclude_place_ids=3911214%2C285377706&amp;format=xml&amp;accept-language=es-ES%2Ces%3Bq%3D0.5'>\n<place place_id='3911214' osm_type='node' osm_id='522248134' place_rank='17' address_rank='0' boundingbox=\"27.9217536,28.5617536,-177.6954308,-177.0554308\" lat='28.2417536' lon='-177.3754308' display_name='Midway Atoll, United States' class='place' type='island' importance='0.525'/><place place_id='285377706' osm_type='relation' osm_id='8161698' place_rank='25' address_rank='0' boundingbox=\"27.9911406,28.4801332,-177.6505562,-177.0875122\" lat='28.23605105' lon='-177.36856316535344' display_name='Midway Atoll, United States' class='boundary' type='region' importance='0.325'/></searchresults>","lat=",{"$f":"IFERROR(FIND(B1,A1),\"\")","v":586},{"$f":"IFERROR(LEFT(A2,FIND(MiAcento,A2)-1),\"\")","v":"28.2417536"},"'","Nombre Aux","Región","País","Lat","Long","Aux"]
[{"$f":"IFERROR(MID(A1,C1+LEN(B1)+1,LEN(A1)-C1-LEN(B1)),\"\")","v":"28.2417536' lon='-177.3754308' display_name='Midway Atoll, United States' class='place' type='island' importance='0.525'/><place place_id='285377706' osm_type='relation' osm_id='8161698' place_rank='25' address_rank='0' boundingbox=\"27.9911406,28.4801332,-177.6505562,-177.0875122\" lat='28.23605105' lon='-177.36856316535344' display_name='Midway Atoll, United States' class='boundary' type='region' importance='0.325'/></searchresults>"},"lon=",{"$f":"IFERROR(FIND(B2,A2),\"\")","v":13},{"$f":"IFERROR(LEFT(A3,FIND(MiAcento,A3)-1),\"\")","v":"-177.3754308"},null,{"$f":"IFERROR(SUBSTITUTE(SUBSTITUTE(D3,\", \",\"|\",LEN(D3)-LEN(SUBSTITUTE(D3,\",\",\"\"))),miNuevaCiudad&\", \",\"\"),miNuevaCiudad)","v":"Midway Atoll|United States"},{"$f":"IFERROR(MID(TablaCiudades[[#This Row],[Aux]],FIND(\"¡\",TablaCiudades[[#This Row],[Aux]])+1,FIND(\"|\",TablaCiudades[[#This Row],[Aux]])-FIND(\"¡\",TablaCiudades[[#This Row],[Aux]])-1),TablaCiudades[[#This Row],[Nombre Aux]])","v":"Midway Atoll"},{"$f":"IFERROR(MID(TablaCiudades[[#This Row],[Nombre Aux]],FIND(\"|\",TablaCiudades[[#This Row],[Nombre Aux]])+1,100),TablaCiudades[[#This Row],[Nombre Aux]])","v":"United States"},{"$f":"IFERROR(--SUBSTITUTE(D1,\".\",\",\"),IFERROR(--D1,\"\"))","v":28.241753599999999},{"$f":"IFERROR(--SUBSTITUTE(D2,\".\",\",\"),IFERROR(--D2,\"\"))","v":-177.3754308},{"$f":"IFERROR(SUBSTITUTE(TablaCiudades[[#This Row],[Nombre Aux]],\", \",\"¡\",LEN(TablaCiudades[[#This Row],[Nombre Aux]])-LEN(SUBSTITUTE(TablaCiudades[[#This Row],[Nombre Aux]],\",\",\"\"))-1),\"¡\"&TablaCiudades[[#This Row],[Nombre Aux]])","v":"¡Midway Atoll|United States"}]
[{"$f":"IFERROR(MID(A2,C2+LEN(B2)+1,LEN(A2)-C2-LEN(B2)),\"\")","v":"-177.3754308' display_name='Midway Atoll, United States' class='place' type='island' importance='0.525'/><place place_id='285377706' osm_type='relation' osm_id='8161698' place_rank='25' address_rank='0' boundingbox=\"27.9911406,28.4801332,-177.6505562,-177.0875122\" lat='28.23605105' lon='-177.36856316535344' display_name='Midway Atoll, United States' class='boundary' type='region' importance='0.325'/></searchresults>"},"display_name=",15,{"$f":"IFERROR(LEFT(A4,FIND(MiAcento,A4)-1),\"\")","v":"Midway Atoll, United States"},null,{"$f":"IFERROR(SUBSTITUTE(SUBSTITUTE(D6,\", \",\"|\",LEN(D6)-LEN(SUBSTITUTE(D6,\",\",\"\"))),miNuevaCiudad&\", \",\"\"),\"\")","v":"Midway Atoll|United States"},{"$f":"IFERROR(MID(TablaCiudades[[#This Row],[Aux]],FIND(\"¡\",TablaCiudades[[#This Row],[Aux]])+1,FIND(\"|\",TablaCiudades[[#This Row],[Aux]])-FIND(\"¡\",TablaCiudades[[#This Row],[Aux]])-1),TablaCiudades[[#This Row],[Nombre Aux]])","v":"Midway Atoll"},{"$f":"IFERROR(MID(TablaCiudades[[#This Row],[Nombre Aux]],FIND(\"|\",TablaCiudades[[#This Row],[Nombre Aux]])+1,100),TablaCiudades[[#This Row],[Nombre Aux]])","v":"United States"},{"$f":"IFERROR(--SUBSTITUTE(D4,\".\",\",\"),IFERROR(--D4,\"\"))","v":28.23605105},{"$f":"IFERROR(--SUBSTITUTE(D5,\".\",\",\"),IFERROR(--D5,\"\"))","v":-177.36856316535301},{"$f":"IFERROR(SUBSTITUTE(TablaCiudades[[#This Row],[Nombre Aux]],\", \",\"¡\",LEN(TablaCiudades[[#This Row],[Nombre Aux]])-LEN(SUBSTITUTE(TablaCiudades[[#This Row],[Nombre Aux]],\",\",\"\"))-1),\"¡\"&TablaCiudades[[#This Row],[Nombre Aux]])","v":"¡Midway Atoll|United States"}]
["Midway Atoll, United States' class='place' type='island' importance='0.525'/><place place_id='285377706' osm_type='relation' osm_id='8161698' place_rank='25' address_rank='0' boundingbox=\"27.9911406,28.4801332,-177.6505562,-177.0875122\" lat='28.23605105' lon='-177.36856316535344' display_name='Midway Atoll, United States' class='boundary' type='region' importance='0.325'/></searchresults>","lat=",238,{"$f":"IFERROR(LEFT(A5,FIND(MiAcento,A5)-1),\"\")","v":"28.23605105"},null,{"$f":"IFERROR(SUBSTITUTE(SUBSTITUTE(D9,\", \",\"|\",LEN(D9)-LEN(SUBSTITUTE(D9,\",\",\"\"))),miNuevaCiudad&\", \",\"\"),\"\")","v":""},{"$f":"IFERROR(MID(TablaCiudades[[#This Row],[Aux]],FIND(\"¡\",TablaCiudades[[#This Row],[Aux]])+1,FIND(\"|\",TablaCiudades[[#This Row],[Aux]])-FIND(\"¡\",TablaCiudades[[#This Row],[Aux]])-1),TablaCiudades[[#This Row],[Nombre Aux]])","v":""},{"$f":"IFERROR(MID(TablaCiudades[[#This Row],[Nombre Aux]],FIND(\"|\",TablaCiudades[[#This Row],[Nombre Aux]])+1,100),TablaCiudades[[#This Row],[Nombre Aux]])","v":""},{"$f":"IFERROR(--SUBSTITUTE(D7,\".\",\",\"),IFERROR(--D7,\"\"))","v":""},{"$f":"IFERROR(--SUBSTITUTE(D8,\".\",\",\"),IFERROR(--D8,\"\"))","v":""},{"$f":"IFERROR(SUBSTITUTE(TablaCiudades[[#This Row],[Nombre Aux]],\", \",\"¡\",LEN(TablaCiudades[[#This Row],[Nombre Aux]])-LEN(SUBSTITUTE(TablaCiudades[[#This Row],[Nombre Aux]],\",\",\"\"))-1),\"¡\"&TablaCiudades[[#This Row],[Nombre Aux]])","v":"¡"}]
["28.23605105' lon='-177.36856316535344' display_name='Midway Atoll, United States' class='boundary' type='region' importance='0.325'/></searchresults>","lon=",14,{"$f":"IFERROR(LEFT(A6,FIND(MiAcento,A6)-1),\"\")","v":"-177.36856316535344"},null,{"$f":"IFERROR(SUBSTITUTE(SUBSTITUTE(D12,\", \",\"|\",LEN(D12)-LEN(SUBSTITUTE(D12,\",\",\"\"))),miNuevaCiudad&\", \",\"\"),\"\")","v":""},{"$f":"IFERROR(MID(TablaCiudades[[#This Row],[Aux]],FIND(\"¡\",TablaCiudades[[#This Row],[Aux]])+1,FIND(\"|\",TablaCiudades[[#This Row],[Aux]])-FIND(\"¡\",TablaCiudades[[#This Row],[Aux]])-1),TablaCiudades[[#This Row],[Nombre Aux]])","v":""},{"$f":"IFERROR(MID(TablaCiudades[[#This Row],[Nombre Aux]],FIND(\"|\",TablaCiudades[[#This Row],[Nombre Aux]])+1,100),TablaCiudades[[#This Row],[Nombre Aux]])","v":""},{"$f":"IFERROR(--SUBSTITUTE(D10,\".\",\",\"),IFERROR(--D10,\"\"))","v":""},{"$f":"IFERROR(--SUBSTITUTE(D11,\".\",\",\"),IFERROR(--D11,\"\"))","v":""},{"$f":"IFERROR(SUBSTITUTE(TablaCiudades[[#This Row],[Nombre Aux]],\", \",\"¡\",LEN(TablaCiudades[[#This Row],[Nombre Aux]])-LEN(SUBSTITUTE(TablaCiudades[[#This Row],[Nombre Aux]],\",\",\"\"))-1),\"¡\"&TablaCiudades[[#This Row],[Nombre Aux]])","v":"¡"}]
["-177.36856316535344' display_name='Midway Atoll, United States' class='boundary' type='region' importance='0.325'/></searchresults>","display_name=",22,{"$f":"IFERROR(LEFT(A7,FIND(MiAcento,A7)-1),\"\")","v":"Midway Atoll, United States"},null,{"$f":"IFERROR(SUBSTITUTE(SUBSTITUTE(D15,\", \",\"|\",LEN(D15)-LEN(SUBSTITUTE(D15,\",\",\"\"))),miNuevaCiudad&\", \",\"\"),\"\")","v":""},{"$f":"IFERROR(MID(TablaCiudades[[#This Row],[Aux]],FIND(\"¡\",TablaCiudades[[#This Row],[Aux]])+1,FIND(\"|\",TablaCiudades[[#This Row],[Aux]])-FIND(\"¡\",TablaCiudades[[#This Row],[Aux]])-1),TablaCiudades[[#This Row],[Nombre Aux]])","v":""},{"$f":"IFERROR(MID(TablaCiudades[[#This Row],[Nombre Aux]],FIND(\"|\",TablaCiudades[[#This Row],[Nombre Aux]])+1,100),TablaCiudades[[#This Row],[Nombre Aux]])","v":""},{"$f":"IFERROR(--SUBSTITUTE(D13,\".\",\",\"),IFERROR(--D13,\"\"))","v":""},{"$f":"IFERROR(--SUBSTITUTE(D14,\".\",\",\"),IFERROR(--D14,\"\"))","v":""},{"$f":"IFERROR(SUBSTITUTE(TablaCiudades[[#This Row],[Nombre Aux]],\", \",\"¡\",LEN(TablaCiudades[[#This Row],[Nombre Aux]])-LEN(SUBSTITUTE(TablaCiudades[[#This Row],[Nombre Aux]],\",\",\"\"))-1),\"¡\"&TablaCiudades[[#This Row],[Nombre Aux]])","v":"¡"}]
["Midway Atoll, United States' class='boundary' type='region' importance='0.325'/></searchresults>","lat=","",{"$f":"IFERROR(LEFT(A8,FIND(MiAcento,A8)-1),\"\")","v":""},null,{"$f":"IFERROR(SUBSTITUTE(SUBSTITUTE(D18,\", \",\"|\",LEN(D18)-LEN(SUBSTITUTE(D18,\",\",\"\"))),miNuevaCiudad&\", \",\"\"),\"\")","v":""},{"$f":"IFERROR(MID(TablaCiudades[[#This Row],[Aux]],FIND(\"¡\",TablaCiudades[[#This Row],[Aux]])+1,FIND(\"|\",TablaCiudades[[#This Row],[Aux]])-FIND(\"¡\",TablaCiudades[[#This Row],[Aux]])-1),TablaCiudades[[#This Row],[Nombre Aux]])","v":""},{"$f":"IFERROR(MID(TablaCiudades[[#This Row],[Nombre Aux]],FIND(\"|\",TablaCiudades[[#This Row],[Nombre Aux]])+1,100),TablaCiudades[[#This Row],[Nombre Aux]])","v":""},{"$f":"IFERROR(--SUBSTITUTE(D16,\".\",\",\"),IFERROR(--D16,\"\"))","v":""},{"$f":"IFERROR(--SUBSTITUTE(D17,\".\",\",\"),IFERROR(--D17,\"\"))","v":""},{"$f":"IFERROR(SUBSTITUTE(TablaCiudades[[#This Row],[Nombre Aux]],\", \",\"¡\",LEN(TablaCiudades[[#This Row],[Nombre Aux]])-LEN(SUBSTITUTE(TablaCiudades[[#This Row],[Nombre Aux]],\",\",\"\"))-1),\"¡\"&TablaCiudades[[#This Row],[Nombre Aux]])","v":"¡"}]
["","lon=","",{"$f":"IFERROR(LEFT(A9,FIND(MiAcento,A9)-1),\"\")","v":""},null,{"$f":"IFERROR(SUBSTITUTE(SUBSTITUTE(D21,\", \",\"|\",LEN(D21)-LEN(SUBSTITUTE(D21,\",\",\"\"))),miNuevaCiudad&\", \",\"\"),\"\")","v":""},{"$f":"IFERROR(MID(TablaCiudades[[#This Row],[Aux]],FIND(\"¡\",TablaCiudades[[#This Row],[Aux]])+1,FIND(\"|\",TablaCiudades[[#This Row],[Aux]])-FIND(\"¡\",TablaCiudades[[#This Row],[Aux]])-1),TablaCiudades[[#This Row],[Nombre Aux]])","v":""},{"$f":"IFERROR(MID(TablaCiudades[[#This Row],[Nombre Aux]],FIND(\"|\",TablaCiudades[[#This Row],[Nombre Aux]])+1,100),TablaCiudades[[#This Row],[Nombre Aux]])","v":""},{"$f":"IFERROR(--SUBSTITUTE(D19,\".\",\",\"),IFERROR(--D19,\"\"))","v":""},{"$f":"IFERROR(--SUBSTITUTE(D20,\".\",\",\"),IFERROR(--D20,\"\"))","v":""},{"$f":"IFERROR(SUBSTITUTE(TablaCiudades[[#This Row],[Nombre Aux]],\", \",\"¡\",LEN(TablaCiudades[[#This Row],[Nombre Aux]])-LEN(SUBSTITUTE(TablaCiudades[[#This Row],[Nombre Aux]],\",\",\"\"))-1),\"¡\"&TablaCiudades[[#This Row],[Nombre Aux]])","v":"¡"}]
{"$rows_left_out":54}
{"sheet":"Tiempos","index":3,"n_rows":242,"n_cols":14,"rows_kept":242,"cut":false,"hidden":false,"merged":[[0,0,1,0],[0,5,1,5],[0,10,1,10],[0,1,1,1],[0,6,1,6],[0,13,1,13],[0,11,1,11],[0,2,1,2],[0,3,1,3],[0,4,1,4],[0,9,1,9],[0,7,1,7],[0,8,1,8],[0,12,1,12]]}
[{"$f":"VLOOKUP(Idiomas!$A$33,TablaIdiomas[],Total_Idiomas,FALSE)","v":"Hora Minuto"},{"$f":"VLOOKUP(Idiomas!$A$34,TablaIdiomas[],Total_Idiomas,FALSE)","v":"Radianes Horas"},{"$f":"VLOOKUP(Idiomas!$A$35,TablaIdiomas[],Total_Idiomas,FALSE)","v":"Seno Horas"},{"$f":"VLOOKUP(Idiomas!$A$36,TablaIdiomas[],Total_Idiomas,FALSE)","v":"Coseno Horas"},{"$f":"VLOOKUP(Idiomas!$A$37,TablaIdiomas[],Total_Idiomas,FALSE)","v":"hh:mm"},{"$f":"VLOOKUP(Idiomas!$A$38,TablaIdiomas[],Total_Idiomas,FALSE)","v":"Minuto Segundo"},{"$f":"VLOOKUP(Idiomas!$A$39,TablaIdiomas[],Total_Idiomas,FALSE)","v":"Radianes Minutos"},{"$f":"VLOOKUP(Idiomas!$A$40,TablaIdiomas[],Total_Idiomas,FALSE)","v":"Seno Minutos"},{"$f":"VLOOKUP(Idiomas!$A$41,TablaIdiomas[],Total_Idiomas,FALSE)","v":"Coseno Minutos"},{"$f":"VLOOKUP(Idiomas!$A$42,TablaIdiomas[],Total_Idiomas,FALSE)","v":"mm:ss"},{"$f":"VLOOKUP(Idiomas!$A$43,TablaIdiomas[],Total_Idiomas,FALSE)","v":"Segundos"},{"$f":"VLOOKUP(Idiomas!$A$44,TablaIdiomas[],Total_Idiomas,FALSE)","v":"Radianes Segundos"},{"$f":"VLOOKUP(Idiomas!$A$45,TablaIdiomas[],Total_Idiomas,FALSE)","v":"Seno Segundos"},{"$f":"VLOOKUP(Idiomas!$A$46,TablaIdiomas[],Total_Idiomas,FALSE)","v":"Coseno Segundos"}]
[]
[{"$f":"HOUR($E3)*100+MINUTE($E3)","v":0},{"$f":"ROUND(RADIANS(30*INT($A3/100)+($A3-INT($A3/100)*100)/2),2)","v":0},{"$f":"ROUND(SIN($B3),2)","v":0},{"$f":"ROUND(COS($B3),2)","v":1},"00:00:00",{"$f":"MINUTE($J3)*100+SECOND($J3)","v":0},{"$f":"ROUND(RADIANS(6*INT($F3/100)+($F3-INT($F3/100)*100)/10),2)","v":0},{"$f":"ROUND(SIN($G3),2)","v":0},{"$f":"ROUND(COS($G3),2)","v":1},"00:00:00",0,{"$f":"ROUND(RADIANS(6*$K3),2)","v":0},{"$f":"ROUND(SIN($L3),2)","v":0},{"$f":"ROUND(COS($L3),2)","v":1}]
[{"$f":"HOUR($E4)*100+MINUTE($E4)","v":10},{"$f":"ROUND(RADIANS(30*INT($A4/100)+($A4-INT($A4/100)*100)/2),2)","v":0.09},{"$f":"ROUND(SIN($B4),2)","v":0.09},{"$f":"ROUND(COS($B4),2)","v":1},"00:10:00",{"$f":"MINUTE($J4)*100+SECOND($J4)","v":15},{"$f":"ROUND(RADIANS(6*INT($F4/100)+($F4-INT($F4/100)*100)/10),2)","v":0.03},{"$f":"ROUND(SIN($G4),2)","v":0.03},{"$f":"ROUND(COS($G4),2)","v":1},"00:00:15",1,{"$f":"ROUND(RADIANS(6*$K4),2)","v":0.1},{"$f":"ROUND(SIN($L4),2)","v":0.1},{"$f":"ROUND(COS($L4),2)","v":1}]
[20,0.17,0.17,0.99,"00:20:00",30,0.05,0.05,1,"00:00:30",2,0.21,0.21,0.98]
[30,0.26,0.26,0.97,"00:30:00",45,0.08,0.08,1,"00:00:45",3,0.31,0.31,0.95]
[40,0.35,0.34,0.94,"00:40:00",100,0.1,0.1,1,"00:01:00",4,0.42,0.41,0.91]
[50,0.44,0.43,0.9,"00:50:00",115,0.13,0.13,0.99,"00:01:15",5,0.52,0.5,0.87]
{"$rows_left_out":235}
{"sheet":"Idiomas","index":4,"n_rows":58,"n_cols":9,"rows_kept":58,"cut":false,"hidden":false,"merged":[]}
["English","Español","Français","Català","Euskara","Galego","Italiano","Português","Deutsche"]
["City","Ciudad","Ville","Ciutat","Hiria","Cidade","Città","Cidade","Stadt"]
["Country","País","Pays","País","Herrialdea","País","Nazione","País","Land"]
["GMT","GMT","GMT","GMT","GMT","GMT","GMT","GMT","GMT"]
["Clock #","Reloj Nº","L'horloge #","Rellotge #","Erlojua #","Reloxo #","Orologio #","Relógio #","Uhr #"]
["Language","Idioma","Langue","Llenguatge","Hizkuntza","Lingua","Lingua","Língua","Sprache"]
["WORLD CLOCKS Version 3.6","RELOJES MUNDIALES Versión 3.6","HORLOGES DU MONDE Version 3.6","RELLOTGES MUNDIALS Versió 3.6","MUNDUKO ERLOUAK 3.6 bertsioa","RELOXOS MUNDIAIS Versión 3.6","OROLOGI MONDIALI Versione 3.6","RELÓGIOS MUNDIAIS versão 3.6","WELTUHREN Version 3.6"]
["Author","Autor","Auteur","Autor","Egilea","Autor","Autore","Autor","Autor"]
{"$rows_left_out":50}