{"text_format":"1","workbook":"xlsx","n_sheets":5,"sheets":["Requisitos","CAPACIDADES","TURNOS","FEBRERO","03-21"],"not_rendered":{"charts":0,"images":1,"macros":1,"external_links":0,"defined_names":67,"comments":0,"pivot_tables":0},"unopened":[],"bounds":{"document_bytes":16777216,"sheet_cells":100000,"rows_first":2000,"rows_last":500,"rows_between":2000,"halvings":0,"cell_chars":16384,"cell_head_chars":4096},"cells_cut":0,"cells_raw":0,"read":"whole","date_system":"1900"}

{"sheet":"Requisitos","index":0,"n_rows":31,"n_cols":2,"rows_kept":31,"cut":false,"hidden":false,"merged":[]}
[]
[null,"Urgencias hospital-Rotación puestos trabajo a turnos y con limitaciones"]
[null,"https://foro.todoexcel.com/threads/urgencias-hospital-rotaci%C3%B3n-puestos-trabajo-a-turnos-y-con-limitaciones.56117/"]
[null,"Toyce"]
[null,"2021-02-12"]
[]
[null,"Hola a todos. Soy nueva por aquí y os agradecería vuestra ayuda."]
[null,"Os explico."]
{"$rows_left_out":24}
{"sheet":"CAPACIDADES","index":1,"n_rows":106,"n_cols":10,"rows_kept":106,"cut":false,"hidden":false,"merged":[[1,3,1,9]]}
[]
[null,null,null,"CAPACIDADES"]
[null,"NOMBRE","PERSONAL","OBSERVACIÓN","OPCION OBS","REANIMACIÓN","CA","CB","SP","RESPIRATORIO"]
[null,"N1","F1","x","x","x","x","x","x","x"]
[null,"N2","F2",null,"x",null,"x","x","x","x"]
[null,"N3","F3","x"]
[null,"N4","F4","x","x","x","x","x","x","x"]
[null,"N5","F5",null,"x","x","x","x","x","x"]
{"$rows_left_out":99}
{"sheet":"TURNOS","index":2,"n_rows":81,"n_cols":20,"rows_kept":81,"cut":false,"hidden":false,"merged":[[1,3,1,9],[1,11,1,13]]}
[null,null,null,{"$f":"MATCH(D3,TABLA_CAPACIDADES[[#Headers],[OBSERVACIÓN]:[RESPIRATORIO]],0)","v":1},{"$f":"MATCH(E3,TABLA_CAPACIDADES[[#Headers],[OBSERVACIÓN]:[RESPIRATORIO]],0)","v":2},{"$f":"MATCH(F3,TABLA_CAPACIDADES[[#Headers],[OBSERVACIÓN]:[RESPIRATORIO]],0)","v":3},{"$f":"MATCH(G3,TABLA_CAPACIDADES[[#Headers],[OBSERVACIÓN]:[RESPIRATORIO]],0)","v":4},{"$f":"MATCH(H3,TABLA_CAPACIDADES[[#Headers],[OBSERVACIÓN]:[RESPIRATORIO]],0)","v":5},{"$f":"MATCH(I3,TABLA_CAPACIDADES[[#Headers],[OBSERVACIÓN]:[RESPIRATORIO]],0)","v":6},{"$f":"MATCH(J3,TABLA_CAPACIDADES[[#Headers],[OBSERVACIÓN]:[RESPIRATORIO]],0)","v":7}]
[null,null,null,"CAPACIDADES",null,null,null,null,null,null,null,"TURNOS"]
[null,"FILA","PERSONAL","OBSERVACIÓN","OPCION OBS","REANIMACIÓN","CA","CB","SP","RESPIRATORIO","DE SERVICIO","Mañanas","Tardes","Noches","Total","TURNO","Capacidad",null,2021,"2021-03-01"]
[null,{"$f":"MATCH(TABLA_TURNOS[[#This Row],[PERSONAL]],Capacidades_Personal,0)","v":1},"F1",{"$f":"INDEX(Capacidades_Tabla,$B4,D$1) & \"\"","v":"x"},{"$f":"IF(TABLA_TURNOS[[#This Row],[OBSERVACIÓN]]=\"x\",\"\",INDEX(Capacidades_Tabla,$B4,E$1) & \"\")","v":""},"x",{"$f":"IF(TABLA_TURNOS[[#This Row],[OBSERVACIÓN]]=\"x\",\"\",\"x\")","v":""},{"$f":"IF(TABLA_TURNOS[[#This Row],[OBSERVACIÓN]]=\"x\",\"\",\"x\")","v":""},{"$f":"IF(TABLA_TURNOS[[#This Row],[OBSERVACIÓN]]=\"x\",\"\",\"x\")","v":""},"x",1,0,0,0,{"$f":"IF(TABLA_TURNOS[[#This Row],[DE SERVICIO]]=1,SUM(TABLA_TURNOS[[#This Row],[Mañanas]:[Noches]]),0)","v":0},{"$f":"IF(TABLA_TURNOS[[#This Row],[Mañanas]]=1,\"M\",IF(TABLA_TURNOS[[#This Row],[Tardes]]=1,\"T\",IF(TABLA_TURNOS[[#This Row],[Noches]]=1,\"N\",\"\")))","v":""},null,null,2021,"2021-01-01"]
[null,{"$f":"MATCH(TABLA_TURNOS[[#This Row],[PERSONAL]],Capacidades_Personal,0)","v":2},"F2","",{"$f":"IF(TABLA_TURNOS[[#This Row],[OBSERVACIÓN]]=\"x\",\"\",INDEX(Capacidades_Tabla,$B5,E$1) & \"\")","v":"x"},"",{"$f":"IF(TABLA_TURNOS[[#This Row],[OBSERVACIÓN]]=\"x\",\"\",\"x\")","v":"x"},{"$f":"IF(TABLA_TURNOS[[#This Row],[OBSERVACIÓN]]=\"x\",\"\",\"x\")","v":"x"},{"$f":"IF(TABLA_TURNOS[[#This Row],[OBSERVACIÓN]]=\"x\",\"\",\"x\")","v":"x"},"x",1,0,0,0,{"$f":"IF(TABLA_TURNOS[[#This Row],[DE SERVICIO]]=1,SUM(TABLA_TURNOS[[#This Row],[Mañanas]:[Noches]]),0)","v":0},{"$f":"IF(TABLA_TURNOS[[#This Row],[Mañanas]]=1,\"M\",IF(TABLA_TURNOS[[#This Row],[Tardes]]=1,\"T\",IF(TABLA_TURNOS[[#This Row],[Noches]]=1,\"N\",\"\")))","v":""},null,null,2022,"2021-02-01"]
[null,{"$f":"MATCH(TABLA_TURNOS[[#This Row],[PERSONAL]],Capacidades_Personal,0)","v":3},"F3","x",{"$f":"IF(TABLA_TURNOS[[#This Row],[OBSERVACIÓN]]=\"x\",\"\",INDEX(Capacidades_Tabla,$B6,E$1) & \"\")","v":""},"",{"$f":"IF(TABLA_TURNOS[[#This Row],[OBSERVACIÓN]]=\"x\",\"\",\"x\")","v":""},{"$f":"IF(TABLA_TURNOS[[#This Row],[OBSERVACIÓN]]=\"x\",\"\",\"x\")","v":""},{"$f":"IF(TABLA_TURNOS[[#This Row],[OBSERVACIÓN]]=\"x\",\"\",\"x\")","v":""},"",1,0,0,0,{"$f":"IF(TABLA_TURNOS[[#This Row],[DE SERVICIO]]=1,SUM(TABLA_TURNOS[[#This Row],[Mañanas]:[Noches]]),0)","v":0},{"$f":"IF(TABLA_TURNOS[[#This Row],[Mañanas]]=1,\"M\",IF(TABLA_TURNOS[[#This Row],[Tardes]]=1,\"T\",IF(TABLA_TURNOS[[#This Row],[Noches]]=1,\"N\",\"\")))","v":""},null,null,2023,"2021-03-01"]
[null,{"$f":"MATCH(TABLA_TURNOS[[#This Row],[PERSONAL]],Capacidades_Personal,0)","v":4},"F4","x",{"$f":"IF(TABLA_TURNOS[[#This Row],[OBSERVACIÓN]]=\"x\",\"\",INDEX(Capacidades_Tabla,$B7,E$1) & \"\")","v":""},"x",{"$f":"IF(TABLA_TURNOS[[#This Row],[OBSERVACIÓN]]=\"x\",\"\",\"x\")","v":""},{"$f":"IF(TABLA_TURNOS[[#This Row],[OBSERVACIÓN]]=\"x\",\"\",\"x\")","v":""},{"$f":"IF(TABLA_TURNOS[[#This Row],[OBSERVACIÓN]]=\"x\",\"\",\"x\")","v":""},"x",1,0,0,0,{"$f":"IF(TABLA_TURNOS[[#This Row],[DE SERVICIO]]=1,SUM(TABLA_TURNOS[[#This Row],[Mañanas]:[Noches]]),0)","v":0},{"$f":"IF(TABLA_TURNOS[[#This Row],[Mañanas]]=1,\"M\",IF(TABLA_TURNOS[[#This Row],[Tardes]]=1,\"T\",IF(TABLA_TURNOS[[#This Row],[Noches]]=1,\"N\",\"\")))","v":""},null,null,2024,"2021-04-01"]
[null,{"$f":"MATCH(TABLA_TURNOS[[#This Row],[PERSONAL]],Capacidades_Personal,0)","v":5},"F5","",{"$f":"IF(TABLA_TURNOS[[#This Row],[OBSERVACIÓN]]=\"x\",\"\",INDEX(Capacidades_Tabla,$B8,E$1) & \"\")","v":"x"},"x",{"$f":"IF(TABLA_TURNOS[[#This Row],[OBSERVACIÓN]]=\"x\",\"\",\"x\")","v":"x"},{"$f":"IF(TABLA_TURNOS[[#This Row],[OBSERVACIÓN]]=\"x\",\"\",\"x\")","v":"x"},{"$f":"IF(TABLA_TURNOS[[#This Row],[OBSERVACIÓN]]=\"x\",\"\",\"x\")","v":"x"},"x",1,0,0,0,{"$f":"IF(TABLA_TURNOS[[#This Row],[DE SERVICIO]]=1,SUM(TABLA_TURNOS[[#This Row],[Mañanas]:[Noches]]),0)","v":0},{"$f":"IF(TABLA_TURNOS[[#This Row],[Mañanas]]=1,\"M\",IF(TABLA_TURNOS[[#This Row],[Tardes]]=1,\"T\",IF(TABLA_TURNOS[[#This Row],[Noches]]=1,\"N\",\"\")))","v":""},null,null,2025,"2021-05-01"]
{"$rows_left_out":74}
{"sheet":"FEBRERO","index":3,"n_rows":112,"n_cols":32,"rows_kept":112,"cut":false,"hidden":false,"merged":[[0,2,0,29],[86,2,86,29]]}
[null,null,"FEBRERO"]
["NOMBRE","PERSONAL","L","MA","X","J","V","S","D","L","MA","X","J","V","S","D","L","MA","X","J","V","S","D","L","MA","X","J","V","S","D"]
[null,null,1,2,3,4,5,6,7,8,9,10,11,12,13,14,15,16,17,18,19,20,21,22,23,24,25,26,27,28]
[{"$f":"INDEX(CAPACIDADES!B:B,MATCH(FEBRERO!B4,CAPACIDADES!C:C,0))","v":"N1"},"F1"," "," ","M","M","T.","T.","N."," "," ","T"," ","M"," "," ","NV"," "," ","N"," "," ","T","T.","T"," "," "," ","M","M",null,{"$f":"IF(LEFT(B4)=\"F\",COUNTIF(C4:AD4,\"M*\")+COUNTIF(C4:AD4,\"T*\")+COUNTIF(C4:AD4,\"N*\"),\"\")","v":14}]
[{"$f":"INDEX(CAPACIDADES!B:B,MATCH(FEBRERO!B5,CAPACIDADES!C:C,0))","v":{"$error":"#N/A"}},"R",null,null,null,null,"T","T","N",null,null,null,null,null,null,null,null,null,null,null,null,null,null,"T",null,null,null,null,null,null,null,{"$f":"IF(LEFT(B5)=\"F\",COUNTIF(C5:AD5,\"M*\")+COUNTIF(C5:AD5,\"T*\")+COUNTIF(C5:AD5,\"N*\"),\"\")","v":""}]
[{"$f":"INDEX(CAPACIDADES!B:B,MATCH(FEBRERO!B6,CAPACIDADES!C:C,0))","v":"N2"},"F2"," "," ","T"," ","M"," "," ","N"," "," ","N"," "," ","T","T","T"," "," "," ","M","M","T","T","N"," "," "," "," ",null,12]
[{"$f":"INDEX(CAPACIDADES!B:B,MATCH(FEBRERO!B7,CAPACIDADES!C:C,0))","v":"N3"},"F3","N."," "," ","N."," "," ","T","T","T"," "," "," ","M","M","T","T","N."," "," "," "," ","M","T","T","N."," "," "," ",null,14]
[{"$f":"INDEX(CAPACIDADES!B:B,MATCH(FEBRERO!B8,CAPACIDADES!C:C,0))","v":{"$error":"#N/A"}},"R","NC",null,null,"N",null,null,null,null,null,null,null,null,null,null,"N",null,"N",null,null,null,null,null,null,null,"NC",null,null,null,null,""]
{"$rows_left_out":105}
{"sheet":"03-21","index":4,"n_rows":64,"n_cols":35,"rows_kept":64,"cut":false,"hidden":false,"merged":[]}
[]
[null,null,{"$f":"DATEVALUE(Nombre_Hoja)","v":"2021-03-01"},null,{"$f":"C2","v":"2021-03-01"},{"$f":"E2+1","v":"2021-03-02"},{"$f":"F2+1","v":"2021-03-03"},"2021-03-04","2021-03-05","2021-03-06","2021-03-07","2021-03-08","2021-03-09","2021-03-10","2021-03-11","2021-03-12","2021-03-13","2021-03-14","2021-03-15","2021-03-16","2021-03-17","2021-03-18","2021-03-19","2021-03-20","2021-03-21","2021-03-22","2021-03-23","2021-03-24","2021-03-25","2021-03-26","2021-03-27","2021-03-28","2021-03-29","2021-03-30","2021-03-31"]
[null,"FILA","NOMBRE","PERSONAL","1","2","3","4","5","6","7","8","9","10","11","12","13","14","15","16","17","18","19","20","21","22","23","24","25","26","27","28","29","30","31"]
[null,{"$f":"MATCH(TURNOS_2021_03[[#This Row],[PERSONAL]],Turnos_Personal,0)","v":1},{"$f":"INDEX(Capacidades_Nombre,MATCH(TURNOS_2021_03[[#This Row],[PERSONAL]],Capacidades_Personal,0),1) & \"\"","v":"N1"},"F1",{"$f":"INDEX(Turnos_Turno,TURNOS_2021_03[[#This Row],[FILA]],1)","v":""},{"$f":"INDEX(Turnos_Turno,TURNOS_2021_03[[#This Row],[FILA]],1)","v":""},{"$f":"INDEX(Turnos_Turno,TURNOS_2021_03[[#This Row],[FILA]],1)","v":""},{"$f":"INDEX(Turnos_Turno,TURNOS_2021_03[[#This Row],[FILA]],1)","v":""},{"$f":"INDEX(Turnos_Turno,TURNOS_2021_03[[#This Row],[FILA]],1)","v":""},{"$f":"INDEX(Turnos_Turno,TURNOS_2021_03[[#This Row],[FILA]],1)","v":""},{"$f":"INDEX(Turnos_Turno,TURNOS_2021_03[[#This Row],[FILA]],1)","v":""},{"$f":"INDEX(Turnos_Turno,TURNOS_2021_03[[#This Row],[FILA]],1)","v":""},{"$f":"INDEX(Turnos_Turno,TURNOS_2021_03[[#This Row],[FILA]],1)","v":""},{"$f":"INDEX(Turnos_Turno,TURNOS_2021_03[[#This Row],[FILA]],1)","v":""},{"$f":"INDEX(Turnos_Turno,TURNOS_2021_03[[#This Row],[FILA]],1)","v":""},{"$f":"INDEX(Turnos_Turno,TURNOS_2021_03[[#This Row],[FILA]],1)","v":""},{"$f":"INDEX(Turnos_Turno,TURNOS_2021_03[[#This Row],[FILA]],1)","v":""},{"$f":"INDEX(Turnos_Turno,TURNOS_2021_03[[#This Row],[FILA]],1)","v":""},{"$f":"INDEX(Turnos_Turno,TURNOS_2021_03[[#This Row],[FILA]],1)","v":""},{"$f":"INDEX(Turnos_Turno,TURNOS_2021_03[[#This Row],[FILA]],1)","v":""},{"$f":"INDEX(Turnos_Turno,TURNOS_2021_03[[#This Row],[FILA]],1)","v":""},{"$f":"INDEX(Turnos_Turno,TURNOS_2021_03[[#This Row],[FILA]],1)","v":""},{"$f":"INDEX(Turnos_Turno,TURNOS_2021_03[[#This Row],[FILA]],1)","v":""},{"$f":"INDEX(Turnos_Turno,TURNOS_2021_03[[#This Row],[FILA]],1)","v":""},{"$f":"INDEX(Turnos_Turno,TURNOS_2021_03[[#This Row],[FILA]],1)","v":""},{"$f":"INDEX(Turnos_Turno,TURNOS_2021_03[[#This Row],[FILA]],1)","v":""},{"$f":"INDEX(Turnos_Turno,TURNOS_2021_03[[#This Row],[FILA]],1)","v":""},{"$f":"INDEX(Turnos_Turno,TURNOS_2021_03[[#This Row],[FILA]],1)","v":""},{"$f":"INDEX(Turnos_Turno,TURNOS_2021_03[[#This Row],[FILA]],1)","v":""},{"$f":"INDEX(Turnos_Turno,TURNOS_2021_03[[#This Row],[FILA]],1)","v":""},{"$f":"INDEX(Turnos_Turno,TURNOS_2021_03[[#This Row],[FILA]],1)","v":""},{"$f":"INDEX(Turnos_Turno,TURNOS_2021_03[[#This Row],[FILA]],1)","v":""},{"$f":"INDEX(Turnos_Turno,TURNOS_2021_03[[#This Row],[FILA]],1)","v":""},{"$f":"INDEX(Turnos_Turno,TURNOS_2021_03[[#This Row],[FILA]],1)","v":""},{"$f":"INDEX(Turnos_Turno,TURNOS_2021_03[[#This Row],[FILA]],1)","v":""}]
[null,{"$f":"MATCH(TURNOS_2021_03[[#This Row],[PERSONAL]],Turnos_Personal,0)","v":2},{"$f":"INDEX(Capacidades_Nombre,MATCH(TURNOS_2021_03[[#This Row],[PERSONAL]],Capacidades_Personal,0),1) & \"\"","v":"N2"},"F2",{"$f":"INDEX(Turnos_Turno,TURNOS_2021_03[[#This Row],[FILA]],1)","v":""},{"$f":"INDEX(Turnos_Turno,TURNOS_2021_03[[#This Row],[FILA]],1)","v":""},{"$f":"INDEX(Turnos_Turno,TURNOS_2021_03[[#This Row],[FILA]],1)","v":""},{"$f":"INDEX(Turnos_Turno,TURNOS_2021_03[[#This Row],[FILA]],1)","v":""},{"$f":"INDEX(Turnos_Turno,TURNOS_2021_03[[#This Row],[FILA]],1)","v":""},{"$f":"INDEX(Turnos_Turno,TURNOS_2021_03[[#This Row],[FILA]],1)","v":""},{"$f":"INDEX(Turnos_Turno,TURNOS_2021_03[[#This Row],[FILA]],1)","v":""},{"$f":"INDEX(Turnos_Turno,TURNOS_2021_03[[#This Row],[FILA]],1)","v":""},{"$f":"INDEX(Turnos_Turno,TURNOS_2021_03[[#This Row],[FILA]],1)","v":""},{"$f":"INDEX(Turnos_Turno,TURNOS_2021_03[[#This Row],[FILA]],1)","v":""},{"$f":"INDEX(Turnos_Turno,TURNOS_2021_03[[#This Row],[FILA]],1)","v":""},{"$f":"INDEX(Turnos_Turno,TURNOS_2021_03[[#This Row],[FILA]],1)","v":""},{"$f":"INDEX(Turnos_Turno,TURNOS_2021_03[[#This Row],[FILA]],1)","v":""},{"$f":"INDEX(Turnos_Turno,TURNOS_2021_03[[#This Row],[FILA]],1)","v":""},{"$f":"INDEX(Turnos_Turno,TURNOS_2021_03[[#This Row],[FILA]],1)","v":""},{"$f":"INDEX(Turnos_Turno,TURNOS_2021_03[[#This Row],[FILA]],1)","v":""},{"$f":"INDEX(Turnos_Turno,TURNOS_2021_03[[#This Row],[FILA]],1)","v":""},{"$f":"INDEX(Turnos_Turno,TURNOS_2021_03[[#This Row],[FILA]],1)","v":""},{"$f":"INDEX(Turnos_Turno,TURNOS_2021_03[[#This Row],[FILA]],1)","v":""},{"$f":"INDEX(Turnos_Turno,TURNOS_2021_03[[#This Row],[FILA]],1)","v":""},{"$f":"INDEX(Turnos_Turno,TURNOS_2021_03[[#This Row],[FILA]],1)","v":""},{"$f":"INDEX(Turnos_Turno,TURNOS_2021_03[[#This Row],[FILA]],1)","v":""},{"$f":"INDEX(Turnos_Turno,TURNOS_2021_03[[#This Row],[FILA]],1)","v":""},{"$f":"INDEX(Turnos_Turno,TURNOS_2021_03[[#This Row],[FILA]],1)","v":""},{"$f":"INDEX(Turnos_Turno,TURNOS_2021_03[[#This Row],[FILA]],1)","v":""},{"$f":"INDEX(Turnos_Turno,TURNOS_2021_03[[#This Row],[FILA]],1)","v":""},{"$f":"INDEX(Turnos_Turno,TURNOS_2021_03[[#This Row],[FILA]],1)","v":""},{"$f":"INDEX(Turnos_Turno,TURNOS_2021_03[[#This Row],[FILA]],1)","v":""},{"$f":"INDEX(Turnos_Turno,TURNOS_2021_03[[#This Row],[FILA]],1)","v":""},{"$f":"INDEX(Turnos_Turno,TURNOS_2021_03[[#This Row],[FILA]],1)","v":""},{"$f":"INDEX(Turnos_Turno,TURNOS_2021_03[[#This Row],[FILA]],1)","v":""}]
[null,{"$f":"MATCH(TURNOS_2021_03[[#This Row],[PERSONAL]],Turnos_Personal,0)","v":3},{"$f":"INDEX(Capacidades_Nombre,MATCH(TURNOS_2021_03[[#This Row],[PERSONAL]],Capacidades_Personal,0),1) & \"\"","v":"N3"},"F3",{"$f":"INDEX(Turnos_Turno,TURNOS_2021_03[[#This Row],[FILA]],1)","v":""},{"$f":"INDEX(Turnos_Turno,TURNOS_2021_03[[#This Row],[FILA]],1)","v":""},{"$f":"INDEX(Turnos_Turno,TURNOS_2021_03[[#This Row],[FILA]],1)","v":""},{"$f":"INDEX(Turnos_Turno,TURNOS_2021_03[[#This Row],[FILA]],1)","v":""},{"$f":"INDEX(Turnos_Turno,TURNOS_2021_03[[#This Row],[FILA]],1)","v":""},{"$f":"INDEX(Turnos_Turno,TURNOS_2021_03[[#This Row],[FILA]],1)","v":""},{"$f":"INDEX(Turnos_Turno,TURNOS_2021_03[[#This Row],[FILA]],1)","v":""},{"$f":"INDEX(Turnos_Turno,TURNOS_2021_03[[#This Row],[FILA]],1)","v":""},{"$f":"INDEX(Turnos_Turno,TURNOS_2021_03[[#This Row],[FILA]],1)","v":""},{"$f":"INDEX(Turnos_Turno,TURNOS_2021_03[[#This Row],[FILA]],1)","v":""},{"$f":"INDEX(Turnos_Turno,TURNOS_2021_03[[#This Row],[FILA]],1)","v":""},{"$f":"INDEX(Turnos_Turno,TURNOS_2021_03[[#This Row],[FILA]],1)","v":""},{"$f":"INDEX(Turnos_Turno,TURNOS_2021_03[[#This Row],[FILA]],1)","v":""},{"$f":"INDEX(Turnos_Turno,TURNOS_2021_03[[#This Row],[FILA]],1)","v":""},{"$f":"INDEX(Turnos_Turno,TURNOS_2021_03[[#This Row],[FILA]],1)","v":""},{"$f":"INDEX(Turnos_Turno,TURNOS_2021_03[[#This Row],[FILA]],1)","v":""},{"$f":"INDEX(Turnos_Turno,TURNOS_2021_03[[#This Row],[FILA]],1)","v":""},{"$f":"INDEX(Turnos_Turno,TURNOS_2021_03[[#This Row],[FILA]],1)","v":""},{"$f":"INDEX(Turnos_Turno,TURNOS_2021_03[[#This Row],[FILA]],1)","v":""},{"$f":"INDEX(Turnos_Turno,TURNOS_2021_03[[#This Row],[FILA]],1)","v":""},{"$f":"INDEX(Turnos_Turno,TURNOS_2021_03[[#This Row],[FILA]],1)","v":""},{"$f":"INDEX(Turnos_Turno,TURNOS_2021_03[[#This Row],[FILA]],1)","v":""},{"$f":"INDEX(Turnos_Turno,TURNOS_2021_03[[#This Row],[FILA]],1)","v":""},{"$f":"INDEX(Turnos_Turno,TURNOS_2021_03[[#This Row],[FILA]],1)","v":""},{"$f":"INDEX(Turnos_Turno,TURNOS_2021_03[[#This Row],[FILA]],1)","v":""},{"$f":"INDEX(Turnos_Turno,TURNOS_2021_03[[#This Row],[FILA]],1)","v":""},{"$f":"INDEX(Turnos_Turno,TURNOS_2021_03[[#This Row],[FILA]],1)","v":""},{"$f":"INDEX(Turnos_Turno,TURNOS_2021_03[[#This Row],[FILA]],1)","v":""},{"$f":"INDEX(Turnos_Turno,TURNOS_2021_03[[#This Row],[FILA]],1)","v":""},{"$f":"INDEX(Turnos_Turno,TURNOS_2021_03[[#This Row],[FILA]],1)","v":""},{"$f":"INDEX(Turnos_Turno,TURNOS_2021_03[[#This Row],[FILA]],1)","v":""}]
[null,{"$f":"MATCH(TURNOS_2021_03[[#This Row],[PERSONAL]],Turnos_Personal,0)","v":4},{"$f":"INDEX(Capacidades_Nombre,MATCH(TURNOS_2021_03[[#This Row],[PERSONAL]],Capacidades_Personal,0),1) & \"\"","v":"N4"},"F4",{"$f":"INDEX(Turnos_Turno,TURNOS_2021_03[[#This Row],[FILA]],1)","v":""},{"$f":"INDEX(Turnos_Turno,TURNOS_2021_03[[#This Row],[FILA]],1)","v":""},{"$f":"INDEX(Turnos_Turno,TURNOS_2021_03[[#This Row],[FILA]],1)","v":""},{"$f":"INDEX(Turnos_Turno,TURNOS_2021_03[[#This Row],[FILA]],1)","v":""},{"$f":"INDEX(Turnos_Turno,TURNOS_2021_03[[#This Row],[FILA]],1)","v":""},{"$f":"INDEX(Turnos_Turno,TURNOS_2021_03[[#This Row],[FILA]],1)","v":""},{"$f":"INDEX(Turnos_Turno,TURNOS_2021_03[[#This Row],[FILA]],1)","v":""},{"$f":"INDEX(Turnos_Turno,TURNOS_2021_03[[#This Row],[FILA]],1)","v":""},{"$f":"INDEX(Turnos_Turno,TURNOS_2021_03[[#This Row],[FILA]],1)","v":""},{"$f":"INDEX(Turnos_Turno,TURNOS_2021_03[[#This Row],[FILA]],1)","v":""},{"$f":"INDEX(Turnos_Turno,TURNOS_2021_03[[#This Row],[FILA]],1)","v":""},{"$f":"INDEX(Turnos_Turno,TURNOS_2021_03[[#This Row],[FILA]],1)","v":""},{"$f":"INDEX(Turnos_Turno,TURNOS_2021_03[[#This Row],[FILA]],1)","v":""},{"$f":"INDEX(Turnos_Turno,TURNOS_2021_03[[#This Row],[FILA]],1)","v":""},{"$f":"INDEX(Turnos_Turno,TURNOS_2021_03[[#This Row],[FILA]],1)","v":""},{"$f":"INDEX(Turnos_Turno,TURNOS_2021_03[[#This Row],[FILA]],1)","v":""},{"$f":"INDEX(Turnos_Turno,TURNOS_2021_03[[#This Row],[FILA]],1)","v":""},{"$f":"INDEX(Turnos_Turno,TURNOS_2021_03[[#This Row],[FILA]],1)","v":""},{"$f":"INDEX(Turnos_Turno,TURNOS_2021_03[[#This Row],[FILA]],1)","v":""},{"$f":"INDEX(Turnos_Turno,TURNOS_2021_03[[#This Row],[FILA]],1)","v":""},{"$f":"INDEX(Turnos_Turno,TURNOS_2021_03[[#This Row],[FILA]],1)","v":""},{"$f":"INDEX(Turnos_Turno,TURNOS_2021_03[[#This Row],[FILA]],1)","v":""},{"$f":"INDEX(Turnos_Turno,TURNOS_2021_03[[#This Row],[FILA]],1)","v":""},{"$f":"INDEX(Turnos_Turno,TURNOS_2021_03[[#This Row],[FILA]],1)","v":""},{"$f":"INDEX(Turnos_Turno,TURNOS_2021_03[[#This Row],[FILA]],1)","v":""},{"$f":"INDEX(Turnos_Turno,TURNOS_2021_03[[#This Row],[FILA]],1)","v":""},{"$f":"INDEX(Turnos_Turno,TURNOS_2021_03[[#This Row],[FILA]],1)","v":""},{"$f":"INDEX(Turnos_Turno,TURNOS_2021_03[[#This Row],[FILA]],1)","v":""},{"$f":"INDEX(Turnos_Turno,TURNOS_2021_03[[#This Row],[FILA]],1)","v":""},{"$f":"INDEX(Turnos_Turno,TURNOS_2021_03[[#This Row],[FILA]],1)","v":""},{"$f":"INDEX(Turnos_Turno,TURNOS_2021_03[[#This Row],[FILA]],1)","v":""}]
[null,{"$f":"MATCH(TURNOS_2021_03[[#This Row],[PERSONAL]],Turnos_Personal,0)","v":5},{"$f":"INDEX(Capacidades_Nombre,MATCH(TURNOS_2021_03[[#This Row],[PERSONAL]],Capacidades_Personal,0),1) & \"\"","v":"N5"},"F5",{"$f":"INDEX(Turnos_Turno,TURNOS_2021_03[[#This Row],[FILA]],1)","v":""},{"$f":"INDEX(Turnos_Turno,TURNOS_2021_03[[#This Row],[FILA]],1)","v":""},{"$f":"INDEX(Turnos_Turno,TURNOS_2021_03[[#This Row],[FILA]],1)","v":""},{"$f":"INDEX(Turnos_Turno,TURNOS_2021_03[[#This Row],[FILA]],1)","v":""},{"$f":"INDEX(Turnos_Turno,TURNOS_2021_03[[#This Row],[FILA]],1)","v":""},{"$f":"INDEX(Turnos_Turno,TURNOS_2021_03[[#This Row],[FILA]],1)","v":""},{"$f":"INDEX(Turnos_Turno,TURNOS_2021_03[[#This Row],[FILA]],1)","v":""},{"$f":"INDEX(Turnos_Turno,TURNOS_2021_03[[#This Row],[FILA]],1)","v":""},{"$f":"INDEX(Turnos_Turno,TURNOS_2021_03[[#This Row],[FILA]],1)","v":""},{"$f":"INDEX(Turnos_Turno,TURNOS_2021_03[[#This Row],[FILA]],1)","v":""},{"$f":"INDEX(Turnos_Turno,TURNOS_2021_03[[#This Row],[FILA]],1)","v":""},{"$f":"INDEX(Turnos_Turno,TURNOS_2021_03[[#This Row],[FILA]],1)","v":""},{"$f":"INDEX(Turnos_Turno,TURNOS_2021_03[[#This Row],[FILA]],1)","v":""},{"$f":"INDEX(Turnos_Turno,TURNOS_2021_03[[#This Row],[FILA]],1)","v":""},{"$f":"INDEX(Turnos_Turno,TURNOS_2021_03[[#This Row],[FILA]],1)","v":""},{"$f":"INDEX(Turnos_Turno,TURNOS_2021_03[[#This Row],[FILA]],1)","v":""},{"$f":"INDEX(Turnos_Turno,TURNOS_2021_03[[#This Row],[FILA]],1)","v":""},{"$f":"INDEX(Turnos_Turno,TURNOS_2021_03[[#This Row],[FILA]],1)","v":""},{"$f":"INDEX(Turnos_Turno,TURNOS_2021_03[[#This Row],[FILA]],1)","v":""},{"$f":"INDEX(Turnos_Turno,TURNOS_2021_03[[#This Row],[FILA]],1)","v":""},{"$f":"INDEX(Turnos_Turno,TURNOS_2021_03[[#This Row],[FILA]],1)","v":""},{"$f":"INDEX(Turnos_Turno,TURNOS_2021_03[[#This Row],[FILA]],1)","v":""},{"$f":"INDEX(Turnos_Turno,TURNOS_2021_03[[#This Row],[FILA]],1)","v":""},{"$f":"INDEX(Turnos_Turno,TURNOS_2021_03[[#This Row],[FILA]],1)","v":""},{"$f":"INDEX(Turnos_Turno,TURNOS_2021_03[[#This Row],[FILA]],1)","v":""},{"$f":"INDEX(Turnos_Turno,TURNOS_2021_03[[#This Row],[FILA]],1)","v":""},{"$f":"INDEX(Turnos_Turno,TURNOS_2021_03[[#This Row],[FILA]],1)","v":""},{"$f":"INDEX(Turnos_Turno,TURNOS_2021_03[[#This Row],[FILA]],1)","v":""},{"$f":"INDEX(Turnos_Turno,TURNOS_2021_03[[#This Row],[FILA]],1)","v":""},{"$f":"INDEX(Turnos_Turno,TURNOS_2021_03[[#This Row],[FILA]],1)","v":""},{"$f":"INDEX(Turnos_Turno,TURNOS_2021_03[[#This Row],[FILA]],1)","v":""}]
{"$rows_left_out":56}