{"text_format":"1","workbook":"xlsx","n_sheets":5,"sheets":["Requisitos","CAPACIDADES","TURNOS","FEBRERO","03-21"],"not_rendered":{"charts":0,"images":1,"macros":1,"external_links":0,"defined_names":67,"comments":0,"pivot_tables":0},"unopened":[],"bounds":{"document_bytes":16777216,"sheet_cells":100000,"rows_first":2000,"rows_last":500,"rows_between":2000,"halvings":0,"cell_chars":16384,"cell_head_chars":4096},"cells_cut":0,"cells_raw":0,"read":"whole","date_system":"1900"}

{"sheet":"Requisitos","index":0,"n_rows":31,"n_cols":2,"rows_kept":31,"cut":false,"hidden":false,"merged":[]}
[]
[null,"Urgencias hospital-Rotación puestos trabajo a turnos y con limitaciones"]
[null,"https://foro.todoexcel.com/threads/urgencias-hospital-rotaci%C3%B3n-puestos-trabajo-a-turnos-y-con-limitaciones.56117/"]
[null,"Toyce"]
[null,"2021-02-12"]
[]
[null,"Hola a todos. Soy nueva por aquí y os agradecería vuestra ayuda."]
[null,"Os explico."]
[null,"Trabajo en el servicio de Urgencias de un hospital. Somos 61 personas fijas (aunque va variando por bajas, vacaciones, permisos, ...que hace que se tengan que añadir otras personas para sustituciones). Además, de ésas 61, algunas tienen jornada reducida, y la jornada que se quitan (que no aparecería en su turno) la realizan las personas que pone \"R\" en la columna B en la hoja de Capacidades. Lo mismo pasa con las bajas laborales (IT); quienes en la hoja de febrero pone IT después del T (MIT, TIT, NIT), es que esos dias están de baja y les sustituyen las que en la hoja de Capacidades pone IT en la Columna B."]
[]
[null,"Perdonadme pero he eliminado la columna de cada hoja en la que vienen los nombres y apellidos de todos. Espero que no sea problema. Salvo que me doy cuenta de que así, en la primera columna, hay gente que pone \"**\"; es gente que sustituye vacaciones, asuntos propios, asuntos personales,....."]
[]
[null,"Lo que necesito es crear una rotación semanal, o mensual, de los puestos de trabajo, con muchas condiciones."]
[]
[null,"Los puestos de trabajo y número de personas necesarias en cada uno, según el turno, serían:"]
[]
[null,"-De mañanas, en total, 14: 3 en observación, 2 en reanimación, 2 en respiratorio, 2 en CA, 3 en CB, 2 en SP"]
[null,"- De tardes, en total 15: 3 en observación, 2 en reanimación, 2 en respiratorio, 2 en CA, 3 en CB, 3 en SP"]
[null,"- Noche, en total 9s: 3 en observación, 1 en reanimación, 1 en respiratorio, 1 en CA, 2 en CB, 1 en SP"]
[]
[null,"El problema es que hay muchas limitaciones;"]
[null,"- Observación: hay gente fija de allí, que si está de turno, siempre tiene que ponerse allí. Hay otra gente, que no tiene que ir allí nunca y y otras personas, que pueden ir a observación si hace falta rellenar, porque no haya personas fijas en el turno."]
[null,"- Reanimación: no hay gente fija pero sí que hay gente que puede estar allí y gente que de ninguna forma."]
[null,"- Respiratorio (COVID): hay determinadas personas (pocas), que por problemas médicos, no pueden trabajar allí (en éste caso, tampoco en reanimación)"]
[null,"- CA, CB y SP: puede pasar todo el mundo, salvo las personas fijas de observación."]
[null,"En la hoja de CAPACIDADES están los puestos por los que puede pasar cada uno. En la columna E, que pone como título \"Opción obs\" es la gente que puede trabajar en observación, si no se han completado los 3 puestos con el personal fijo de allí."]
[]
[null,"Y además de todo éso, salvo en el caso del personal fijo de observación (aunque éstos tienen que ir rotando entre los 3 puestos que hay), el resto debe rotar entre los diferentes puestos en los que pueden trabajar (al menos, semanalmente; no repetir a menudo de puesto)."]
[]
[null,"Sé que es súper complicado. Al menos para mí. Pero quizás hay suerte y alguno sois capaces de hacerme el favor de ayudarme. Porque nos están volviendo locos y cada día tenemos que estar cambiando de puesto de forma personal."]
[null,"Gracias a todos."]

{"sheet":"CAPACIDADES","index":1,"n_rows":106,"n_cols":10,"rows_kept":106,"cut":false,"hidden":false,"merged":[[1,3,1,9]]}
[]
[null,null,null,"CAPACIDADES"]
[null,"NOMBRE","PERSONAL","OBSERVACIÓN","OPCION OBS","REANIMACIÓN","CA","CB","SP","RESPIRATORIO"]
[null,"N1","F1","x","x","x","x","x","x","x"]
[null,"N2","F2",null,"x",null,"x","x","x","x"]
[null,"N3","F3","x"]
[null,"N4","F4","x","x","x","x","x","x","x"]
[null,"N5","F5",null,"x","x","x","x","x","x"]
[null,"N6","F6",null,"x","x","x","x","x","x"]
[null,"N7","F7",null,null,null,"x","x","x"]
[null,"N8","F8",null,"x","x","x","x","x","x"]
[null,"N9","F9",null,null,null,"x","x","x","x"]
[null,"N10","F10",null,null,null,"x","x","x","x"]
[null,"N11","F11",null,"x","x","x","x","x","x"]
[null,"N12","F12",null,null,null,"x","x","x","x"]
[null,"N13","F13",null,"x","x","x","x","x","x"]
[null,"N14","F14","x","x","x","x","x","x","x"]
[null,"N15","F15","x"]
[null,"N16","F16",null,"x","x","x","x","x","x"]
[null,"N17","F17"]
[null,"N18","F18",null,"x","x","x","x","x","x"]
[null,"N19","F19",null,null,null,"x","x","x"]
[null,"N20","F20","x","x","x","x","x","x","x"]
[null,"N21","F21",null,null,null,"x","x","x","x"]
[null,"N22","F22",null,null,null,"x","x","x","x"]
[null,"N23","F23","x","x","x","x","x","x","x"]
[null,"N24","F24",null,"x","x","x","x","x","x"]
[null,"N25","F25","x","x","x","x","x","x","x"]
[null,"N26","F26",null,"x",null,"x","x","x","x"]
[null,"N27","F27",null,null,null,"x","x","x","x"]
[null,"N28","F28",null,null,null,"x","x","x"]
[null,"N29","F29",null,"x","x","x","x","x","x"]
[null,"N30","F30","x","x","x","x","x","x","x"]
[null,"N31","F31"]
[null,"N32","F32"]
[null,"N33","F33","x","x","x","x","x","x","x"]
[null,"N34","F34",null,null,null,"x","x","x","x"]
[null,"N35","F35",null,null,null,"x","x","x"]
[null,"N36","F36",null,null,null,"x","x","x"]
[null,"N37","F37",null,null,null,"x","x","x","x"]
[null,"N38","F38",null,"x",null,"x","x","x","x"]
[null,"N39","F39","x","x","x","x","x","x","x"]
[null,"N40","F40",null,null,null,"x","x","x","x"]
[null,"N41","F41",null,null,null,"x","x","x","x"]
[null,"N42","F42",null,"x","x","x","x","x","x"]
[null,"N43","F43"]
[null,"N44","F44","x","x","x","x","x","x","x"]
[null,"N45","F45",null,null,null,"x","x","x","x"]
[null,"N46","F46","x","x","x","x","x","x","x"]
[null,"N47","F47",null,"x","x","x","x","x","x"]
[null,"N48","F48",null,"x",null,"x","x","x","x"]
[null,"N49","F49",null,"x",null,"x","x","x","x"]
[null,"N50","F50","x","x","x","x","x","x","x"]
[null,"N51","F51","x"]
[null,"N52","F52","x","x","x","x","x","x","x"]
[null,"N53","F53","x"]
[null,"N54","F54","x"]
[null,"N55","F55",null,"x",null,"x","x","x","x"]
[null,"N56","F56"]
[null,"N57","F57",null,"x","x","x","x","x","x"]
[null,"N58","F58",null,"x","x","x","x","x","x"]
[null,"N59","F59",null,"x","x","x","x","x","x"]
[null,"N60","F60"]
[null,"N61","F61",null,null,null,"x","x","x","x"]
[null,"NS1","S1",null,"x",null,"x","x","x","x"]
[null,"NS2","S2",null,null,null,"x","x","x","x"]
[null,"NS3","S3",null,null,null,"x","x","x","x"]
[null,"NS4","S4",null,"x",null,"x","x","x","x"]
[null,"NS5","S5",null,"x",null,"x","x","x","x"]
[null,"NS6","S6","x"]
[null,"NS7","S7",null,null,null,"x","x","x","x"]
[null,"NS8","S8",null,null,null,"x","x","x"]
[null,"NS9","S9",null,"x","x","x","x","x","x"]
[null,"NS10","S10",null,"x",null,"x","x","x","x"]
[null,"NS11","S11",null,null,null,"x","x","x","x"]
[null,"NS12","S12",null,"x","x","x","x","x","x"]
[null,"NS13","S13",null,"x",null,"x","x","x","x"]
[null,"NS14","S14",null,"x","x","x","x","x","x"]
[null,"NS15","S15","x","x","x","x","x","x","x"]
[null,"NS16","S16",null,"x",null,"x","x","x","x"]
[null,"NS17","S17",null,"x",null,"x","x","x","x"]
[null,"NS18","S18","x","x","x","x","x","x","x"]
[null,"NS19","S19",null,"x",null,"x","x","x","x"]
[null,null,"."]
[null,null,"_","x","x","x","x","x","x","x"]
[null,"NIT1","IT1",null,null,null,"x","x","x","x"]
[null,"NIT2","IT2"]
[null,"NIT3","IT3","x","x","x","x","x","x","x"]
[null,"NIT4","IT4","x","x","x","x","x","x","x"]
[null,"NIT5","IT5",null,"x","x","x","x","x","x"]
[null,"NIT6","IT6","x","x","x","x","x","x","x"]
[null,"NIT7","IT7",null,null,null,"x","x","x","x"]
[null,"NIT8","IT8"]
[null,"NIT9","IT9"]
[null,"NIT10","IT10","x","x","x","x","x","x","x"]
[null,"NIT11","IT11",null,"x","x","x","x","x","x"]
[null,"NIT12","IT12"]
[null,"NIT13","IT13",null,null,null,"x","x","x","x"]
[null,"NIT14","IT14",null,null,null,"x","x","x","x"]
[null,"NIT15","IT15",null,"x","x","x","x","x","x"]
[null,"NIT16","IT16",null,null,null,"x","x","x","x"]
[null,"NR1","R1"]
[null,"NR2","R2","x"]
[null,"NR3","R3"]
[null,"NR4","R4"]
[null,"NR5","R5","x","x","x","x","x","x","x"]

{"sheet":"TURNOS","index":2,"n_rows":81,"n_cols":20,"rows_kept":81,"cut":false,"hidden":false,"merged":[[1,3,1,9],[1,11,1,13]]}
[null,null,null,{"$f":"MATCH(D3,TABLA_CAPACIDADES[[#Headers],[OBSERVACIÓN]:[RESPIRATORIO]],0)","v":1},{"$f":"MATCH(E3,TABLA_CAPACIDADES[[#Headers],[OBSERVACIÓN]:[RESPIRATORIO]],0)","v":2},{"$f":"MATCH(F3,TABLA_CAPACIDADES[[#Headers],[OBSERVACIÓN]:[RESPIRATORIO]],0)","v":3},{"$f":"MATCH(G3,TABLA_CAPACIDADES[[#Headers],[OBSERVACIÓN]:[RESPIRATORIO]],0)","v":4},{"$f":"MATCH(H3,TABLA_CAPACIDADES[[#Headers],[OBSERVACIÓN]:[RESPIRATORIO]],0)","v":5},{"$f":"MATCH(I3,TABLA_CAPACIDADES[[#Headers],[OBSERVACIÓN]:[RESPIRATORIO]],0)","v":6},{"$f":"MATCH(J3,TABLA_CAPACIDADES[[#Headers],[OBSERVACIÓN]:[RESPIRATORIO]],0)","v":7}]
[null,null,null,"CAPACIDADES",null,null,null,null,null,null,null,"TURNOS"]
[null,"FILA","PERSONAL","OBSERVACIÓN","OPCION OBS","REANIMACIÓN","CA","CB","SP","RESPIRATORIO","DE SERVICIO","Mañanas","Tardes","Noches","Total","TURNO","Capacidad",null,2021,"2021-03-01"]
[null,{"$f":"MATCH(TABLA_TURNOS[[#This Row],[PERSONAL]],Capacidades_Personal,0)","v":1},"F1",{"$f":"INDEX(Capacidades_Tabla,$B4,D$1) & \"\"","v":"x"},{"$f":"IF(TABLA_TURNOS[[#This Row],[OBSERVACIÓN]]=\"x\",\"\",INDEX(Capacidades_Tabla,$B4,E$1) & \"\")","v":""},"x",{"$f":"IF(TABLA_TURNOS[[#This Row],[OBSERVACIÓN]]=\"x\",\"\",\"x\")","v":""},{"$f":"IF(TABLA_TURNOS[[#This Row],[OBSERVACIÓN]]=\"x\",\"\",\"x\")","v":""},{"$f":"IF(TABLA_TURNOS[[#This Row],[OBSERVACIÓN]]=\"x\",\"\",\"x\")","v":""},"x",1,0,0,0,{"$f":"IF(TABLA_TURNOS[[#This Row],[DE SERVICIO]]=1,SUM(TABLA_TURNOS[[#This Row],[Mañanas]:[Noches]]),0)","v":0},{"$f":"IF(TABLA_TURNOS[[#This Row],[Mañanas]]=1,\"M\",IF(TABLA_TURNOS[[#This Row],[Tardes]]=1,\"T\",IF(TABLA_TURNOS[[#This Row],[Noches]]=1,\"N\",\"\")))","v":""},null,null,2021,"2021-01-01"]
[null,{"$f":"MATCH(TABLA_TURNOS[[#This Row],[PERSONAL]],Capacidades_Personal,0)","v":2},"F2","",{"$f":"IF(TABLA_TURNOS[[#This Row],[OBSERVACIÓN]]=\"x\",\"\",INDEX(Capacidades_Tabla,$B5,E$1) & \"\")","v":"x"},"",{"$f":"IF(TABLA_TURNOS[[#This Row],[OBSERVACIÓN]]=\"x\",\"\",\"x\")","v":"x"},{"$f":"IF(TABLA_TURNOS[[#This Row],[OBSERVACIÓN]]=\"x\",\"\",\"x\")","v":"x"},{"$f":"IF(TABLA_TURNOS[[#This Row],[OBSERVACIÓN]]=\"x\",\"\",\"x\")","v":"x"},"x",1,0,0,0,{"$f":"IF(TABLA_TURNOS[[#This Row],[DE SERVICIO]]=1,SUM(TABLA_TURNOS[[#This Row],[Mañanas]:[Noches]]),0)","v":0},{"$f":"IF(TABLA_TURNOS[[#This Row],[Mañanas]]=1,\"M\",IF(TABLA_TURNOS[[#This Row],[Tardes]]=1,\"T\",IF(TABLA_TURNOS[[#This Row],[Noches]]=1,\"N\",\"\")))","v":""},null,null,2022,"2021-02-01"]
[null,{"$f":"MATCH(TABLA_TURNOS[[#This Row],[PERSONAL]],Capacidades_Personal,0)","v":3},"F3","x",{"$f":"IF(TABLA_TURNOS[[#This Row],[OBSERVACIÓN]]=\"x\",\"\",INDEX(Capacidades_Tabla,$B6,E$1) & \"\")","v":""},"",{"$f":"IF(TABLA_TURNOS[[#This Row],[OBSERVACIÓN]]=\"x\",\"\",\"x\")","v":""},{"$f":"IF(TABLA_TURNOS[[#This Row],[OBSERVACIÓN]]=\"x\",\"\",\"x\")","v":""},{"$f":"IF(TABLA_TURNOS[[#This Row],[OBSERVACIÓN]]=\"x\",\"\",\"x\")","v":""},"",1,0,0,0,{"$f":"IF(TABLA_TURNOS[[#This Row],[DE SERVICIO]]=1,SUM(TABLA_TURNOS[[#This Row],[Mañanas]:[Noches]]),0)","v":0},{"$f":"IF(TABLA_TURNOS[[#This Row],[Mañanas]]=1,\"M\",IF(TABLA_TURNOS[[#This Row],[Tardes]]=1,\"T\",IF(TABLA_TURNOS[[#This Row],[Noches]]=1,\"N\",\"\")))","v":""},null,null,2023,"2021-03-01"]
[null,{"$f":"MATCH(TABLA_TURNOS[[#This Row],[PERSONAL]],Capacidades_Personal,0)","v":4},"F4","x",{"$f":"IF(TABLA_TURNOS[[#This Row],[OBSERVACIÓN]]=\"x\",\"\",INDEX(Capacidades_Tabla,$B7,E$1) & \"\")","v":""},"x",{"$f":"IF(TABLA_TURNOS[[#This Row],[OBSERVACIÓN]]=\"x\",\"\",\"x\")","v":""},{"$f":"IF(TABLA_TURNOS[[#This Row],[OBSERVACIÓN]]=\"x\",\"\",\"x\")","v":""},{"$f":"IF(TABLA_TURNOS[[#This Row],[OBSERVACIÓN]]=\"x\",\"\",\"x\")","v":""},"x",1,0,0,0,{"$f":"IF(TABLA_TURNOS[[#This Row],[DE SERVICIO]]=1,SUM(TABLA_TURNOS[[#This Row],[Mañanas]:[Noches]]),0)","v":0},{"$f":"IF(TABLA_TURNOS[[#This Row],[Mañanas]]=1,\"M\",IF(TABLA_TURNOS[[#This Row],[Tardes]]=1,\"T\",IF(TABLA_TURNOS[[#This Row],[Noches]]=1,\"N\",\"\")))","v":""},null,null,2024,"2021-04-01"]
[null,{"$f":"MATCH(TABLA_TURNOS[[#This Row],[PERSONAL]],Capacidades_Personal,0)","v":5},"F5","",{"$f":"IF(TABLA_TURNOS[[#This Row],[OBSERVACIÓN]]=\"x\",\"\",INDEX(Capacidades_Tabla,$B8,E$1) & \"\")","v":"x"},"x",{"$f":"IF(TABLA_TURNOS[[#This Row],[OBSERVACIÓN]]=\"x\",\"\",\"x\")","v":"x"},{"$f":"IF(TABLA_TURNOS[[#This Row],[OBSERVACIÓN]]=\"x\",\"\",\"x\")","v":"x"},{"$f":"IF(TABLA_TURNOS[[#This Row],[OBSERVACIÓN]]=\"x\",\"\",\"x\")","v":"x"},"x",1,0,0,0,{"$f":"IF(TABLA_TURNOS[[#This Row],[DE SERVICIO]]=1,SUM(TABLA_TURNOS[[#This Row],[Mañanas]:[Noches]]),0)","v":0},{"$f":"IF(TABLA_TURNOS[[#This Row],[Mañanas]]=1,\"M\",IF(TABLA_TURNOS[[#This Row],[Tardes]]=1,\"T\",IF(TABLA_TURNOS[[#This Row],[Noches]]=1,\"N\",\"\")))","v":""},null,null,2025,"2021-05-01"]
[null,{"$f":"MATCH(TABLA_TURNOS[[#This Row],[PERSONAL]],Capacidades_Personal,0)","v":6},"F6","",{"$f":"IF(TABLA_TURNOS[[#This Row],[OBSERVACIÓN]]=\"x\",\"\",INDEX(Capacidades_Tabla,$B9,E$1) & \"\")","v":"x"},"x",{"$f":"IF(TABLA_TURNOS[[#This Row],[OBSERVACIÓN]]=\"x\",\"\",\"x\")","v":"x"},{"$f":"IF(TABLA_TURNOS[[#This Row],[OBSERVACIÓN]]=\"x\",\"\",\"x\")","v":"x"},{"$f":"IF(TABLA_TURNOS[[#This Row],[OBSERVACIÓN]]=\"x\",\"\",\"x\")","v":"x"},"x",1,0,0,0,{"$f":"IF(TABLA_TURNOS[[#This Row],[DE SERVICIO]]=1,SUM(TABLA_TURNOS[[#This Row],[Mañanas]:[Noches]]),0)","v":0},{"$f":"IF(TABLA_TURNOS[[#This Row],[Mañanas]]=1,\"M\",IF(TABLA_TURNOS[[#This Row],[Tardes]]=1,\"T\",IF(TABLA_TURNOS[[#This Row],[Noches]]=1,\"N\",\"\")))","v":""},null,null,2026,"2021-06-01"]
[null,{"$f":"MATCH(TABLA_TURNOS[[#This Row],[PERSONAL]],Capacidades_Personal,0)","v":7},"F7","",{"$f":"IF(TABLA_TURNOS[[#This Row],[OBSERVACIÓN]]=\"x\",\"\",INDEX(Capacidades_Tabla,$B10,E$1) & \"\")","v":""},"",{"$f":"IF(TABLA_TURNOS[[#This Row],[OBSERVACIÓN]]=\"x\",\"\",\"x\")","v":"x"},{"$f":"IF(TABLA_TURNOS[[#This Row],[OBSERVACIÓN]]=\"x\",\"\",\"x\")","v":"x"},{"$f":"IF(TABLA_TURNOS[[#This Row],[OBSERVACIÓN]]=\"x\",\"\",\"x\")","v":"x"},"",1,0,0,0,{"$f":"IF(TABLA_TURNOS[[#This Row],[DE SERVICIO]]=1,SUM(TABLA_TURNOS[[#This Row],[Mañanas]:[Noches]]),0)","v":0},{"$f":"IF(TABLA_TURNOS[[#This Row],[Mañanas]]=1,\"M\",IF(TABLA_TURNOS[[#This Row],[Tardes]]=1,\"T\",IF(TABLA_TURNOS[[#This Row],[Noches]]=1,\"N\",\"\")))","v":""},null,null,2027,"2021-07-01"]
[null,{"$f":"MATCH(TABLA_TURNOS[[#This Row],[PERSONAL]],Capacidades_Personal,0)","v":8},"F8","",{"$f":"IF(TABLA_TURNOS[[#This Row],[OBSERVACIÓN]]=\"x\",\"\",INDEX(Capacidades_Tabla,$B11,E$1) & \"\")","v":"x"},"x",{"$f":"IF(TABLA_TURNOS[[#This Row],[OBSERVACIÓN]]=\"x\",\"\",\"x\")","v":"x"},{"$f":"IF(TABLA_TURNOS[[#This Row],[OBSERVACIÓN]]=\"x\",\"\",\"x\")","v":"x"},{"$f":"IF(TABLA_TURNOS[[#This Row],[OBSERVACIÓN]]=\"x\",\"\",\"x\")","v":"x"},"x",1,0,0,0,{"$f":"IF(TABLA_TURNOS[[#This Row],[DE SERVICIO]]=1,SUM(TABLA_TURNOS[[#This Row],[Mañanas]:[Noches]]),0)","v":0},{"$f":"IF(TABLA_TURNOS[[#This Row],[Mañanas]]=1,\"M\",IF(TABLA_TURNOS[[#This Row],[Tardes]]=1,\"T\",IF(TABLA_TURNOS[[#This Row],[Noches]]=1,\"N\",\"\")))","v":""},null,null,2028,"2021-08-01"]
[null,{"$f":"MATCH(TABLA_TURNOS[[#This Row],[PERSONAL]],Capacidades_Personal,0)","v":9},"F9","",{"$f":"IF(TABLA_TURNOS[[#This Row],[OBSERVACIÓN]]=\"x\",\"\",INDEX(Capacidades_Tabla,$B12,E$1) & \"\")","v":""},"",{"$f":"IF(TABLA_TURNOS[[#This Row],[OBSERVACIÓN]]=\"x\",\"\",\"x\")","v":"x"},{"$f":"IF(TABLA_TURNOS[[#This Row],[OBSERVACIÓN]]=\"x\",\"\",\"x\")","v":"x"},{"$f":"IF(TABLA_TURNOS[[#This Row],[OBSERVACIÓN]]=\"x\",\"\",\"x\")","v":"x"},"x",1,0,0,0,{"$f":"IF(TABLA_TURNOS[[#This Row],[DE SERVICIO]]=1,SUM(TABLA_TURNOS[[#This Row],[Mañanas]:[Noches]]),0)","v":0},{"$f":"IF(TABLA_TURNOS[[#This Row],[Mañanas]]=1,\"M\",IF(TABLA_TURNOS[[#This Row],[Tardes]]=1,\"T\",IF(TABLA_TURNOS[[#This Row],[Noches]]=1,\"N\",\"\")))","v":""},null,null,2029,"2021-09-01"]
[null,{"$f":"MATCH(TABLA_TURNOS[[#This Row],[PERSONAL]],Capacidades_Personal,0)","v":10},"F10","",{"$f":"IF(TABLA_TURNOS[[#This Row],[OBSERVACIÓN]]=\"x\",\"\",INDEX(Capacidades_Tabla,$B13,E$1) & \"\")","v":""},"",{"$f":"IF(TABLA_TURNOS[[#This Row],[OBSERVACIÓN]]=\"x\",\"\",\"x\")","v":"x"},{"$f":"IF(TABLA_TURNOS[[#This Row],[OBSERVACIÓN]]=\"x\",\"\",\"x\")","v":"x"},{"$f":"IF(TABLA_TURNOS[[#This Row],[OBSERVACIÓN]]=\"x\",\"\",\"x\")","v":"x"},"x",1,0,0,0,{"$f":"IF(TABLA_TURNOS[[#This Row],[DE SERVICIO]]=1,SUM(TABLA_TURNOS[[#This Row],[Mañanas]:[Noches]]),0)","v":0},{"$f":"IF(TABLA_TURNOS[[#This Row],[Mañanas]]=1,\"M\",IF(TABLA_TURNOS[[#This Row],[Tardes]]=1,\"T\",IF(TABLA_TURNOS[[#This Row],[Noches]]=1,\"N\",\"\")))","v":""},null,null,2030,"2021-10-01"]
[null,{"$f":"MATCH(TABLA_TURNOS[[#This Row],[PERSONAL]],Capacidades_Personal,0)","v":11},"F11",{"$f":"INDEX(Capacidades_Tabla,$B14,D$1) & \"\"","v":""},{"$f":"IF(TABLA_TURNOS[[#This Row],[OBSERVACIÓN]]=\"x\",\"\",INDEX(Capacidades_Tabla,$B14,E$1) & \"\")","v":"x"},"x",{"$f":"IF(TABLA_TURNOS[[#This Row],[OBSERVACIÓN]]=\"x\",\"\",\"x\")","v":"x"},{"$f":"IF(TABLA_TURNOS[[#This Row],[OBSERVACIÓN]]=\"x\",\"\",\"x\")","v":"x"},{"$f":"IF(TABLA_TURNOS[[#This Row],[OBSERVACIÓN]]=\"x\",\"\",\"x\")","v":"x"},"x",1,0,0,0,{"$f":"IF(TABLA_TURNOS[[#This Row],[DE SERVICIO]]=1,SUM(TABLA_TURNOS[[#This Row],[Mañanas]:[Noches]]),0)","v":0},{"$f":"IF(TABLA_TURNOS[[#This Row],[Mañanas]]=1,\"M\",IF(TABLA_TURNOS[[#This Row],[Tardes]]=1,\"T\",IF(TABLA_TURNOS[[#This Row],[Noches]]=1,\"N\",\"\")))","v":""},null,null,2031,"2021-11-01"]
[null,{"$f":"MATCH(TABLA_TURNOS[[#This Row],[PERSONAL]],Capacidades_Personal,0)","v":12},"F12","",{"$f":"IF(TABLA_TURNOS[[#This Row],[OBSERVACIÓN]]=\"x\",\"\",INDEX(Capacidades_Tabla,$B15,E$1) & \"\")","v":""},"",{"$f":"IF(TABLA_TURNOS[[#This Row],[OBSERVACIÓN]]=\"x\",\"\",\"x\")","v":"x"},{"$f":"IF(TABLA_TURNOS[[#This Row],[OBSERVACIÓN]]=\"x\",\"\",\"x\")","v":"x"},{"$f":"IF(TABLA_TURNOS[[#This Row],[OBSERVACIÓN]]=\"x\",\"\",\"x\")","v":"x"},"x",1,0,0,0,{"$f":"IF(TABLA_TURNOS[[#This Row],[DE SERVICIO]]=1,SUM(TABLA_TURNOS[[#This Row],[Mañanas]:[Noches]]),0)","v":0},{"$f":"IF(TABLA_TURNOS[[#This Row],[Mañanas]]=1,\"M\",IF(TABLA_TURNOS[[#This Row],[Tardes]]=1,\"T\",IF(TABLA_TURNOS[[#This Row],[Noches]]=1,\"N\",\"\")))","v":""},null,null,2032,"2021-12-01"]
[null,{"$f":"MATCH(TABLA_TURNOS[[#This Row],[PERSONAL]],Capacidades_Personal,0)","v":13},"F13","",{"$f":"IF(TABLA_TURNOS[[#This Row],[OBSERVACIÓN]]=\"x\",\"\",INDEX(Capacidades_Tabla,$B16,E$1) & \"\")","v":"x"},"x",{"$f":"IF(TABLA_TURNOS[[#This Row],[OBSERVACIÓN]]=\"x\",\"\",\"x\")","v":"x"},{"$f":"IF(TABLA_TURNOS[[#This Row],[OBSERVACIÓN]]=\"x\",\"\",\"x\")","v":"x"},{"$f":"IF(TABLA_TURNOS[[#This Row],[OBSERVACIÓN]]=\"x\",\"\",\"x\")","v":"x"},"x",1,0,0,0,{"$f":"IF(TABLA_TURNOS[[#This Row],[DE SERVICIO]]=1,SUM(TABLA_TURNOS[[#This Row],[Mañanas]:[Noches]]),0)","v":0},{"$f":"IF(TABLA_TURNOS[[#This Row],[Mañanas]]=1,\"M\",IF(TABLA_TURNOS[[#This Row],[Tardes]]=1,\"T\",IF(TABLA_TURNOS[[#This Row],[Noches]]=1,\"N\",\"\")))","v":""}]
[null,{"$f":"MATCH(TABLA_TURNOS[[#This Row],[PERSONAL]],Capacidades_Personal,0)","v":14},"F14","x",{"$f":"IF(TABLA_TURNOS[[#This Row],[OBSERVACIÓN]]=\"x\",\"\",INDEX(Capacidades_Tabla,$B17,E$1) & \"\")","v":""},"x",{"$f":"IF(TABLA_TURNOS[[#This Row],[OBSERVACIÓN]]=\"x\",\"\",\"x\")","v":""},{"$f":"IF(TABLA_TURNOS[[#This Row],[OBSERVACIÓN]]=\"x\",\"\",\"x\")","v":""},{"$f":"IF(TABLA_TURNOS[[#This Row],[OBSERVACIÓN]]=\"x\",\"\",\"x\")","v":""},"x",1,0,0,0,{"$f":"IF(TABLA_TURNOS[[#This Row],[DE SERVICIO]]=1,SUM(TABLA_TURNOS[[#This Row],[Mañanas]:[Noches]]),0)","v":0},{"$f":"IF(TABLA_TURNOS[[#This Row],[Mañanas]]=1,\"M\",IF(TABLA_TURNOS[[#This Row],[Tardes]]=1,\"T\",IF(TABLA_TURNOS[[#This Row],[Noches]]=1,\"N\",\"\")))","v":""}]
[null,{"$f":"MATCH(TABLA_TURNOS[[#This Row],[PERSONAL]],Capacidades_Personal,0)","v":15},"F15","x",{"$f":"IF(TABLA_TURNOS[[#This Row],[OBSERVACIÓN]]=\"x\",\"\",INDEX(Capacidades_Tabla,$B18,E$1) & \"\")","v":""},"",{"$f":"IF(TABLA_TURNOS[[#This Row],[OBSERVACIÓN]]=\"x\",\"\",\"x\")","v":""},{"$f":"IF(TABLA_TURNOS[[#This Row],[OBSERVACIÓN]]=\"x\",\"\",\"x\")","v":""},{"$f":"IF(TABLA_TURNOS[[#This Row],[OBSERVACIÓN]]=\"x\",\"\",\"x\")","v":""},"",1,0,0,0,{"$f":"IF(TABLA_TURNOS[[#This Row],[DE SERVICIO]]=1,SUM(TABLA_TURNOS[[#This Row],[Mañanas]:[Noches]]),0)","v":0},{"$f":"IF(TABLA_TURNOS[[#This Row],[Mañanas]]=1,\"M\",IF(TABLA_TURNOS[[#This Row],[Tardes]]=1,\"T\",IF(TABLA_TURNOS[[#This Row],[Noches]]=1,\"N\",\"\")))","v":""}]
[null,{"$f":"MATCH(TABLA_TURNOS[[#This Row],[PERSONAL]],Capacidades_Personal,0)","v":16},"F16","",{"$f":"IF(TABLA_TURNOS[[#This Row],[OBSERVACIÓN]]=\"x\",\"\",INDEX(Capacidades_Tabla,$B19,E$1) & \"\")","v":"x"},"x",{"$f":"IF(TABLA_TURNOS[[#This Row],[OBSERVACIÓN]]=\"x\",\"\",\"x\")","v":"x"},{"$f":"IF(TABLA_TURNOS[[#This Row],[OBSERVACIÓN]]=\"x\",\"\",\"x\")","v":"x"},{"$f":"IF(TABLA_TURNOS[[#This Row],[OBSERVACIÓN]]=\"x\",\"\",\"x\")","v":"x"},"x",1,0,0,0,{"$f":"IF(TABLA_TURNOS[[#This Row],[DE SERVICIO]]=1,SUM(TABLA_TURNOS[[#This Row],[Mañanas]:[Noches]]),0)","v":0},{"$f":"IF(TABLA_TURNOS[[#This Row],[Mañanas]]=1,\"M\",IF(TABLA_TURNOS[[#This Row],[Tardes]]=1,\"T\",IF(TABLA_TURNOS[[#This Row],[Noches]]=1,\"N\",\"\")))","v":""}]
[null,{"$f":"MATCH(TABLA_TURNOS[[#This Row],[PERSONAL]],Capacidades_Personal,0)","v":17},"F17","",{"$f":"IF(TABLA_TURNOS[[#This Row],[OBSERVACIÓN]]=\"x\",\"\",INDEX(Capacidades_Tabla,$B20,E$1) & \"\")","v":""},"",{"$f":"IF(TABLA_TURNOS[[#This Row],[OBSERVACIÓN]]=\"x\",\"\",\"x\")","v":"x"},{"$f":"IF(TABLA_TURNOS[[#This Row],[OBSERVACIÓN]]=\"x\",\"\",\"x\")","v":"x"},{"$f":"IF(TABLA_TURNOS[[#This Row],[OBSERVACIÓN]]=\"x\",\"\",\"x\")","v":"x"},"",1,0,0,0,{"$f":"IF(TABLA_TURNOS[[#This Row],[DE SERVICIO]]=1,SUM(TABLA_TURNOS[[#This Row],[Mañanas]:[Noches]]),0)","v":0},{"$f":"IF(TABLA_TURNOS[[#This Row],[Mañanas]]=1,\"M\",IF(TABLA_TURNOS[[#This Row],[Tardes]]=1,\"T\",IF(TABLA_TURNOS[[#This Row],[Noches]]=1,\"N\",\"\")))","v":""}]
[null,{"$f":"MATCH(TABLA_TURNOS[[#This Row],[PERSONAL]],Capacidades_Personal,0)","v":18},"F18","",{"$f":"IF(TABLA_TURNOS[[#This Row],[OBSERVACIÓN]]=\"x\",\"\",INDEX(Capacidades_Tabla,$B21,E$1) & \"\")","v":"x"},"x",{"$f":"IF(TABLA_TURNOS[[#This Row],[OBSERVACIÓN]]=\"x\",\"\",\"x\")","v":"x"},{"$f":"IF(TABLA_TURNOS[[#This Row],[OBSERVACIÓN]]=\"x\",\"\",\"x\")","v":"x"},{"$f":"IF(TABLA_TURNOS[[#This Row],[OBSERVACIÓN]]=\"x\",\"\",\"x\")","v":"x"},"x",1,0,0,0,{"$f":"IF(TABLA_TURNOS[[#This Row],[DE SERVICIO]]=1,SUM(TABLA_TURNOS[[#This Row],[Mañanas]:[Noches]]),0)","v":0},{"$f":"IF(TABLA_TURNOS[[#This Row],[Mañanas]]=1,\"M\",IF(TABLA_TURNOS[[#This Row],[Tardes]]=1,\"T\",IF(TABLA_TURNOS[[#This Row],[Noches]]=1,\"N\",\"\")))","v":""}]
[null,{"$f":"MATCH(TABLA_TURNOS[[#This Row],[PERSONAL]],Capacidades_Personal,0)","v":19},"F19","",{"$f":"IF(TABLA_TURNOS[[#This Row],[OBSERVACIÓN]]=\"x\",\"\",INDEX(Capacidades_Tabla,$B22,E$1) & \"\")","v":""},"",{"$f":"IF(TABLA_TURNOS[[#This Row],[OBSERVACIÓN]]=\"x\",\"\",\"x\")","v":"x"},{"$f":"IF(TABLA_TURNOS[[#This Row],[OBSERVACIÓN]]=\"x\",\"\",\"x\")","v":"x"},{"$f":"IF(TABLA_TURNOS[[#This Row],[OBSERVACIÓN]]=\"x\",\"\",\"x\")","v":"x"},"",1,0,0,0,{"$f":"IF(TABLA_TURNOS[[#This Row],[DE SERVICIO]]=1,SUM(TABLA_TURNOS[[#This Row],[Mañanas]:[Noches]]),0)","v":0},{"$f":"IF(TABLA_TURNOS[[#This Row],[Mañanas]]=1,\"M\",IF(TABLA_TURNOS[[#This Row],[Tardes]]=1,\"T\",IF(TABLA_TURNOS[[#This Row],[Noches]]=1,\"N\",\"\")))","v":""}]
[null,{"$f":"MATCH(TABLA_TURNOS[[#This Row],[PERSONAL]],Capacidades_Personal,0)","v":20},"F20","x",{"$f":"IF(TABLA_TURNOS[[#This Row],[OBSERVACIÓN]]=\"x\",\"\",INDEX(Capacidades_Tabla,$B23,E$1) & \"\")","v":""},"x",{"$f":"IF(TABLA_TURNOS[[#This Row],[OBSERVACIÓN]]=\"x\",\"\",\"x\")","v":""},{"$f":"IF(TABLA_TURNOS[[#This Row],[OBSERVACIÓN]]=\"x\",\"\",\"x\")","v":""},{"$f":"IF(TABLA_TURNOS[[#This Row],[OBSERVACIÓN]]=\"x\",\"\",\"x\")","v":""},"x",1,0,0,0,{"$f":"IF(TABLA_TURNOS[[#This Row],[DE SERVICIO]]=1,SUM(TABLA_TURNOS[[#This Row],[Mañanas]:[Noches]]),0)","v":0},{"$f":"IF(TABLA_TURNOS[[#This Row],[Mañanas]]=1,\"M\",IF(TABLA_TURNOS[[#This Row],[Tardes]]=1,\"T\",IF(TABLA_TURNOS[[#This Row],[Noches]]=1,\"N\",\"\")))","v":""}]
[null,{"$f":"MATCH(TABLA_TURNOS[[#This Row],[PERSONAL]],Capacidades_Personal,0)","v":21},"F21",{"$f":"INDEX(Capacidades_Tabla,$B24,D$1) & \"\"","v":""},{"$f":"IF(TABLA_TURNOS[[#This Row],[OBSERVACIÓN]]=\"x\",\"\",INDEX(Capacidades_Tabla,$B24,E$1) & \"\")","v":""},"",{"$f":"IF(TABLA_TURNOS[[#This Row],[OBSERVACIÓN]]=\"x\",\"\",\"x\")","v":"x"},{"$f":"IF(TABLA_TURNOS[[#This Row],[OBSERVACIÓN]]=\"x\",\"\",\"x\")","v":"x"},{"$f":"IF(TABLA_TURNOS[[#This Row],[OBSERVACIÓN]]=\"x\",\"\",\"x\")","v":"x"},"x",1,0,0,0,{"$f":"IF(TABLA_TURNOS[[#This Row],[DE SERVICIO]]=1,SUM(TABLA_TURNOS[[#This Row],[Mañanas]:[Noches]]),0)","v":0},{"$f":"IF(TABLA_TURNOS[[#This Row],[Mañanas]]=1,\"M\",IF(TABLA_TURNOS[[#This Row],[Tardes]]=1,\"T\",IF(TABLA_TURNOS[[#This Row],[Noches]]=1,\"N\",\"\")))","v":""}]
[null,{"$f":"MATCH(TABLA_TURNOS[[#This Row],[PERSONAL]],Capacidades_Personal,0)","v":22},"F22","",{"$f":"IF(TABLA_TURNOS[[#This Row],[OBSERVACIÓN]]=\"x\",\"\",INDEX(Capacidades_Tabla,$B25,E$1) & \"\")","v":""},"",{"$f":"IF(TABLA_TURNOS[[#This Row],[OBSERVACIÓN]]=\"x\",\"\",\"x\")","v":"x"},{"$f":"IF(TABLA_TURNOS[[#This Row],[OBSERVACIÓN]]=\"x\",\"\",\"x\")","v":"x"},{"$f":"IF(TABLA_TURNOS[[#This Row],[OBSERVACIÓN]]=\"x\",\"\",\"x\")","v":"x"},"x",1,0,0,0,{"$f":"IF(TABLA_TURNOS[[#This Row],[DE SERVICIO]]=1,SUM(TABLA_TURNOS[[#This Row],[Mañanas]:[Noches]]),0)","v":0},{"$f":"IF(TABLA_TURNOS[[#This Row],[Mañanas]]=1,\"M\",IF(TABLA_TURNOS[[#This Row],[Tardes]]=1,\"T\",IF(TABLA_TURNOS[[#This Row],[Noches]]=1,\"N\",\"\")))","v":""}]
[null,{"$f":"MATCH(TABLA_TURNOS[[#This Row],[PERSONAL]],Capacidades_Personal,0)","v":23},"F23","x",{"$f":"IF(TABLA_TURNOS[[#This Row],[OBSERVACIÓN]]=\"x\",\"\",INDEX(Capacidades_Tabla,$B26,E$1) & \"\")","v":""},"x",{"$f":"IF(TABLA_TURNOS[[#This Row],[OBSERVACIÓN]]=\"x\",\"\",\"x\")","v":""},{"$f":"IF(TABLA_TURNOS[[#This Row],[OBSERVACIÓN]]=\"x\",\"\",\"x\")","v":""},{"$f":"IF(TABLA_TURNOS[[#This Row],[OBSERVACIÓN]]=\"x\",\"\",\"x\")","v":""},"x",1,0,0,0,{"$f":"IF(TABLA_TURNOS[[#This Row],[DE SERVICIO]]=1,SUM(TABLA_TURNOS[[#This Row],[Mañanas]:[Noches]]),0)","v":0},{"$f":"IF(TABLA_TURNOS[[#This Row],[Mañanas]]=1,\"M\",IF(TABLA_TURNOS[[#This Row],[Tardes]]=1,\"T\",IF(TABLA_TURNOS[[#This Row],[Noches]]=1,\"N\",\"\")))","v":""}]
[null,{"$f":"MATCH(TABLA_TURNOS[[#This Row],[PERSONAL]],Capacidades_Personal,0)","v":24},"F24","",{"$f":"IF(TABLA_TURNOS[[#This Row],[OBSERVACIÓN]]=\"x\",\"\",INDEX(Capacidades_Tabla,$B27,E$1) & \"\")","v":"x"},"x",{"$f":"IF(TABLA_TURNOS[[#This Row],[OBSERVACIÓN]]=\"x\",\"\",\"x\")","v":"x"},{"$f":"IF(TABLA_TURNOS[[#This Row],[OBSERVACIÓN]]=\"x\",\"\",\"x\")","v":"x"},{"$f":"IF(TABLA_TURNOS[[#This Row],[OBSERVACIÓN]]=\"x\",\"\",\"x\")","v":"x"},"x",1,0,0,1,{"$f":"IF(TABLA_TURNOS[[#This Row],[DE SERVICIO]]=1,SUM(TABLA_TURNOS[[#This Row],[Mañanas]:[Noches]]),0)","v":1},{"$f":"IF(TABLA_TURNOS[[#This Row],[Mañanas]]=1,\"M\",IF(TABLA_TURNOS[[#This Row],[Tardes]]=1,\"T\",IF(TABLA_TURNOS[[#This Row],[Noches]]=1,\"N\",\"\")))","v":"N"},2]
[null,{"$f":"MATCH(TABLA_TURNOS[[#This Row],[PERSONAL]],Capacidades_Personal,0)","v":25},"F25","x",{"$f":"IF(TABLA_TURNOS[[#This Row],[OBSERVACIÓN]]=\"x\",\"\",INDEX(Capacidades_Tabla,$B28,E$1) & \"\")","v":""},"x",{"$f":"IF(TABLA_TURNOS[[#This Row],[OBSERVACIÓN]]=\"x\",\"\",\"x\")","v":""},{"$f":"IF(TABLA_TURNOS[[#This Row],[OBSERVACIÓN]]=\"x\",\"\",\"x\")","v":""},{"$f":"IF(TABLA_TURNOS[[#This Row],[OBSERVACIÓN]]=\"x\",\"\",\"x\")","v":""},"x",1,0,1,0,{"$f":"IF(TABLA_TURNOS[[#This Row],[DE SERVICIO]]=1,SUM(TABLA_TURNOS[[#This Row],[Mañanas]:[Noches]]),0)","v":1},{"$f":"IF(TABLA_TURNOS[[#This Row],[Mañanas]]=1,\"M\",IF(TABLA_TURNOS[[#This Row],[Tardes]]=1,\"T\",IF(TABLA_TURNOS[[#This Row],[Noches]]=1,\"N\",\"\")))","v":"T"}]
[null,{"$f":"MATCH(TABLA_TURNOS[[#This Row],[PERSONAL]],Capacidades_Personal,0)","v":26},"F26","",{"$f":"IF(TABLA_TURNOS[[#This Row],[OBSERVACIÓN]]=\"x\",\"\",INDEX(Capacidades_Tabla,$B29,E$1) & \"\")","v":"x"},"",{"$f":"IF(TABLA_TURNOS[[#This Row],[OBSERVACIÓN]]=\"x\",\"\",\"x\")","v":"x"},{"$f":"IF(TABLA_TURNOS[[#This Row],[OBSERVACIÓN]]=\"x\",\"\",\"x\")","v":"x"},{"$f":"IF(TABLA_TURNOS[[#This Row],[OBSERVACIÓN]]=\"x\",\"\",\"x\")","v":"x"},"x",1,0,1,0,{"$f":"IF(TABLA_TURNOS[[#This Row],[DE SERVICIO]]=1,SUM(TABLA_TURNOS[[#This Row],[Mañanas]:[Noches]]),0)","v":1},{"$f":"IF(TABLA_TURNOS[[#This Row],[Mañanas]]=1,\"M\",IF(TABLA_TURNOS[[#This Row],[Tardes]]=1,\"T\",IF(TABLA_TURNOS[[#This Row],[Noches]]=1,\"N\",\"\")))","v":"T"}]
[null,{"$f":"MATCH(TABLA_TURNOS[[#This Row],[PERSONAL]],Capacidades_Personal,0)","v":27},"F27","",{"$f":"IF(TABLA_TURNOS[[#This Row],[OBSERVACIÓN]]=\"x\",\"\",INDEX(Capacidades_Tabla,$B30,E$1) & \"\")","v":""},"",{"$f":"IF(TABLA_TURNOS[[#This Row],[OBSERVACIÓN]]=\"x\",\"\",\"x\")","v":"x"},{"$f":"IF(TABLA_TURNOS[[#This Row],[OBSERVACIÓN]]=\"x\",\"\",\"x\")","v":"x"},{"$f":"IF(TABLA_TURNOS[[#This Row],[OBSERVACIÓN]]=\"x\",\"\",\"x\")","v":"x"},"x",1,0,1,0,{"$f":"IF(TABLA_TURNOS[[#This Row],[DE SERVICIO]]=1,SUM(TABLA_TURNOS[[#This Row],[Mañanas]:[Noches]]),0)","v":1},{"$f":"IF(TABLA_TURNOS[[#This Row],[Mañanas]]=1,\"M\",IF(TABLA_TURNOS[[#This Row],[Tardes]]=1,\"T\",IF(TABLA_TURNOS[[#This Row],[Noches]]=1,\"N\",\"\")))","v":"T"}]
[null,{"$f":"MATCH(TABLA_TURNOS[[#This Row],[PERSONAL]],Capacidades_Personal,0)","v":28},"F28","",{"$f":"IF(TABLA_TURNOS[[#This Row],[OBSERVACIÓN]]=\"x\",\"\",INDEX(Capacidades_Tabla,$B31,E$1) & \"\")","v":""},"",{"$f":"IF(TABLA_TURNOS[[#This Row],[OBSERVACIÓN]]=\"x\",\"\",\"x\")","v":"x"},{"$f":"IF(TABLA_TURNOS[[#This Row],[OBSERVACIÓN]]=\"x\",\"\",\"x\")","v":"x"},{"$f":"IF(TABLA_TURNOS[[#This Row],[OBSERVACIÓN]]=\"x\",\"\",\"x\")","v":"x"},"",1,0,1,0,{"$f":"IF(TABLA_TURNOS[[#This Row],[DE SERVICIO]]=1,SUM(TABLA_TURNOS[[#This Row],[Mañanas]:[Noches]]),0)","v":1},{"$f":"IF(TABLA_TURNOS[[#This Row],[Mañanas]]=1,\"M\",IF(TABLA_TURNOS[[#This Row],[Tardes]]=1,\"T\",IF(TABLA_TURNOS[[#This Row],[Noches]]=1,\"N\",\"\")))","v":"T"}]
[null,{"$f":"MATCH(TABLA_TURNOS[[#This Row],[PERSONAL]],Capacidades_Personal,0)","v":29},"F29","",{"$f":"IF(TABLA_TURNOS[[#This Row],[OBSERVACIÓN]]=\"x\",\"\",INDEX(Capacidades_Tabla,$B32,E$1) & \"\")","v":"x"},"x",{"$f":"IF(TABLA_TURNOS[[#This Row],[OBSERVACIÓN]]=\"x\",\"\",\"x\")","v":"x"},{"$f":"IF(TABLA_TURNOS[[#This Row],[OBSERVACIÓN]]=\"x\",\"\",\"x\")","v":"x"},{"$f":"IF(TABLA_TURNOS[[#This Row],[OBSERVACIÓN]]=\"x\",\"\",\"x\")","v":"x"},"x",1,0,1,0,{"$f":"IF(TABLA_TURNOS[[#This Row],[DE SERVICIO]]=1,SUM(TABLA_TURNOS[[#This Row],[Mañanas]:[Noches]]),0)","v":1},{"$f":"IF(TABLA_TURNOS[[#This Row],[Mañanas]]=1,\"M\",IF(TABLA_TURNOS[[#This Row],[Tardes]]=1,\"T\",IF(TABLA_TURNOS[[#This Row],[Noches]]=1,\"N\",\"\")))","v":"T"}]
[null,{"$f":"MATCH(TABLA_TURNOS[[#This Row],[PERSONAL]],Capacidades_Personal,0)","v":30},"F30","x",{"$f":"IF(TABLA_TURNOS[[#This Row],[OBSERVACIÓN]]=\"x\",\"\",INDEX(Capacidades_Tabla,$B33,E$1) & \"\")","v":""},"x",{"$f":"IF(TABLA_TURNOS[[#This Row],[OBSERVACIÓN]]=\"x\",\"\",\"x\")","v":""},{"$f":"IF(TABLA_TURNOS[[#This Row],[OBSERVACIÓN]]=\"x\",\"\",\"x\")","v":""},{"$f":"IF(TABLA_TURNOS[[#This Row],[OBSERVACIÓN]]=\"x\",\"\",\"x\")","v":""},"x",1,0,0,1,{"$f":"IF(TABLA_TURNOS[[#This Row],[DE SERVICIO]]=1,SUM(TABLA_TURNOS[[#This Row],[Mañanas]:[Noches]]),0)","v":1},{"$f":"IF(TABLA_TURNOS[[#This Row],[Mañanas]]=1,\"M\",IF(TABLA_TURNOS[[#This Row],[Tardes]]=1,\"T\",IF(TABLA_TURNOS[[#This Row],[Noches]]=1,\"N\",\"\")))","v":"N"},1]
[null,{"$f":"MATCH(TABLA_TURNOS[[#This Row],[PERSONAL]],Capacidades_Personal,0)","v":31},"F31",{"$f":"INDEX(Capacidades_Tabla,$B34,D$1) & \"\"","v":""},{"$f":"IF(TABLA_TURNOS[[#This Row],[OBSERVACIÓN]]=\"x\",\"\",INDEX(Capacidades_Tabla,$B34,E$1) & \"\")","v":""},"",{"$f":"IF(TABLA_TURNOS[[#This Row],[OBSERVACIÓN]]=\"x\",\"\",\"x\")","v":"x"},{"$f":"IF(TABLA_TURNOS[[#This Row],[OBSERVACIÓN]]=\"x\",\"\",\"x\")","v":"x"},{"$f":"IF(TABLA_TURNOS[[#This Row],[OBSERVACIÓN]]=\"x\",\"\",\"x\")","v":"x"},"",1,0,0,1,{"$f":"IF(TABLA_TURNOS[[#This Row],[DE SERVICIO]]=1,SUM(TABLA_TURNOS[[#This Row],[Mañanas]:[Noches]]),0)","v":1},{"$f":"IF(TABLA_TURNOS[[#This Row],[Mañanas]]=1,\"M\",IF(TABLA_TURNOS[[#This Row],[Tardes]]=1,\"T\",IF(TABLA_TURNOS[[#This Row],[Noches]]=1,\"N\",\"\")))","v":"N"},4]
[null,{"$f":"MATCH(TABLA_TURNOS[[#This Row],[PERSONAL]],Capacidades_Personal,0)","v":32},"F32","",{"$f":"IF(TABLA_TURNOS[[#This Row],[OBSERVACIÓN]]=\"x\",\"\",INDEX(Capacidades_Tabla,$B35,E$1) & \"\")","v":""},"",{"$f":"IF(TABLA_TURNOS[[#This Row],[OBSERVACIÓN]]=\"x\",\"\",\"x\")","v":"x"},{"$f":"IF(TABLA_TURNOS[[#This Row],[OBSERVACIÓN]]=\"x\",\"\",\"x\")","v":"x"},{"$f":"IF(TABLA_TURNOS[[#This Row],[OBSERVACIÓN]]=\"x\",\"\",\"x\")","v":"x"},"",1,0,0,1,{"$f":"IF(TABLA_TURNOS[[#This Row],[DE SERVICIO]]=1,SUM(TABLA_TURNOS[[#This Row],[Mañanas]:[Noches]]),0)","v":1},{"$f":"IF(TABLA_TURNOS[[#This Row],[Mañanas]]=1,\"M\",IF(TABLA_TURNOS[[#This Row],[Tardes]]=1,\"T\",IF(TABLA_TURNOS[[#This Row],[Noches]]=1,\"N\",\"\")))","v":"N"},5]
[null,{"$f":"MATCH(TABLA_TURNOS[[#This Row],[PERSONAL]],Capacidades_Personal,0)","v":33},"F33","x",{"$f":"IF(TABLA_TURNOS[[#This Row],[OBSERVACIÓN]]=\"x\",\"\",INDEX(Capacidades_Tabla,$B36,E$1) & \"\")","v":""},"x",{"$f":"IF(TABLA_TURNOS[[#This Row],[OBSERVACIÓN]]=\"x\",\"\",\"x\")","v":""},{"$f":"IF(TABLA_TURNOS[[#This Row],[OBSERVACIÓN]]=\"x\",\"\",\"x\")","v":""},{"$f":"IF(TABLA_TURNOS[[#This Row],[OBSERVACIÓN]]=\"x\",\"\",\"x\")","v":""},"x",1,0,0,1,{"$f":"IF(TABLA_TURNOS[[#This Row],[DE SERVICIO]]=1,SUM(TABLA_TURNOS[[#This Row],[Mañanas]:[Noches]]),0)","v":1},{"$f":"IF(TABLA_TURNOS[[#This Row],[Mañanas]]=1,\"M\",IF(TABLA_TURNOS[[#This Row],[Tardes]]=1,\"T\",IF(TABLA_TURNOS[[#This Row],[Noches]]=1,\"N\",\"\")))","v":"N"},1]
[null,{"$f":"MATCH(TABLA_TURNOS[[#This Row],[PERSONAL]],Capacidades_Personal,0)","v":34},"F34","",{"$f":"IF(TABLA_TURNOS[[#This Row],[OBSERVACIÓN]]=\"x\",\"\",INDEX(Capacidades_Tabla,$B37,E$1) & \"\")","v":""},"",{"$f":"IF(TABLA_TURNOS[[#This Row],[OBSERVACIÓN]]=\"x\",\"\",\"x\")","v":"x"},{"$f":"IF(TABLA_TURNOS[[#This Row],[OBSERVACIÓN]]=\"x\",\"\",\"x\")","v":"x"},{"$f":"IF(TABLA_TURNOS[[#This Row],[OBSERVACIÓN]]=\"x\",\"\",\"x\")","v":"x"},"x",1,0,0,1,{"$f":"IF(TABLA_TURNOS[[#This Row],[DE SERVICIO]]=1,SUM(TABLA_TURNOS[[#This Row],[Mañanas]:[Noches]]),0)","v":1},{"$f":"IF(TABLA_TURNOS[[#This Row],[Mañanas]]=1,\"M\",IF(TABLA_TURNOS[[#This Row],[Tardes]]=1,\"T\",IF(TABLA_TURNOS[[#This Row],[Noches]]=1,\"N\",\"\")))","v":"N"},5]
[null,{"$f":"MATCH(TABLA_TURNOS[[#This Row],[PERSONAL]],Capacidades_Personal,0)","v":35},"F35","",{"$f":"IF(TABLA_TURNOS[[#This Row],[OBSERVACIÓN]]=\"x\",\"\",INDEX(Capacidades_Tabla,$B38,E$1) & \"\")","v":""},"",{"$f":"IF(TABLA_TURNOS[[#This Row],[OBSERVACIÓN]]=\"x\",\"\",\"x\")","v":"x"},{"$f":"IF(TABLA_TURNOS[[#This Row],[OBSERVACIÓN]]=\"x\",\"\",\"x\")","v":"x"},{"$f":"IF(TABLA_TURNOS[[#This Row],[OBSERVACIÓN]]=\"x\",\"\",\"x\")","v":"x"},"",1,0,0,1,{"$f":"IF(TABLA_TURNOS[[#This Row],[DE SERVICIO]]=1,SUM(TABLA_TURNOS[[#This Row],[Mañanas]:[Noches]]),0)","v":1},{"$f":"IF(TABLA_TURNOS[[#This Row],[Mañanas]]=1,\"M\",IF(TABLA_TURNOS[[#This Row],[Tardes]]=1,\"T\",IF(TABLA_TURNOS[[#This Row],[Noches]]=1,\"N\",\"\")))","v":"N"},6]
[null,{"$f":"MATCH(TABLA_TURNOS[[#This Row],[PERSONAL]],Capacidades_Personal,0)","v":36},"F36","",{"$f":"IF(TABLA_TURNOS[[#This Row],[OBSERVACIÓN]]=\"x\",\"\",INDEX(Capacidades_Tabla,$B39,E$1) & \"\")","v":""},"",{"$f":"IF(TABLA_TURNOS[[#This Row],[OBSERVACIÓN]]=\"x\",\"\",\"x\")","v":"x"},{"$f":"IF(TABLA_TURNOS[[#This Row],[OBSERVACIÓN]]=\"x\",\"\",\"x\")","v":"x"},{"$f":"IF(TABLA_TURNOS[[#This Row],[OBSERVACIÓN]]=\"x\",\"\",\"x\")","v":"x"},"",1,0,0,1,{"$f":"IF(TABLA_TURNOS[[#This Row],[DE SERVICIO]]=1,SUM(TABLA_TURNOS[[#This Row],[Mañanas]:[Noches]]),0)","v":1},{"$f":"IF(TABLA_TURNOS[[#This Row],[Mañanas]]=1,\"M\",IF(TABLA_TURNOS[[#This Row],[Tardes]]=1,\"T\",IF(TABLA_TURNOS[[#This Row],[Noches]]=1,\"N\",\"\")))","v":"N"}]
[null,{"$f":"MATCH(TABLA_TURNOS[[#This Row],[PERSONAL]],Capacidades_Personal,0)","v":37},"F37","",{"$f":"IF(TABLA_TURNOS[[#This Row],[OBSERVACIÓN]]=\"x\",\"\",INDEX(Capacidades_Tabla,$B40,E$1) & \"\")","v":""},"",{"$f":"IF(TABLA_TURNOS[[#This Row],[OBSERVACIÓN]]=\"x\",\"\",\"x\")","v":"x"},{"$f":"IF(TABLA_TURNOS[[#This Row],[OBSERVACIÓN]]=\"x\",\"\",\"x\")","v":"x"},{"$f":"IF(TABLA_TURNOS[[#This Row],[OBSERVACIÓN]]=\"x\",\"\",\"x\")","v":"x"},"x",1,0,0,1,{"$f":"IF(TABLA_TURNOS[[#This Row],[DE SERVICIO]]=1,SUM(TABLA_TURNOS[[#This Row],[Mañanas]:[Noches]]),0)","v":1},{"$f":"IF(TABLA_TURNOS[[#This Row],[Mañanas]]=1,\"M\",IF(TABLA_TURNOS[[#This Row],[Tardes]]=1,\"T\",IF(TABLA_TURNOS[[#This Row],[Noches]]=1,\"N\",\"\")))","v":"N"},7]
[null,{"$f":"MATCH(TABLA_TURNOS[[#This Row],[PERSONAL]],Capacidades_Personal,0)","v":38},"F38","",{"$f":"IF(TABLA_TURNOS[[#This Row],[OBSERVACIÓN]]=\"x\",\"\",INDEX(Capacidades_Tabla,$B41,E$1) & \"\")","v":"x"},"",{"$f":"IF(TABLA_TURNOS[[#This Row],[OBSERVACIÓN]]=\"x\",\"\",\"x\")","v":"x"},{"$f":"IF(TABLA_TURNOS[[#This Row],[OBSERVACIÓN]]=\"x\",\"\",\"x\")","v":"x"},{"$f":"IF(TABLA_TURNOS[[#This Row],[OBSERVACIÓN]]=\"x\",\"\",\"x\")","v":"x"},"x",1,0,1,0,{"$f":"IF(TABLA_TURNOS[[#This Row],[DE SERVICIO]]=1,SUM(TABLA_TURNOS[[#This Row],[Mañanas]:[Noches]]),0)","v":1},{"$f":"IF(TABLA_TURNOS[[#This Row],[Mañanas]]=1,\"M\",IF(TABLA_TURNOS[[#This Row],[Tardes]]=1,\"T\",IF(TABLA_TURNOS[[#This Row],[Noches]]=1,\"N\",\"\")))","v":"T"}]
[null,{"$f":"MATCH(TABLA_TURNOS[[#This Row],[PERSONAL]],Capacidades_Personal,0)","v":39},"F39","x",{"$f":"IF(TABLA_TURNOS[[#This Row],[OBSERVACIÓN]]=\"x\",\"\",INDEX(Capacidades_Tabla,$B42,E$1) & \"\")","v":""},"x",{"$f":"IF(TABLA_TURNOS[[#This Row],[OBSERVACIÓN]]=\"x\",\"\",\"x\")","v":""},{"$f":"IF(TABLA_TURNOS[[#This Row],[OBSERVACIÓN]]=\"x\",\"\",\"x\")","v":""},{"$f":"IF(TABLA_TURNOS[[#This Row],[OBSERVACIÓN]]=\"x\",\"\",\"x\")","v":""},"x",1,0,1,0,{"$f":"IF(TABLA_TURNOS[[#This Row],[DE SERVICIO]]=1,SUM(TABLA_TURNOS[[#This Row],[Mañanas]:[Noches]]),0)","v":1},{"$f":"IF(TABLA_TURNOS[[#This Row],[Mañanas]]=1,\"M\",IF(TABLA_TURNOS[[#This Row],[Tardes]]=1,\"T\",IF(TABLA_TURNOS[[#This Row],[Noches]]=1,\"N\",\"\")))","v":"T"}]
[null,{"$f":"MATCH(TABLA_TURNOS[[#This Row],[PERSONAL]],Capacidades_Personal,0)","v":40},"F40","",{"$f":"IF(TABLA_TURNOS[[#This Row],[OBSERVACIÓN]]=\"x\",\"\",INDEX(Capacidades_Tabla,$B43,E$1) & \"\")","v":""},"",{"$f":"IF(TABLA_TURNOS[[#This Row],[OBSERVACIÓN]]=\"x\",\"\",\"x\")","v":"x"},{"$f":"IF(TABLA_TURNOS[[#This Row],[OBSERVACIÓN]]=\"x\",\"\",\"x\")","v":"x"},{"$f":"IF(TABLA_TURNOS[[#This Row],[OBSERVACIÓN]]=\"x\",\"\",\"x\")","v":"x"},"x",1,1,0,0,{"$f":"IF(TABLA_TURNOS[[#This Row],[DE SERVICIO]]=1,SUM(TABLA_TURNOS[[#This Row],[Mañanas]:[Noches]]),0)","v":1},{"$f":"IF(TABLA_TURNOS[[#This Row],[Mañanas]]=1,\"M\",IF(TABLA_TURNOS[[#This Row],[Tardes]]=1,\"T\",IF(TABLA_TURNOS[[#This Row],[Noches]]=1,\"N\",\"\")))","v":"M"}]
[null,{"$f":"MATCH(TABLA_TURNOS[[#This Row],[PERSONAL]],Capacidades_Personal,0)","v":41},"F41",{"$f":"INDEX(Capacidades_Tabla,$B44,D$1) & \"\"","v":""},{"$f":"IF(TABLA_TURNOS[[#This Row],[OBSERVACIÓN]]=\"x\",\"\",INDEX(Capacidades_Tabla,$B44,E$1) & \"\")","v":""},"",{"$f":"IF(TABLA_TURNOS[[#This Row],[OBSERVACIÓN]]=\"x\",\"\",\"x\")","v":"x"},{"$f":"IF(TABLA_TURNOS[[#This Row],[OBSERVACIÓN]]=\"x\",\"\",\"x\")","v":"x"},{"$f":"IF(TABLA_TURNOS[[#This Row],[OBSERVACIÓN]]=\"x\",\"\",\"x\")","v":"x"},"x",1,0,1,0,{"$f":"IF(TABLA_TURNOS[[#This Row],[DE SERVICIO]]=1,SUM(TABLA_TURNOS[[#This Row],[Mañanas]:[Noches]]),0)","v":1},{"$f":"IF(TABLA_TURNOS[[#This Row],[Mañanas]]=1,\"M\",IF(TABLA_TURNOS[[#This Row],[Tardes]]=1,\"T\",IF(TABLA_TURNOS[[#This Row],[Noches]]=1,\"N\",\"\")))","v":"T"}]
[null,{"$f":"MATCH(TABLA_TURNOS[[#This Row],[PERSONAL]],Capacidades_Personal,0)","v":42},"F42","",{"$f":"IF(TABLA_TURNOS[[#This Row],[OBSERVACIÓN]]=\"x\",\"\",INDEX(Capacidades_Tabla,$B45,E$1) & \"\")","v":"x"},"x",{"$f":"IF(TABLA_TURNOS[[#This Row],[OBSERVACIÓN]]=\"x\",\"\",\"x\")","v":"x"},{"$f":"IF(TABLA_TURNOS[[#This Row],[OBSERVACIÓN]]=\"x\",\"\",\"x\")","v":"x"},{"$f":"IF(TABLA_TURNOS[[#This Row],[OBSERVACIÓN]]=\"x\",\"\",\"x\")","v":"x"},"x",1,0,1,0,{"$f":"IF(TABLA_TURNOS[[#This Row],[DE SERVICIO]]=1,SUM(TABLA_TURNOS[[#This Row],[Mañanas]:[Noches]]),0)","v":1},{"$f":"IF(TABLA_TURNOS[[#This Row],[Mañanas]]=1,\"M\",IF(TABLA_TURNOS[[#This Row],[Tardes]]=1,\"T\",IF(TABLA_TURNOS[[#This Row],[Noches]]=1,\"N\",\"\")))","v":"T"}]
[null,{"$f":"MATCH(TABLA_TURNOS[[#This Row],[PERSONAL]],Capacidades_Personal,0)","v":43},"F43","",{"$f":"IF(TABLA_TURNOS[[#This Row],[OBSERVACIÓN]]=\"x\",\"\",INDEX(Capacidades_Tabla,$B46,E$1) & \"\")","v":""},"",{"$f":"IF(TABLA_TURNOS[[#This Row],[OBSERVACIÓN]]=\"x\",\"\",\"x\")","v":"x"},{"$f":"IF(TABLA_TURNOS[[#This Row],[OBSERVACIÓN]]=\"x\",\"\",\"x\")","v":"x"},{"$f":"IF(TABLA_TURNOS[[#This Row],[OBSERVACIÓN]]=\"x\",\"\",\"x\")","v":"x"},"",1,0,1,0,{"$f":"IF(TABLA_TURNOS[[#This Row],[DE SERVICIO]]=1,SUM(TABLA_TURNOS[[#This Row],[Mañanas]:[Noches]]),0)","v":1},{"$f":"IF(TABLA_TURNOS[[#This Row],[Mañanas]]=1,\"M\",IF(TABLA_TURNOS[[#This Row],[Tardes]]=1,\"T\",IF(TABLA_TURNOS[[#This Row],[Noches]]=1,\"N\",\"\")))","v":"T"}]
[null,{"$f":"MATCH(TABLA_TURNOS[[#This Row],[PERSONAL]],Capacidades_Personal,0)","v":44},"F44","x",{"$f":"IF(TABLA_TURNOS[[#This Row],[OBSERVACIÓN]]=\"x\",\"\",INDEX(Capacidades_Tabla,$B47,E$1) & \"\")","v":""},"x",{"$f":"IF(TABLA_TURNOS[[#This Row],[OBSERVACIÓN]]=\"x\",\"\",\"x\")","v":""},{"$f":"IF(TABLA_TURNOS[[#This Row],[OBSERVACIÓN]]=\"x\",\"\",\"x\")","v":""},{"$f":"IF(TABLA_TURNOS[[#This Row],[OBSERVACIÓN]]=\"x\",\"\",\"x\")","v":""},"x",1,0,1,0,{"$f":"IF(TABLA_TURNOS[[#This Row],[DE SERVICIO]]=1,SUM(TABLA_TURNOS[[#This Row],[Mañanas]:[Noches]]),0)","v":1},{"$f":"IF(TABLA_TURNOS[[#This Row],[Mañanas]]=1,\"M\",IF(TABLA_TURNOS[[#This Row],[Tardes]]=1,\"T\",IF(TABLA_TURNOS[[#This Row],[Noches]]=1,\"N\",\"\")))","v":"T"}]
[null,{"$f":"MATCH(TABLA_TURNOS[[#This Row],[PERSONAL]],Capacidades_Personal,0)","v":45},"F45","",{"$f":"IF(TABLA_TURNOS[[#This Row],[OBSERVACIÓN]]=\"x\",\"\",INDEX(Capacidades_Tabla,$B48,E$1) & \"\")","v":""},"",{"$f":"IF(TABLA_TURNOS[[#This Row],[OBSERVACIÓN]]=\"x\",\"\",\"x\")","v":"x"},{"$f":"IF(TABLA_TURNOS[[#This Row],[OBSERVACIÓN]]=\"x\",\"\",\"x\")","v":"x"},{"$f":"IF(TABLA_TURNOS[[#This Row],[OBSERVACIÓN]]=\"x\",\"\",\"x\")","v":"x"},"x",1,0,1,0,{"$f":"IF(TABLA_TURNOS[[#This Row],[DE SERVICIO]]=1,SUM(TABLA_TURNOS[[#This Row],[Mañanas]:[Noches]]),0)","v":1},{"$f":"IF(TABLA_TURNOS[[#This Row],[Mañanas]]=1,\"M\",IF(TABLA_TURNOS[[#This Row],[Tardes]]=1,\"T\",IF(TABLA_TURNOS[[#This Row],[Noches]]=1,\"N\",\"\")))","v":"T"}]
[null,{"$f":"MATCH(TABLA_TURNOS[[#This Row],[PERSONAL]],Capacidades_Personal,0)","v":46},"F46","x",{"$f":"IF(TABLA_TURNOS[[#This Row],[OBSERVACIÓN]]=\"x\",\"\",INDEX(Capacidades_Tabla,$B49,E$1) & \"\")","v":""},"x",{"$f":"IF(TABLA_TURNOS[[#This Row],[OBSERVACIÓN]]=\"x\",\"\",\"x\")","v":""},{"$f":"IF(TABLA_TURNOS[[#This Row],[OBSERVACIÓN]]=\"x\",\"\",\"x\")","v":""},{"$f":"IF(TABLA_TURNOS[[#This Row],[OBSERVACIÓN]]=\"x\",\"\",\"x\")","v":""},"x",1,0,1,0,{"$f":"IF(TABLA_TURNOS[[#This Row],[DE SERVICIO]]=1,SUM(TABLA_TURNOS[[#This Row],[Mañanas]:[Noches]]),0)","v":1},{"$f":"IF(TABLA_TURNOS[[#This Row],[Mañanas]]=1,\"M\",IF(TABLA_TURNOS[[#This Row],[Tardes]]=1,\"T\",IF(TABLA_TURNOS[[#This Row],[Noches]]=1,\"N\",\"\")))","v":"T"}]
[null,{"$f":"MATCH(TABLA_TURNOS[[#This Row],[PERSONAL]],Capacidades_Personal,0)","v":47},"F47","",{"$f":"IF(TABLA_TURNOS[[#This Row],[OBSERVACIÓN]]=\"x\",\"\",INDEX(Capacidades_Tabla,$B50,E$1) & \"\")","v":"x"},"x",{"$f":"IF(TABLA_TURNOS[[#This Row],[OBSERVACIÓN]]=\"x\",\"\",\"x\")","v":"x"},{"$f":"IF(TABLA_TURNOS[[#This Row],[OBSERVACIÓN]]=\"x\",\"\",\"x\")","v":"x"},{"$f":"IF(TABLA_TURNOS[[#This Row],[OBSERVACIÓN]]=\"x\",\"\",\"x\")","v":"x"},"x",1,0,1,0,{"$f":"IF(TABLA_TURNOS[[#This Row],[DE SERVICIO]]=1,SUM(TABLA_TURNOS[[#This Row],[Mañanas]:[Noches]]),0)","v":1},{"$f":"IF(TABLA_TURNOS[[#This Row],[Mañanas]]=1,\"M\",IF(TABLA_TURNOS[[#This Row],[Tardes]]=1,\"T\",IF(TABLA_TURNOS[[#This Row],[Noches]]=1,\"N\",\"\")))","v":"T"}]
[null,{"$f":"MATCH(TABLA_TURNOS[[#This Row],[PERSONAL]],Capacidades_Personal,0)","v":48},"F48","",{"$f":"IF(TABLA_TURNOS[[#This Row],[OBSERVACIÓN]]=\"x\",\"\",INDEX(Capacidades_Tabla,$B51,E$1) & \"\")","v":"x"},"",{"$f":"IF(TABLA_TURNOS[[#This Row],[OBSERVACIÓN]]=\"x\",\"\",\"x\")","v":"x"},{"$f":"IF(TABLA_TURNOS[[#This Row],[OBSERVACIÓN]]=\"x\",\"\",\"x\")","v":"x"},{"$f":"IF(TABLA_TURNOS[[#This Row],[OBSERVACIÓN]]=\"x\",\"\",\"x\")","v":"x"},"x",1,0,1,0,{"$f":"IF(TABLA_TURNOS[[#This Row],[DE SERVICIO]]=1,SUM(TABLA_TURNOS[[#This Row],[Mañanas]:[Noches]]),0)","v":1},{"$f":"IF(TABLA_TURNOS[[#This Row],[Mañanas]]=1,\"M\",IF(TABLA_TURNOS[[#This Row],[Tardes]]=1,\"T\",IF(TABLA_TURNOS[[#This Row],[Noches]]=1,\"N\",\"\")))","v":"T"}]
[null,{"$f":"MATCH(TABLA_TURNOS[[#This Row],[PERSONAL]],Capacidades_Personal,0)","v":49},"F49","",{"$f":"IF(TABLA_TURNOS[[#This Row],[OBSERVACIÓN]]=\"x\",\"\",INDEX(Capacidades_Tabla,$B52,E$1) & \"\")","v":"x"},"",{"$f":"IF(TABLA_TURNOS[[#This Row],[OBSERVACIÓN]]=\"x\",\"\",\"x\")","v":"x"},{"$f":"IF(TABLA_TURNOS[[#This Row],[OBSERVACIÓN]]=\"x\",\"\",\"x\")","v":"x"},{"$f":"IF(TABLA_TURNOS[[#This Row],[OBSERVACIÓN]]=\"x\",\"\",\"x\")","v":"x"},"x",1,1,0,0,{"$f":"IF(TABLA_TURNOS[[#This Row],[DE SERVICIO]]=1,SUM(TABLA_TURNOS[[#This Row],[Mañanas]:[Noches]]),0)","v":1},{"$f":"IF(TABLA_TURNOS[[#This Row],[Mañanas]]=1,\"M\",IF(TABLA_TURNOS[[#This Row],[Tardes]]=1,\"T\",IF(TABLA_TURNOS[[#This Row],[Noches]]=1,\"N\",\"\")))","v":"M"}]
[null,{"$f":"MATCH(TABLA_TURNOS[[#This Row],[PERSONAL]],Capacidades_Personal,0)","v":50},"F50","x",{"$f":"IF(TABLA_TURNOS[[#This Row],[OBSERVACIÓN]]=\"x\",\"\",INDEX(Capacidades_Tabla,$B53,E$1) & \"\")","v":""},"x",{"$f":"IF(TABLA_TURNOS[[#This Row],[OBSERVACIÓN]]=\"x\",\"\",\"x\")","v":""},{"$f":"IF(TABLA_TURNOS[[#This Row],[OBSERVACIÓN]]=\"x\",\"\",\"x\")","v":""},{"$f":"IF(TABLA_TURNOS[[#This Row],[OBSERVACIÓN]]=\"x\",\"\",\"x\")","v":""},"x",1,1,0,0,{"$f":"IF(TABLA_TURNOS[[#This Row],[DE SERVICIO]]=1,SUM(TABLA_TURNOS[[#This Row],[Mañanas]:[Noches]]),0)","v":1},{"$f":"IF(TABLA_TURNOS[[#This Row],[Mañanas]]=1,\"M\",IF(TABLA_TURNOS[[#This Row],[Tardes]]=1,\"T\",IF(TABLA_TURNOS[[#This Row],[Noches]]=1,\"N\",\"\")))","v":"M"}]
[null,{"$f":"MATCH(TABLA_TURNOS[[#This Row],[PERSONAL]],Capacidades_Personal,0)","v":51},"F51",{"$f":"INDEX(Capacidades_Tabla,$B54,D$1) & \"\"","v":"x"},{"$f":"IF(TABLA_TURNOS[[#This Row],[OBSERVACIÓN]]=\"x\",\"\",INDEX(Capacidades_Tabla,$B54,E$1) & \"\")","v":""},"",{"$f":"IF(TABLA_TURNOS[[#This Row],[OBSERVACIÓN]]=\"x\",\"\",\"x\")","v":""},{"$f":"IF(TABLA_TURNOS[[#This Row],[OBSERVACIÓN]]=\"x\",\"\",\"x\")","v":""},{"$f":"IF(TABLA_TURNOS[[#This Row],[OBSERVACIÓN]]=\"x\",\"\",\"x\")","v":""},"",1,1,0,0,{"$f":"IF(TABLA_TURNOS[[#This Row],[DE SERVICIO]]=1,SUM(TABLA_TURNOS[[#This Row],[Mañanas]:[Noches]]),0)","v":1},{"$f":"IF(TABLA_TURNOS[[#This Row],[Mañanas]]=1,\"M\",IF(TABLA_TURNOS[[#This Row],[Tardes]]=1,\"T\",IF(TABLA_TURNOS[[#This Row],[Noches]]=1,\"N\",\"\")))","v":"M"}]
[null,{"$f":"MATCH(TABLA_TURNOS[[#This Row],[PERSONAL]],Capacidades_Personal,0)","v":52},"F52","x",{"$f":"IF(TABLA_TURNOS[[#This Row],[OBSERVACIÓN]]=\"x\",\"\",INDEX(Capacidades_Tabla,$B55,E$1) & \"\")","v":""},"x",{"$f":"IF(TABLA_TURNOS[[#This Row],[OBSERVACIÓN]]=\"x\",\"\",\"x\")","v":""},{"$f":"IF(TABLA_TURNOS[[#This Row],[OBSERVACIÓN]]=\"x\",\"\",\"x\")","v":""},{"$f":"IF(TABLA_TURNOS[[#This Row],[OBSERVACIÓN]]=\"x\",\"\",\"x\")","v":""},"x",1,1,0,0,{"$f":"IF(TABLA_TURNOS[[#This Row],[DE SERVICIO]]=1,SUM(TABLA_TURNOS[[#This Row],[Mañanas]:[Noches]]),0)","v":1},{"$f":"IF(TABLA_TURNOS[[#This Row],[Mañanas]]=1,\"M\",IF(TABLA_TURNOS[[#This Row],[Tardes]]=1,\"T\",IF(TABLA_TURNOS[[#This Row],[Noches]]=1,\"N\",\"\")))","v":"M"}]
[null,{"$f":"MATCH(TABLA_TURNOS[[#This Row],[PERSONAL]],Capacidades_Personal,0)","v":53},"F53","x",{"$f":"IF(TABLA_TURNOS[[#This Row],[OBSERVACIÓN]]=\"x\",\"\",INDEX(Capacidades_Tabla,$B56,E$1) & \"\")","v":""},"",{"$f":"IF(TABLA_TURNOS[[#This Row],[OBSERVACIÓN]]=\"x\",\"\",\"x\")","v":""},{"$f":"IF(TABLA_TURNOS[[#This Row],[OBSERVACIÓN]]=\"x\",\"\",\"x\")","v":""},{"$f":"IF(TABLA_TURNOS[[#This Row],[OBSERVACIÓN]]=\"x\",\"\",\"x\")","v":""},"",1,1,0,0,{"$f":"IF(TABLA_TURNOS[[#This Row],[DE SERVICIO]]=1,SUM(TABLA_TURNOS[[#This Row],[Mañanas]:[Noches]]),0)","v":1},{"$f":"IF(TABLA_TURNOS[[#This Row],[Mañanas]]=1,\"M\",IF(TABLA_TURNOS[[#This Row],[Tardes]]=1,\"T\",IF(TABLA_TURNOS[[#This Row],[Noches]]=1,\"N\",\"\")))","v":"M"}]
[null,{"$f":"MATCH(TABLA_TURNOS[[#This Row],[PERSONAL]],Capacidades_Personal,0)","v":54},"F54","x",{"$f":"IF(TABLA_TURNOS[[#This Row],[OBSERVACIÓN]]=\"x\",\"\",INDEX(Capacidades_Tabla,$B57,E$1) & \"\")","v":""},"",{"$f":"IF(TABLA_TURNOS[[#This Row],[OBSERVACIÓN]]=\"x\",\"\",\"x\")","v":""},{"$f":"IF(TABLA_TURNOS[[#This Row],[OBSERVACIÓN]]=\"x\",\"\",\"x\")","v":""},{"$f":"IF(TABLA_TURNOS[[#This Row],[OBSERVACIÓN]]=\"x\",\"\",\"x\")","v":""},"",1,1,0,0,{"$f":"IF(TABLA_TURNOS[[#This Row],[DE SERVICIO]]=1,SUM(TABLA_TURNOS[[#This Row],[Mañanas]:[Noches]]),0)","v":1},{"$f":"IF(TABLA_TURNOS[[#This Row],[Mañanas]]=1,\"M\",IF(TABLA_TURNOS[[#This Row],[Tardes]]=1,\"T\",IF(TABLA_TURNOS[[#This Row],[Noches]]=1,\"N\",\"\")))","v":"M"}]
[null,{"$f":"MATCH(TABLA_TURNOS[[#This Row],[PERSONAL]],Capacidades_Personal,0)","v":55},"F55","",{"$f":"IF(TABLA_TURNOS[[#This Row],[OBSERVACIÓN]]=\"x\",\"\",INDEX(Capacidades_Tabla,$B58,E$1) & \"\")","v":"x"},"",{"$f":"IF(TABLA_TURNOS[[#This Row],[OBSERVACIÓN]]=\"x\",\"\",\"x\")","v":"x"},{"$f":"IF(TABLA_TURNOS[[#This Row],[OBSERVACIÓN]]=\"x\",\"\",\"x\")","v":"x"},{"$f":"IF(TABLA_TURNOS[[#This Row],[OBSERVACIÓN]]=\"x\",\"\",\"x\")","v":"x"},"x",1,1,0,0,{"$f":"IF(TABLA_TURNOS[[#This Row],[DE SERVICIO]]=1,SUM(TABLA_TURNOS[[#This Row],[Mañanas]:[Noches]]),0)","v":1},{"$f":"IF(TABLA_TURNOS[[#This Row],[Mañanas]]=1,\"M\",IF(TABLA_TURNOS[[#This Row],[Tardes]]=1,\"T\",IF(TABLA_TURNOS[[#This Row],[Noches]]=1,\"N\",\"\")))","v":"M"}]
[null,{"$f":"MATCH(TABLA_TURNOS[[#This Row],[PERSONAL]],Capacidades_Personal,0)","v":56},"F56","",{"$f":"IF(TABLA_TURNOS[[#This Row],[OBSERVACIÓN]]=\"x\",\"\",INDEX(Capacidades_Tabla,$B59,E$1) & \"\")","v":""},"",{"$f":"IF(TABLA_TURNOS[[#This Row],[OBSERVACIÓN]]=\"x\",\"\",\"x\")","v":"x"},{"$f":"IF(TABLA_TURNOS[[#This Row],[OBSERVACIÓN]]=\"x\",\"\",\"x\")","v":"x"},{"$f":"IF(TABLA_TURNOS[[#This Row],[OBSERVACIÓN]]=\"x\",\"\",\"x\")","v":"x"},"",1,1,0,0,{"$f":"IF(TABLA_TURNOS[[#This Row],[DE SERVICIO]]=1,SUM(TABLA_TURNOS[[#This Row],[Mañanas]:[Noches]]),0)","v":1},{"$f":"IF(TABLA_TURNOS[[#This Row],[Mañanas]]=1,\"M\",IF(TABLA_TURNOS[[#This Row],[Tardes]]=1,\"T\",IF(TABLA_TURNOS[[#This Row],[Noches]]=1,\"N\",\"\")))","v":"M"}]
[null,{"$f":"MATCH(TABLA_TURNOS[[#This Row],[PERSONAL]],Capacidades_Personal,0)","v":57},"F57","",{"$f":"IF(TABLA_TURNOS[[#This Row],[OBSERVACIÓN]]=\"x\",\"\",INDEX(Capacidades_Tabla,$B60,E$1) & \"\")","v":"x"},"x",{"$f":"IF(TABLA_TURNOS[[#This Row],[OBSERVACIÓN]]=\"x\",\"\",\"x\")","v":"x"},{"$f":"IF(TABLA_TURNOS[[#This Row],[OBSERVACIÓN]]=\"x\",\"\",\"x\")","v":"x"},{"$f":"IF(TABLA_TURNOS[[#This Row],[OBSERVACIÓN]]=\"x\",\"\",\"x\")","v":"x"},"x",1,1,0,0,{"$f":"IF(TABLA_TURNOS[[#This Row],[DE SERVICIO]]=1,SUM(TABLA_TURNOS[[#This Row],[Mañanas]:[Noches]]),0)","v":1},{"$f":"IF(TABLA_TURNOS[[#This Row],[Mañanas]]=1,\"M\",IF(TABLA_TURNOS[[#This Row],[Tardes]]=1,\"T\",IF(TABLA_TURNOS[[#This Row],[Noches]]=1,\"N\",\"\")))","v":"M"}]
[null,{"$f":"MATCH(TABLA_TURNOS[[#This Row],[PERSONAL]],Capacidades_Personal,0)","v":58},"F58","",{"$f":"IF(TABLA_TURNOS[[#This Row],[OBSERVACIÓN]]=\"x\",\"\",INDEX(Capacidades_Tabla,$B61,E$1) & \"\")","v":"x"},"x",{"$f":"IF(TABLA_TURNOS[[#This Row],[OBSERVACIÓN]]=\"x\",\"\",\"x\")","v":"x"},{"$f":"IF(TABLA_TURNOS[[#This Row],[OBSERVACIÓN]]=\"x\",\"\",\"x\")","v":"x"},{"$f":"IF(TABLA_TURNOS[[#This Row],[OBSERVACIÓN]]=\"x\",\"\",\"x\")","v":"x"},"x",1,1,0,0,{"$f":"IF(TABLA_TURNOS[[#This Row],[DE SERVICIO]]=1,SUM(TABLA_TURNOS[[#This Row],[Mañanas]:[Noches]]),0)","v":1},{"$f":"IF(TABLA_TURNOS[[#This Row],[Mañanas]]=1,\"M\",IF(TABLA_TURNOS[[#This Row],[Tardes]]=1,\"T\",IF(TABLA_TURNOS[[#This Row],[Noches]]=1,\"N\",\"\")))","v":"M"}]
[null,{"$f":"MATCH(TABLA_TURNOS[[#This Row],[PERSONAL]],Capacidades_Personal,0)","v":59},"F59","",{"$f":"IF(TABLA_TURNOS[[#This Row],[OBSERVACIÓN]]=\"x\",\"\",INDEX(Capacidades_Tabla,$B62,E$1) & \"\")","v":"x"},"x",{"$f":"IF(TABLA_TURNOS[[#This Row],[OBSERVACIÓN]]=\"x\",\"\",\"x\")","v":"x"},{"$f":"IF(TABLA_TURNOS[[#This Row],[OBSERVACIÓN]]=\"x\",\"\",\"x\")","v":"x"},{"$f":"IF(TABLA_TURNOS[[#This Row],[OBSERVACIÓN]]=\"x\",\"\",\"x\")","v":"x"},"x",1,1,0,0,{"$f":"IF(TABLA_TURNOS[[#This Row],[DE SERVICIO]]=1,SUM(TABLA_TURNOS[[#This Row],[Mañanas]:[Noches]]),0)","v":1},{"$f":"IF(TABLA_TURNOS[[#This Row],[Mañanas]]=1,\"M\",IF(TABLA_TURNOS[[#This Row],[Tardes]]=1,\"T\",IF(TABLA_TURNOS[[#This Row],[Noches]]=1,\"N\",\"\")))","v":"M"}]
[null,{"$f":"MATCH(TABLA_TURNOS[[#This Row],[PERSONAL]],Capacidades_Personal,0)","v":60},"F60","",{"$f":"IF(TABLA_TURNOS[[#This Row],[OBSERVACIÓN]]=\"x\",\"\",INDEX(Capacidades_Tabla,$B63,E$1) & \"\")","v":""},"",{"$f":"IF(TABLA_TURNOS[[#This Row],[OBSERVACIÓN]]=\"x\",\"\",\"x\")","v":"x"},{"$f":"IF(TABLA_TURNOS[[#This Row],[OBSERVACIÓN]]=\"x\",\"\",\"x\")","v":"x"},{"$f":"IF(TABLA_TURNOS[[#This Row],[OBSERVACIÓN]]=\"x\",\"\",\"x\")","v":"x"},"",1,1,0,0,{"$f":"IF(TABLA_TURNOS[[#This Row],[DE SERVICIO]]=1,SUM(TABLA_TURNOS[[#This Row],[Mañanas]:[Noches]]),0)","v":1},{"$f":"IF(TABLA_TURNOS[[#This Row],[Mañanas]]=1,\"M\",IF(TABLA_TURNOS[[#This Row],[Tardes]]=1,\"T\",IF(TABLA_TURNOS[[#This Row],[Noches]]=1,\"N\",\"\")))","v":"M"}]
[null,{"$f":"MATCH(TABLA_TURNOS[[#This Row],[PERSONAL]],Capacidades_Personal,0)","v":61},"F61","",{"$f":"IF(TABLA_TURNOS[[#This Row],[OBSERVACIÓN]]=\"x\",\"\",INDEX(Capacidades_Tabla,$B64,E$1) & \"\")","v":""},"",{"$f":"IF(TABLA_TURNOS[[#This Row],[OBSERVACIÓN]]=\"x\",\"\",\"x\")","v":"x"},{"$f":"IF(TABLA_TURNOS[[#This Row],[OBSERVACIÓN]]=\"x\",\"\",\"x\")","v":"x"},{"$f":"IF(TABLA_TURNOS[[#This Row],[OBSERVACIÓN]]=\"x\",\"\",\"x\")","v":"x"},"x",1,1,0,0,{"$f":"IF(TABLA_TURNOS[[#This Row],[DE SERVICIO]]=1,SUM(TABLA_TURNOS[[#This Row],[Mañanas]:[Noches]]),0)","v":1},{"$f":"IF(TABLA_TURNOS[[#This Row],[Mañanas]]=1,\"M\",IF(TABLA_TURNOS[[#This Row],[Tardes]]=1,\"T\",IF(TABLA_TURNOS[[#This Row],[Noches]]=1,\"N\",\"\")))","v":"M"}]
[]
[]
[null,null,"Total",{"$f":"D71+D75+D79","v":9},0,5,5,8,6,5,{"$f":"COUNTIF(TABLA_TURNOS[DE SERVICIO],1)","v":61},{"$f":"L71","v":14},{"$f":"M75","v":15},{"$f":"N79","v":9},{"$f":"SUM(L67:N67)","v":38}]
[null,null,null,{"$f":"COUNTIF(TABLA_TURNOS[OBSERVACIÓN],\"x\")+E68","v":38},{"$f":"COUNTIF(TABLA_TURNOS[OPCION OBS],\"x\")","v":20},{"$f":"COUNTIF(TABLA_TURNOS[REANIMACIÓN],\"x\")","v":27},{"$f":"COUNTIF(TABLA_TURNOS[CA],\"x\")","v":43},{"$f":"COUNTIF(TABLA_TURNOS[CB],\"x\")","v":43},{"$f":"COUNTIF(TABLA_TURNOS[SP],\"x\")","v":43},{"$f":"COUNTIF(TABLA_TURNOS[RESPIRATORIO],\"x\")","v":45},{"$f":"SUBTOTAL(103,TABLA_TURNOS[DE SERVICIO])","v":9},{"$f":"SUM(TABLA_TURNOS[Mañanas])","v":14},{"$f":"SUM(TABLA_TURNOS[Tardes])","v":15},{"$f":"SUM(TABLA_TURNOS[Noches])","v":9},{"$f":"SUM(TABLA_TURNOS[Total])","v":38}]
[null,null,null,{"$f":"IF(D68<D67,0,IF(D67=0,0,1))","v":1},{"$f":"IF(E68<E67,0,IF(E67=0,0,1))","v":0},{"$f":"IF(F68<F67,0,IF(F67=0,0,1))","v":1},{"$f":"IF(G68<G67,0,IF(G67=0,0,1))","v":1},{"$f":"IF(H68<H67,0,IF(H67=0,0,1))","v":1},{"$f":"IF(I68<I67,0,IF(I67=0,0,1))","v":1},{"$f":"IF(J68<J67,0,IF(J67=0,0,1))","v":1},null,{"$f":"L73","v":1},{"$f":"M77","v":1},{"$f":"N81","v":1},{"$f":"SUM(L69:N69)","v":3}]
[]
[null,null,"Mañanas",3,null,2,2,3,2,2,null,{"$f":"SUM(D71:J71)","v":14},null,null,null,"De mañanas, en total, 14: 3 en observación, 2 en reanimación, 2 en respiratorio, 2 en CA, 3 en CB, 2 en SP"]
[null,null,null,{"$f":"COUNTIFS(TABLA_TURNOS[OBSERVACIÓN],\"x\",TABLA_TURNOS[[Mañanas]:[Mañanas]],1)+E72","v":10},{"$f":"COUNTIFS(TABLA_TURNOS[OPCION OBS],\"x\",TABLA_TURNOS[[Mañanas]:[Mañanas]],1)","v":5},{"$f":"COUNTIFS(TABLA_TURNOS[REANIMACIÓN],\"x\",TABLA_TURNOS[[Mañanas]:[Mañanas]],1)","v":5},{"$f":"COUNTIFS(TABLA_TURNOS[CA],\"x\",TABLA_TURNOS[[Mañanas]:[Mañanas]],1)","v":9},{"$f":"COUNTIFS(TABLA_TURNOS[CB],\"x\",TABLA_TURNOS[[Mañanas]:[Mañanas]],1)","v":9},{"$f":"COUNTIFS(TABLA_TURNOS[SP],\"x\",TABLA_TURNOS[[Mañanas]:[Mañanas]],1)","v":9},{"$f":"COUNTIFS(TABLA_TURNOS[RESPIRATORIO],\"x\",TABLA_TURNOS[[Mañanas]:[Mañanas]],1)","v":9}]
[null,null,null,{"$f":"IF(D72<D71,0,IF(D71=0,0,1))","v":1},{"$f":"IF(E72<E71,0,IF(E71=0,0,1))","v":0},1,1,1,1,1,null,{"$f":"IF(SUM($D73:$J73)=COUNT($D71:$J71),1,0)","v":1}]
[]
[null,null,"Tardes",3,null,2,2,3,3,2,null,null,{"$f":"SUM(D75:J75)","v":15},null,null,"De tardes, en total 15: 3 en observación, 2 en reanimación, 2 en respiratorio, 2 en CA, 3 en CB, 3 en SP"]
[null,null,null,{"$f":"COUNTIFS(TABLA_TURNOS[OBSERVACIÓN],\"x\",TABLA_TURNOS[[Tardes]:[Tardes]],1)+E76","v":10},{"$f":"COUNTIFS(TABLA_TURNOS[OPCION OBS],\"x\",TABLA_TURNOS[[Tardes]:[Tardes]],1)","v":6},{"$f":"COUNTIFS(TABLA_TURNOS[REANIMACIÓN],\"x\",TABLA_TURNOS[[Tardes]:[Tardes]],1)","v":7},{"$f":"COUNTIFS(TABLA_TURNOS[CA],\"x\",TABLA_TURNOS[[Tardes]:[Tardes]],1)","v":11},{"$f":"COUNTIFS(TABLA_TURNOS[CB],\"x\",TABLA_TURNOS[[Tardes]:[Tardes]],1)","v":11},{"$f":"COUNTIFS(TABLA_TURNOS[SP],\"x\",TABLA_TURNOS[[Tardes]:[Tardes]],1)","v":11},{"$f":"COUNTIFS(TABLA_TURNOS[RESPIRATORIO],\"x\",TABLA_TURNOS[[Tardes]:[Tardes]],1)","v":13}]
[null,null,null,{"$f":"IF(D76<D75,0,IF(D75=0,0,1))","v":1},{"$f":"IF(E76<E75,0,IF(E75=0,0,1))","v":0},{"$f":"IF(F76<F75,0,IF(F75=0,0,1))","v":1},{"$f":"IF(G76<G75,0,IF(G75=0,0,1))","v":1},{"$f":"IF(H76<H75,0,IF(H75=0,0,1))","v":1},{"$f":"IF(I76<I75,0,IF(I75=0,0,1))","v":1},{"$f":"IF(J76<J75,0,IF(J75=0,0,1))","v":1},null,null,{"$f":"IF(SUM($D77:$J77)=COUNT($D75:$J75),1,0)","v":1}]
[]
[null,null,"Noches",3,null,1,1,2,1,1,null,null,null,{"$f":"SUM(D79:J79)","v":9},null,"Noche, en total 9: 3 en observación, 1 en reanimación, 1 en respiratorio, 1 en CA, 2 en CB, 1 en SP"]
[null,null,null,{"$f":"COUNTIFS(TABLA_TURNOS[OBSERVACIÓN],\"x\",TABLA_TURNOS[[Noches]:[Noches]],1)+E80","v":3},{"$f":"COUNTIFS(TABLA_TURNOS[OPCION OBS],\"x\",TABLA_TURNOS[[Noches]:[Noches]],1)","v":1},{"$f":"COUNTIFS(TABLA_TURNOS[REANIMACIÓN],\"x\",TABLA_TURNOS[[Noches]:[Noches]],1)","v":3},{"$f":"COUNTIFS(TABLA_TURNOS[CA],\"x\",TABLA_TURNOS[[Noches]:[Noches]],1)","v":7},{"$f":"COUNTIFS(TABLA_TURNOS[CB],\"x\",TABLA_TURNOS[[Noches]:[Noches]],1)","v":7},{"$f":"COUNTIFS(TABLA_TURNOS[SP],\"x\",TABLA_TURNOS[[Noches]:[Noches]],1)","v":7},{"$f":"COUNTIFS(TABLA_TURNOS[RESPIRATORIO],\"x\",TABLA_TURNOS[[Noches]:[Noches]],1)","v":5}]
[null,null,null,{"$f":"IF(D80<D79,0,IF(D79=0,0,1))","v":1},{"$f":"IF(E80<E79,0,IF(E79=0,0,1))","v":0},{"$f":"IF(F80<F79,0,IF(F79=0,0,1))","v":1},{"$f":"IF(G80<G79,0,IF(G79=0,0,1))","v":1},{"$f":"IF(H80<H79,0,IF(H79=0,0,1))","v":1},{"$f":"IF(I80<I79,0,IF(I79=0,0,1))","v":1},{"$f":"IF(J80<J79,0,IF(J79=0,0,1))","v":1},null,null,null,{"$f":"IF(SUM($D81:$J81)=COUNT($D79:$J79),1,0)","v":1}]

{"sheet":"FEBRERO","index":3,"n_rows":112,"n_cols":32,"rows_kept":112,"cut":false,"hidden":false,"merged":[[0,2,0,29],[86,2,86,29]]}
[null,null,"FEBRERO"]
["NOMBRE","PERSONAL","L","MA","X","J","V","S","D","L","MA","X","J","V","S","D","L","MA","X","J","V","S","D","L","MA","X","J","V","S","D"]
[null,null,1,2,3,4,5,6,7,8,9,10,11,12,13,14,15,16,17,18,19,20,21,22,23,24,25,26,27,28]
[{"$f":"INDEX(CAPACIDADES!B:B,MATCH(FEBRERO!B4,CAPACIDADES!C:C,0))","v":"N1"},"F1"," "," ","M","M","T.","T.","N."," "," ","T"," ","M"," "," ","NV"," "," ","N"," "," ","T","T.","T"," "," "," ","M","M",null,{"$f":"IF(LEFT(B4)=\"F\",COUNTIF(C4:AD4,\"M*\")+COUNTIF(C4:AD4,\"T*\")+COUNTIF(C4:AD4,\"N*\"),\"\")","v":14}]
[{"$f":"INDEX(CAPACIDADES!B:B,MATCH(FEBRERO!B5,CAPACIDADES!C:C,0))","v":{"$error":"#N/A"}},"R",null,null,null,null,"T","T","N",null,null,null,null,null,null,null,null,null,null,null,null,null,null,"T",null,null,null,null,null,null,null,{"$f":"IF(LEFT(B5)=\"F\",COUNTIF(C5:AD5,\"M*\")+COUNTIF(C5:AD5,\"T*\")+COUNTIF(C5:AD5,\"N*\"),\"\")","v":""}]
[{"$f":"INDEX(CAPACIDADES!B:B,MATCH(FEBRERO!B6,CAPACIDADES!C:C,0))","v":"N2"},"F2"," "," ","T"," ","M"," "," ","N"," "," ","N"," "," ","T","T","T"," "," "," ","M","M","T","T","N"," "," "," "," ",null,12]
[{"$f":"INDEX(CAPACIDADES!B:B,MATCH(FEBRERO!B7,CAPACIDADES!C:C,0))","v":"N3"},"F3","N."," "," ","N."," "," ","T","T","T"," "," "," ","M","M","T","T","N."," "," "," "," ","M","T","T","N."," "," "," ",null,14]
[{"$f":"INDEX(CAPACIDADES!B:B,MATCH(FEBRERO!B8,CAPACIDADES!C:C,0))","v":{"$error":"#N/A"}},"R","NC",null,null,"N",null,null,null,null,null,null,null,null,null,null,"N",null,"N",null,null,null,null,null,null,null,"NC",null,null,null,null,""]
[{"$f":"INDEX(CAPACIDADES!B:B,MATCH(FEBRERO!B9,CAPACIDADES!C:C,0))","v":"N4"},"F4","T.","T."," "," "," ","M.","M","T.","T.","N"," "," "," "," ","M.","T.","T.","N"," "," "," ","M.","M.","T.","T.","N"," "," ",null,16]
[{"$f":"INDEX(CAPACIDADES!B:B,MATCH(FEBRERO!B10,CAPACIDADES!C:C,0))","v":{"$error":"#N/A"}},"R","T","T",null,null,null,"T",null,"TIT","TIT",null,null,null,null,null,"M","T","T",null,null,null,null,"M","M","T","T",null,null," ",null,""]
[{"$f":"INDEX(CAPACIDADES!B:B,MATCH(FEBRERO!B11,CAPACIDADES!C:C,0))","v":"N5"},"F5",null,null,null,null,null,null,null,null,null,null,null,null,null,null,"(","M","T.","T.","N",null,null,null,"M","M","T.","T.","N",null,null,9]
[{"$f":"INDEX(CAPACIDADES!B:B,MATCH(FEBRERO!B12,CAPACIDADES!C:C,0))","v":{"$error":"#N/A"}},null,null,null,null,null,null,null,null,null,null,null,null,null,null,null,null,null,"T","T",null,null,null,null,null,null,"T","T",null,null,null,""]
[{"$f":"INDEX(CAPACIDADES!B:B,MATCH(FEBRERO!B13,CAPACIDADES!C:C,0))","v":{"$error":"#N/A"}},"IT","TIT","TIT","NIT"," "," "," "," ","MIT","TIT","TIT","NIT"," "," "," ",")",null,null,null,null,null,null,null,null,null,null,null,null," ",null,""]
[{"$f":"INDEX(CAPACIDADES!B:B,MATCH(FEBRERO!B14,CAPACIDADES!C:C,0))","v":{"$error":"#N/A"}},"IT","T","T","N"," "," "," "," ","M","T","T","N"," "," "," ",")",null,null,null,null,null,null,null,null,null,null,null,null,null,null,""]
[{"$f":"INDEX(CAPACIDADES!B:B,MATCH(FEBRERO!B15,CAPACIDADES!C:C,0))","v":"N6"},"F6","MIT","TIT","TIT","NIT"," "," "," ","MIT","MIT","TIT","TIT","NIT"," "," "," ","M","M","T","T","N"," "," "," ","M","M","T","T","N",null,19]
[{"$f":"INDEX(CAPACIDADES!B:B,MATCH(FEBRERO!B16,CAPACIDADES!C:C,0))","v":"N7"},"F7","MIT","MIT","TIT","TIT","NIT"," "," "," ","MIT","MIT","TIT","TIT","NIT"," "," "," ","MIT","MIT","TIT","TIT","NIT"," ","NIT"," "," ","MIT"," "," ",null,17]
[{"$f":"INDEX(CAPACIDADES!B:B,MATCH(FEBRERO!B17,CAPACIDADES!C:C,0))","v":{"$error":"#N/A"}},"IT","T","T","T","T","N",null,null,null,"M","M","T","T","N",null,null,null,"M","M","T","T","N",null,"N",null,null,"M",null,null,null,""]
[{"$f":"INDEX(CAPACIDADES!B:B,MATCH(FEBRERO!B18,CAPACIDADES!C:C,0))","v":"N8"},"F8"," ","M","M","TIT","TIT","NIT"," "," "," ","MIT","MIT","TIT","TIT","NIT"," ","NIT"," "," ","MIT"," "," ","NIT"," "," ","M","M"," ","T",null,16]
[{"$f":"INDEX(CAPACIDADES!B:B,MATCH(FEBRERO!B19,CAPACIDADES!C:C,0))","v":"N9"},"F9"," "," ","T","T","T","T","N"," ","N"," "," ","T"," "," ","N"," "," ","M","M"," ","T","T","N"," "," ","M","M","M",null,16]
[{"$f":"INDEX(CAPACIDADES!B:B,MATCH(FEBRERO!B20,CAPACIDADES!C:C,0))","v":"N10"},"F10"," ","NIT"," "," ","MIT"," "," ","NIT"," "," ","MIT","MIT"," ","TIT","TIT","NIT"," "," ","MIT","MIT","MIT","TIT","TIT","NIT"," "," "," "," ",null,14]
[{"$f":"INDEX(CAPACIDADES!B:B,MATCH(FEBRERO!B21,CAPACIDADES!C:C,0))","v":{"$error":"#N/A"}},"IT"," ","N"," "," ","M"," "," ","N"," "," ","M","M"," ","T","T","N"," "," ","M","M","M","T","T","N"," "," "," "," ",null,""]
[{"$f":"INDEX(CAPACIDADES!B:B,MATCH(FEBRERO!B22,CAPACIDADES!C:C,0))","v":"N11"},"F11","N."," "," ","M","M"," ","T","T","N."," "," ","M","M","M","T","T","N."," "," "," "," ","M","T","T","N."," "," "," ",null,16]
[{"$f":"INDEX(CAPACIDADES!B:B,MATCH(FEBRERO!B23,CAPACIDADES!C:C,0))","v":{"$error":"#N/A"}},"R","N",null,null,null,null,null,null,null,"N",null,null,null,null,null,null,null,"N",null,null,null,null,null,null,null,"N",null,null,null,null,""]
[{"$f":"INDEX(CAPACIDADES!B:B,MATCH(FEBRERO!B24,CAPACIDADES!C:C,0))","v":"N12"},"F12","T","N"," "," ","M","M","M","T","T","N"," "," "," "," ","M","T","T","N"," "," "," ","M","M","T","T","N"," "," ",null,17]
[{"$f":"INDEX(CAPACIDADES!B:B,MATCH(FEBRERO!B25,CAPACIDADES!C:C,0))","v":"N13"},"F13","T","T","N"," "," "," "," ","M","T","T","N"," "," "," ","M","M","T","T","N"," "," "," ","M","M","T","T","N"," ",null,17]
[{"$f":"INDEX(CAPACIDADES!B:B,MATCH(FEBRERO!B26,CAPACIDADES!C:C,0))","v":"N14"},"F14","M","TV","TV","N"," "," "," ","M","MC","T","T","N"," "," "," ","M","M","TV","T","N"," "," "," ","M","M","T","T","N",null,19]
[{"$f":"INDEX(CAPACIDADES!B:B,MATCH(FEBRERO!B27,CAPACIDADES!C:C,0))","v":"N15"},"F15","M","M","TIT","TIT","NIT"," "," "," ","MIT","MIT","TIT","TIT","NIT"," "," "," ","MIT","MIT","TIT","TIT","NIT"," "," ","MIT","MIT","MIT","TIT"," ",null,19]
[{"$f":"INDEX(CAPACIDADES!B:B,MATCH(FEBRERO!B28,CAPACIDADES!C:C,0))","v":{"$error":"#N/A"}},"IT",null,null,"T","T","N"," "," "," ","M","M","T","T","N"," "," "," ","M","M","T","T","N"," "," ","M","M","M","T"," ",null,""]
[{"$f":"INDEX(CAPACIDADES!B:B,MATCH(FEBRERO!B29,CAPACIDADES!C:C,0))","v":"N16"},"F16"," ","M","M","T","T","N"," "," "," ","M","M","T","T","N"," "," ","M","M","M","T"," ","T","T"," ","M","M"," ","M",null,19]
[{"$f":"INDEX(CAPACIDADES!B:B,MATCH(FEBRERO!B30,CAPACIDADES!C:C,0))","v":"N17"},"F17"," "," ","M","M","T","T","N"," "," ","M","M","M","T"," ","T","T"," ","M","M"," ","M","T","N"," "," ","M","M","T",null,19]
[{"$f":"INDEX(CAPACIDADES!B:B,MATCH(FEBRERO!B31,CAPACIDADES!C:C,0))","v":"N18"},"F18","N"," ","MHS","M","M","T"," ","T","M"," ","M","MHS"," ","M","THS","N"," "," ","M","M","T","THS","T","NHS"," "," "," "," ",null,18]
[{"$f":"INDEX(CAPACIDADES!B:B,MATCH(FEBRERO!B32,CAPACIDADES!C:C,0))","v":"N19"},"F19","M","T"," ","M","M"," ","M","T","N"," "," ","M","M","T","T","T","TD"," "," "," "," ","M","M","T","T","NC","M"," ",null,19]
[{"$f":"INDEX(CAPACIDADES!B:B,MATCH(FEBRERO!B33,CAPACIDADES!C:C,0))","v":"N20"},"F20","TIT","NIT"," "," ","MIT","MIT","TIT","TIT","TIT","NIT"," "," "," "," ","MIT","MIT","TIT","TIT","NIT"," "," "," ","MIT","MIT","TIT","TIT","NIT "," ",null,18]
[{"$f":"INDEX(CAPACIDADES!B:B,MATCH(FEBRERO!B34,CAPACIDADES!C:C,0))","v":{"$error":"#N/A"}},"IT","TIT","NIT"," "," ","MIT","MIT","TIT","TIT","TIT","NIT"," "," "," "," ","M","M","T","T","N"," "," "," ","M","M","T","T","N"," ",null,""]
[{"$f":"INDEX(CAPACIDADES!B:B,MATCH(FEBRERO!B35,CAPACIDADES!C:C,0))","v":"N21"},"F21","TIT","TIT","NIT"," "," "," "," ","MIT","MIT","TIT","TIT","NIT"," "," "," ","MIT","MIT","TIT","TIT","NIT"," "," "," ","MIT","MIT","TIT","TIT","NIT",null,18]
[{"$f":"INDEX(CAPACIDADES!B:B,MATCH(FEBRERO!B36,CAPACIDADES!C:C,0))","v":{"$error":"#N/A"}},"IT","TIT","TIT","NIT"," "," "," "," ","MIT","MIT","TIT","TIT","NIT"," "," "," ","MIT","MIT","TIT","TIT","NIT",null,null,null,"MVA","MVA","TVA","TVA","NVA",null,""]
[{"$f":"INDEX(CAPACIDADES!B:B,MATCH(FEBRERO!B37,CAPACIDADES!C:C,0))","v":{"$error":"#N/A"}},"IT","TIT","T","N",null,null,null,null,"M","T","T","M","N",null,null,null,"M","M","T","T","N",null,null,null,"M","M","T","T","N",null,""]
[{"$f":"INDEX(CAPACIDADES!B:B,MATCH(FEBRERO!B38,CAPACIDADES!C:C,0))","v":"N22"},"F22","M","M","T","T","N"," "," "," ","M","M","T","T","N"," "," "," ","M","M","T","T","N"," "," ","M","M","M"," "," ",null,18]
[{"$f":"INDEX(CAPACIDADES!B:B,MATCH(FEBRERO!B39,CAPACIDADES!C:C,0))","v":"N23"},"F23"," ","M","M","M","M","N"," "," "," ","M","M","M","T","N"," "," ","M","M","M"," "," ","N"," "," ","T","T"," ","T",null,17]
[{"$f":"INDEX(CAPACIDADES!B:B,MATCH(FEBRERO!B40,CAPACIDADES!C:C,0))","v":"N24"},"F24"," "," ","M","M","T","T","N"," "," ","T","T","T"," "," ","NC"," "," ","T","T"," ","T","T","N"," ","N"," "," "," ",null,15]
[{"$f":"INDEX(CAPACIDADES!B:B,MATCH(FEBRERO!B41,CAPACIDADES!C:C,0))","v":{"$error":"#N/A"}},"IT"," "," ","MIT","MIT","MIT"," "," ","NIT"," "," ","TIT","TIT"," ","TIT","TIT","NIT"," "," "," "," "," ","TIT","TIT","NIT"," "," "," ","MIT",null,""]
[{"$f":"INDEX(CAPACIDADES!B:B,MATCH(FEBRERO!B42,CAPACIDADES!C:C,0))","v":{"$error":"#N/A"}},"IT",null,null,"M","M","M",null,null,"N",null,null,"T","M",null,"T","T","N",null,null,null,null,null,"T","T","N",null,null,null,"M",null,""]
[{"$f":"INDEX(CAPACIDADES!B:B,MATCH(FEBRERO!B43,CAPACIDADES!C:C,0))","v":"N25"},"F25","N"," "," ","T","T"," ","T","T","N"," "," "," "," "," ","T","T","N"," "," "," ","M","M","TV","T","N"," "," "," ",null,14]
[{"$f":"INDEX(CAPACIDADES!B:B,MATCH(FEBRERO!B44,CAPACIDADES!C:C,0))","v":"N26"},"F26","T","N"," "," "," "," "," ","T","T","N"," "," "," ","M","M","T","T","N"," "," "," ","M","M","T","T","N"," "," ",null,15]
[{"$f":"INDEX(CAPACIDADES!B:B,MATCH(FEBRERO!B45,CAPACIDADES!C:C,0))","v":"N27"},"F27","T","T","N"," "," "," ","M","M","TIT","TIT","NIT"," "," "," ","M","M","T","T","NVN"," "," "," ","M","M","T","T","NVN"," ",null,18]
[{"$f":"INDEX(CAPACIDADES!B:B,MATCH(FEBRERO!B46,CAPACIDADES!C:C,0))","v":"N28"},"F28","M","T","M","NIT"," "," "," ","MIT","MIT ","TIT","TIT","NIT"," "," "," ","MIT","MIT","TIT","TIT","NIT"," ","N"," "," ","M","T","T","N",null,19]
[{"$f":"INDEX(CAPACIDADES!B:B,MATCH(FEBRERO!B47,CAPACIDADES!C:C,0))","v":{"$error":"#N/A"}},"IT",null,null,null,"N",null,null,null,"M","M","T","T","N",null,null,null,"M","M","T","T","N",null,null,null,null,null,null,null,null,null,""]
[{"$f":"INDEX(CAPACIDADES!B:B,MATCH(FEBRERO!B48,CAPACIDADES!C:C,0))","v":"N29"},"F29","M","M","T","T","N"," "," "," ","M","M","T","T","N"," ","N"," "," ","M","T","T","N"," "," "," ","M","M"," "," ",null,17]
[{"$f":"INDEX(CAPACIDADES!B:B,MATCH(FEBRERO!B49,CAPACIDADES!C:C,0))","v":"N30"},"F30"," ","MIT","MIT","TIT","TIT","NIT"," ","NVN"," "," ","MVN","TVN","TVN","NVN"," "," "," ","NVN","NVN",null," ","NVN",null," "," ","MVN","MVN","TVN",null,16]
[{"$f":"INDEX(CAPACIDADES!B:B,MATCH(FEBRERO!B50,CAPACIDADES!C:C,0))","v":{"$error":"#N/A"}},"IT",null,"M","M","T","T","N",null,"N",null,null,"M","T","T","N",null,null,null,"M","M",null,null,"N",null,null,null,"M","M","T",null,""]
[{"$f":"INDEX(CAPACIDADES!B:B,MATCH(FEBRERO!B51,CAPACIDADES!C:C,0))","v":"N31"},"F31","N"," "," ","M","T","T","N"," "," "," ","M","M"," "," ","N"," "," "," ","M","M","T","T","N"," "," "," ","M","M",null,15]
[{"$f":"INDEX(CAPACIDADES!B:B,MATCH(FEBRERO!B52,CAPACIDADES!C:C,0))","v":"N32"},"F32"," "," "," ","M.","M."," "," ","N."," "," "," ","M.","M.","T.","T.","N."," "," "," ","M.","M.","T.","T.","N."," "," "," "," ",null,13]
[{"$f":"INDEX(CAPACIDADES!B:B,MATCH(FEBRERO!B53,CAPACIDADES!C:C,0))","v":0},"_","D2","D2","D2","D2","D2",null,null,"D2","D2","D2","D2","D2",null,null,"D2","D2","D2","D2","D2",null,null,"D2","D2","D2","D2","D2",null,null,null,""]
[{"$f":"INDEX(CAPACIDADES!B:B,MATCH(FEBRERO!B54,CAPACIDADES!C:C,0))","v":"N33"},"F33","NIT"," "," "," ","MIT","MIT","TIT","TIT","NIT"," "," "," ","MIT","MIT","TIT","TIT","NIT"," "," "," "," ","MIT","TIT","TIT","NIT"," "," "," ",null,15]
[{"$f":"INDEX(CAPACIDADES!B:B,MATCH(FEBRERO!B55,CAPACIDADES!C:C,0))","v":{"$error":"#N/A"}},"IT",null,null,null,null,"M","M","T","T","N"," "," "," ","M","M","T","T","N"," "," "," "," ","M","T","T","N"," "," "," ",null,""]
[{"$f":"INDEX(CAPACIDADES!B:B,MATCH(FEBRERO!B56,CAPACIDADES!C:C,0))","v":"N34"},"F34","T","N"," "," "," ","M","M","T","T","N"," "," "," "," ","M","T","T","N"," "," "," ","M","M","T","T","N"," "," ",null,16]
[{"$f":"INDEX(CAPACIDADES!B:B,MATCH(FEBRERO!B57,CAPACIDADES!C:C,0))","v":"N35"},"F35","TIT","TIT","NIT"," "," "," "," ","M","T","T","N"," "," "," ","M","M","T","T","N"," "," ","M","M","T","T","T","N"," ",null,18]
[{"$f":"INDEX(CAPACIDADES!B:B,MATCH(FEBRERO!B58,CAPACIDADES!C:C,0))","v":{"$error":"#N/A"}},"IT","T","T","N",")",null,null,null,null,null,null,null,null,null,null,null,null,null,null,null,null,null,null,null,null,null,null,null,null,null,""]
[{"$f":"INDEX(CAPACIDADES!B:B,MATCH(FEBRERO!B59,CAPACIDADES!C:C,0))","v":"N36"},"F36","M","T","T","N"," "," "," ","M","M","T","M","N"," "," ","M","TC","T","T","T","N"," "," "," ","M","M","T","T","N",null,20]
[{"$f":"INDEX(CAPACIDADES!B:B,MATCH(FEBRERO!B60,CAPACIDADES!C:C,0))","v":"N37"},"F37","M","M","T","T","N"," "," ","M","M","M","M","T","N"," "," "," ","M","M","T","T","N"," "," ","T"," ","M"," "," ",null,18]
[{"$f":"INDEX(CAPACIDADES!B:B,MATCH(FEBRERO!B61,CAPACIDADES!C:C,0))","v":"N38"},"F38","M","M","TVN","TVN","TVN","N"," "," "," ","M","M","T","T","N"," "," ","T"," ","M"," "," ","N"," "," ","N"," "," ","T",null,16]
[{"$f":"INDEX(CAPACIDADES!B:B,MATCH(FEBRERO!B62,CAPACIDADES!C:C,0))","v":"N39"},"F39","D2IT","D2IT","D2IT","D2IT","D2IT"," "," ","D2IT","D2IT","D2IT","D2IT","D2IT"," "," ","D2IT","D2IT","D2IT","D2IT","D2IT"," "," ","D2IT","D2IT","D2IT","D2IT","D2IT"," "," ",null,0]
[{"$f":"INDEX(CAPACIDADES!B:B,MATCH(FEBRERO!B63,CAPACIDADES!C:C,0))","v":"N40"},"F40","M","M","M","M","M"," "," ","T","T","T","T","T"," "," ","M","M","MVN","MVN","MVN"," "," ","T","T","T","T","T"," "," ",null,20]
[{"$f":"INDEX(CAPACIDADES!B:B,MATCH(FEBRERO!B64,CAPACIDADES!C:C,0))","v":"N41"},"F41","T","T","T","T","T"," "," ","M","M","M","M","M"," "," ","T","T","T","T","T"," "," ","M","M","M","M","M"," "," ",null,20]
[{"$f":"INDEX(CAPACIDADES!B:B,MATCH(FEBRERO!B65,CAPACIDADES!C:C,0))","v":"N42"},"F42"," ","N"," ","N"," ","N"," ","N"," ","N"," ","N"," ","N"," ","N"," ","N"," ","N"," ","N"," ","N"," ","N"," ","N",null,14]
[{"$f":"INDEX(CAPACIDADES!B:B,MATCH(FEBRERO!B66,CAPACIDADES!C:C,0))","v":"N43"},"F43","N."," ","N"," ","NV4"," ","N."," ","N"," ","N"," ","N."," ","NV"," ","N"," ","N."," ","N"," ","N"," ","N."," ","N"," ",null,14]
[{"$f":"INDEX(CAPACIDADES!B:B,MATCH(FEBRERO!B67,CAPACIDADES!C:C,0))","v":{"$error":"#N/A"}},"R","N",null,null,null,"N",null,"N",null,null,null,null,null,"N",null,null,null,null,null,"N",null,null,null,null,null,"N",null,null,null,null,""]
[{"$f":"INDEX(CAPACIDADES!B:B,MATCH(FEBRERO!B68,CAPACIDADES!C:C,0))","v":"N44"},"F44",null,"N",null,"N",null,"N",null,"N",null,"N",null,"N",null,"N",null,"N",null,"N",null,"N",null,"N",null,"N",null,"N",null,"N",null,14]
[{"$f":"INDEX(CAPACIDADES!B:B,MATCH(FEBRERO!B69,CAPACIDADES!C:C,0))","v":"N45"},"F45","NIT"," ","NIT"," ","N"," ","N"," ","N"," ","N"," ","N"," ","N"," ","N"," ","N"," ","N"," ","N"," ","N"," ","N"," ",null,{"$f":"IF(LEFT(B69)=\"F\",COUNTIF(C69:AD69,\"M*\")+COUNTIF(C69:AD69,\"T*\")+COUNTIF(C69:AD69,\"N*\"),\"\")","v":14}]
[{"$f":"INDEX(CAPACIDADES!B:B,MATCH(FEBRERO!B70,CAPACIDADES!C:C,0))","v":"N46"},"F46"," ","N"," ","N"," ","N"," ","N"," ","N","N","NC"," ","N"," ","N"," ","N"," ","N"," ","N"," ","N"," ","N"," ","N",null,15]
[{"$f":"INDEX(CAPACIDADES!B:B,MATCH(FEBRERO!B71,CAPACIDADES!C:C,0))","v":"N47"},"F47","NIT"," ","NIT"," ","NIT"," ","N"," ","N"," ","N"," ","N"," ","N"," ","N"," ","N"," ","N"," ","N"," ","N"," ","N"," ",null,14]
[{"$f":"INDEX(CAPACIDADES!B:B,MATCH(FEBRERO!B72,CAPACIDADES!C:C,0))","v":"N48"},"F48"," "," "," "," "," ","M","D2"," "," "," "," "," ","D2","D2"," "," "," "," "," ","D2","D2"," "," "," "," "," ","D2","D2",null,1]
[{"$f":"INDEX(CAPACIDADES!B:B,MATCH(FEBRERO!B73,CAPACIDADES!C:C,0))","v":"N49"},"F49","TIT"," "," "," "," ","TIT","TIT","TIT"," "," "," "," ","TIT","TIT","T"," "," "," "," ","T","T","T"," "," "," "," ","T","T",null,12]
[{"$f":"INDEX(CAPACIDADES!B:B,MATCH(FEBRERO!B74,CAPACIDADES!C:C,0))","v":"N50"},"F50"," "," "," "," "," ","T","T",null,null,null,null,null,"M","M"," "," "," "," "," ","T","T"," "," "," "," "," ","M","M",null,8]
[{"$f":"INDEX(CAPACIDADES!B:B,MATCH(FEBRERO!B75,CAPACIDADES!C:C,0))","v":"N51"},"F51","TIT"," "," "," ","(","M","M","M"," "," "," "," ","T","T","M"," "," "," "," ","M","M","M"," "," "," "," ","T","T",null,12]
[{"$f":"INDEX(CAPACIDADES!B:B,MATCH(FEBRERO!B76,CAPACIDADES!C:C,0))","v":{"$error":"#N/A"}},"IT","T"," "," "," ",")",null,null,null,null,null,null,null,null,null,null,null,null,null,null,null,null,null,null,null,null,null,null,null,null,""]
[{"$f":"INDEX(CAPACIDADES!B:B,MATCH(FEBRERO!B77,CAPACIDADES!C:C,0))","v":"N52"},"F52"," "," "," "," "," ","M","M"," "," "," "," "," ","T","T"," "," "," "," "," ","M","M"," "," ",null," "," ","T","T",null,8]
[{"$f":"INDEX(CAPACIDADES!B:B,MATCH(FEBRERO!B78,CAPACIDADES!C:C,0))","v":"N53"},"F53"," "," "," "," "," ","D2","MD"," "," "," "," "," ","MD","MD"," "," "," "," "," ","T","T"," "," "," "," "," ","MD","MD",null,7]
[{"$f":"INDEX(CAPACIDADES!B:B,MATCH(FEBRERO!B79,CAPACIDADES!C:C,0))","v":"N54"},"F54"," "," "," "," "," ","M","M"," "," "," "," "," ","M","M"," "," "," "," "," ","M","M"," "," "," "," "," ","M","M",null,8]
[{"$f":"INDEX(CAPACIDADES!B:B,MATCH(FEBRERO!B80,CAPACIDADES!C:C,0))","v":"N55"},"F55"," "," "," "," "," ","T","T"," "," "," "," "," ","T","T"," "," "," "," "," ","T","T"," "," "," "," "," ","T","T",null,8]
[{"$f":"INDEX(CAPACIDADES!B:B,MATCH(FEBRERO!B81,CAPACIDADES!C:C,0))","v":"N56"},"F56"," "," "," "," "," ","M","M"," "," "," "," "," ","T","T"," "," "," "," "," ","M","M"," "," "," "," "," ","T","T",null,8]
[{"$f":"INDEX(CAPACIDADES!B:B,MATCH(FEBRERO!B82,CAPACIDADES!C:C,0))","v":"N57"},"F57"," "," "," "," ",null,"M","M"," "," "," "," "," ","T","T"," "," "," "," "," ","M","M"," "," "," "," "," ","TV","T",null,8]
[{"$f":"INDEX(CAPACIDADES!B:B,MATCH(FEBRERO!B83,CAPACIDADES!C:C,0))","v":"N58"},"F58"," "," "," "," "," ","T","T"," "," "," ","N"," ","M","M","N"," ","N"," "," ","T","T"," ","T"," "," "," ","M","M",null,12]
[{"$f":"INDEX(CAPACIDADES!B:B,MATCH(FEBRERO!B84,CAPACIDADES!C:C,0))","v":"N59"},"F59"," "," "," "," "," ","T","T",null,null,null,null,null,"M","T",null," "," "," "," ","T","T"," "," "," "," "," ","M","M",null,8]
[{"$f":"INDEX(CAPACIDADES!B:B,MATCH(FEBRERO!B85,CAPACIDADES!C:C,0))","v":"N60"},"F60","N"," "," "," "," ","M","M","N"," "," "," "," ","M","T","N"," "," "," "," ","M","M","N"," "," "," "," ","M","T",null,12]
[{"$f":"INDEX(CAPACIDADES!B:B,MATCH(FEBRERO!B86,CAPACIDADES!C:C,0))","v":"N61"},"F61",null,null,null,null,null,null,"T",null,null,null,null,null,null,"V3",null,null,null,null,null,null,"T",null,null,null,null,null,null,"M",null,3]
[{"$f":"INDEX(CAPACIDADES!B:B,MATCH(FEBRERO!B87,CAPACIDADES!C:C,0))","v":0},".","FEBRERO",null,null,null,null,null,null,null,null,null,null,null,null,null,null,null,null,null,null,null,null,null,null,null,null,null,null,null,null,""]
[{"$f":"INDEX(CAPACIDADES!B:B,MATCH(FEBRERO!B88,CAPACIDADES!C:C,0))","v":{"$error":"#N/A"}},null,"L","MA","X","J","V","S","D","L","MA","X","J","V","S","D","L","MA","X","J","V","S","D","L","MA","X","J","V","S","D",null,""]
[{"$f":"INDEX(CAPACIDADES!B:B,MATCH(FEBRERO!B89,CAPACIDADES!C:C,0))","v":{"$error":"#N/A"}},null,1,2,3,4,5,6,7,8,9,10,11,12,13,14,15,16,17,18,19,20,21,22,23,24,25,26,27,28,null,""]
[{"$f":"INDEX(CAPACIDADES!B:B,MATCH(FEBRERO!B90,CAPACIDADES!C:C,0))","v":"NOMBRE"},"**","MD","TD","N",null,null,"M","T",null,null,null,"T","M",null,null,null,"M","MD","TD",null,null,null,"T","T",null,null,null,null,"M",null,""]
[{"$f":"INDEX(CAPACIDADES!B:B,MATCH(FEBRERO!B91,CAPACIDADES!C:C,0))","v":"NOMBRE"},"**",null,"MD","TD","T","T",null,"M",null,"M","M",null,"M","T","M",null,null,null,"MD","TD","T","T",null,"T","TD",null,null,null,null,null,""]
[{"$f":"INDEX(CAPACIDADES!B:B,MATCH(FEBRERO!B92,CAPACIDADES!C:C,0))","v":"NOMBRE"},"**",null,null,"MD","TD","N",null,null,"T","T","N",null,null,"M","M","M","T",null,null,"MD","TD",null,null,null,"M","T",null,"T","T",null,""]
[{"$f":"INDEX(CAPACIDADES!B:B,MATCH(FEBRERO!B93,CAPACIDADES!C:C,0))","v":{"$error":"#N/A"}},"IT","_","_","_","_","_",".",".","_","_","_","_","_",".",".","_","_","_","_","_",".",".","_","_","_","_","_",".",".",null,""]
[{"$f":"INDEX(CAPACIDADES!B:B,MATCH(FEBRERO!B94,CAPACIDADES!C:C,0))","v":"NOMBRE"},"**","N",null,null,"MD","TD","N",null,null,"M","T",null,"M","T","N",null,"N",null,null,null,"MD","TD",null,null,"M","M",null,null,null,null,""]
[{"$f":"INDEX(CAPACIDADES!B:B,MATCH(FEBRERO!B95,CAPACIDADES!C:C,0))","v":"NOMBRE"},"**","M","N",null,null,"MD","TDC",null,"M","T","M","T","T",null,null,null,null,"T","T",null,null,"MD","TDV",null,null,null,"M","M","M",null,""]
[{"$f":"INDEX(CAPACIDADES!B:B,MATCH(FEBRERO!B96,CAPACIDADES!C:C,0))","v":"NOMBRE"},"**","M","T","T",null,null,"MDIT","TDIT",null,"M",null,null,null,"TAP",null,null,null,"T","T",null,null,null,"MD","TD","N",null,null,"M","T",null,""]
[{"$f":"INDEX(CAPACIDADES!B:B,MATCH(FEBRERO!B97,CAPACIDADES!C:C,0))","v":"NOMBRE"},"**",null,"M","M","M","M",null,"T","TD",null,"T","T",null,"M","T",null,null,null,null,null,"N","TC",null,"MD","N",null,null,null,"M",null,""]
[{"$f":"INDEX(CAPACIDADES!B:B,MATCH(FEBRERO!B98,CAPACIDADES!C:C,0))","v":"NOMBRE"},"**","_",null,"M","M","M",null,null,"MDAP","TDAP","_",null,null,"M","T","T",null,null,null,"N",null,null,null,null,null,"TD","N",null,null,null,""]
[{"$f":"INDEX(CAPACIDADES!B:B,MATCH(FEBRERO!B99,CAPACIDADES!C:C,0))","v":"NOMBRE"},"**",null,"T","T","T","T","N",null,null,"MD","TD",null,"M",null,"M","T","T",null,null,null,null,"M",null,null,null,"MD","TD",null,null,null,""]
[{"$f":"INDEX(CAPACIDADES!B:B,MATCH(FEBRERO!B100,CAPACIDADES!C:C,0))","v":"NOMBRE"},"**",null,"N",null,null,"T","T","N",null,null,"MD","M","N",null,"_","M","N",null,null,null,null,null,"T","T",null,null,"MD","TD","N",null,""]
[{"$f":"INDEX(CAPACIDADES!B:B,MATCH(FEBRERO!B101,CAPACIDADES!C:C,0))","v":"NOMBRE"},"**","_","_","N",null,null,"T","T","N",null,null,"MD","TD",null,null,null,"M","M","M","M",null,null,"N",null,null,null,"M","M","TD",null,""]
[{"$f":"INDEX(CAPACIDADES!B:B,MATCH(FEBRERO!B102,CAPACIDADES!C:C,0))","v":"NOMBRE"},"**","TC","M","T","T",null,"M","M","_","T","T",null,"MD","TD","N",null,null,"M","T",null,"M",null,null,null,"N",null,null,null,"M",null,""]
[{"$f":"INDEX(CAPACIDADES!B:B,MATCH(FEBRERO!B103,CAPACIDADES!C:C,0))","v":"NOMBRE"},"**",null,"M","T","N",null,null,null,"T","N",null,null,null,"T","TD","_",null,"M","M","T",null,null,null,null,"T",null,"M","T",null,null,""]
[{"$f":"INDEX(CAPACIDADES!B:B,MATCH(FEBRERO!B104,CAPACIDADES!C:C,0))","v":"NOMBRE"},"**","_",null,"T","NC","N",null,"T",null,"TD","T","NC","N",null,"T","TD","N",null,null,"M","T","T",null,null,null,"M","T",null,null,null,""]
[{"$f":"INDEX(CAPACIDADES!B:B,MATCH(FEBRERO!B105,CAPACIDADES!C:C,0))","v":"NOMBRE"},"**","T",null,"TC",null,"T","M","T",null,null,"M","TD","T","T",null,"MD","TD",null,null,"M","M","T",null,"M","M",null,null,null,"T",null,""]
[{"$f":"INDEX(CAPACIDADES!B:B,MATCH(FEBRERO!B106,CAPACIDADES!C:C,0))","v":"NOMBRE"},"**","TD","T","T","T","T","TD",null,"T","TC",null,"T","T","NV",null,null,"MD","N","N",null,null,"M","T",null,null,null,"N","N",null,null,""]
[{"$f":"INDEX(CAPACIDADES!B:B,MATCH(FEBRERO!B107,CAPACIDADES!C:C,0))","v":"NOMBRE"},"**","N",null,"N",null,null,")","N",null,"N",null,null,null,"N",null,"N",null,null,null,"N",null,"N",null,"N",null,"N",null,"N",null,null,""]
[{"$f":"INDEX(CAPACIDADES!B:B,MATCH(FEBRERO!B108,CAPACIDADES!C:C,0))","v":"NOMBRE"},"**","N",null,null,"N","NC","T",null,"M","M",null,"T","N",null,null,"T",null,null,null,"M","M","M","M",null,null,"T","T","T",null,null,""]
[{"$f":"INDEX(CAPACIDADES!B:B,MATCH(FEBRERO!B109,CAPACIDADES!C:C,0))","v":"NOMBRE"},"**","_","_","M","M","M",null,null,"MD","T","N",null,null,"M","M",null,"M",null,"M","T","N",null,null,"M","T",null,"N",null,null,null,""]
[{"$f":"INDEX(CAPACIDADES!B:B,MATCH(FEBRERO!B110,CAPACIDADES!C:C,0))","v":{"$error":"#N/A"}},null,null,null,null,null,null,null,null,null,null,null,null,null,null,null,null,null,null,null,null,null,null,null,null,null,null,null,null,null,null,""]
[".","."]
[".","."]

{"sheet":"03-21","index":4,"n_rows":64,"n_cols":35,"rows_kept":64,"cut":false,"hidden":false,"merged":[]}
[]
[null,null,{"$f":"DATEVALUE(Nombre_Hoja)","v":"2021-03-01"},null,{"$f":"C2","v":"2021-03-01"},{"$f":"E2+1","v":"2021-03-02"},{"$f":"F2+1","v":"2021-03-03"},"2021-03-04","2021-03-05","2021-03-06","2021-03-07","2021-03-08","2021-03-09","2021-03-10","2021-03-11","2021-03-12","2021-03-13","2021-03-14","2021-03-15","2021-03-16","2021-03-17","2021-03-18","2021-03-19","2021-03-20","2021-03-21","2021-03-22","2021-03-23","2021-03-24","2021-03-25","2021-03-26","2021-03-27","2021-03-28","2021-03-29","2021-03-30","2021-03-31"]
[null,"FILA","NOMBRE","PERSONAL","1","2","3","4","5","6","7","8","9","10","11","12","13","14","15","16","17","18","19","20","21","22","23","24","25","26","27","28","29","30","31"]
[null,{"$f":"MATCH(TURNOS_2021_03[[#This Row],[PERSONAL]],Turnos_Personal,0)","v":1},{"$f":"INDEX(Capacidades_Nombre,MATCH(TURNOS_2021_03[[#This Row],[PERSONAL]],Capacidades_Personal,0),1) & \"\"","v":"N1"},"F1",{"$f":"INDEX(Turnos_Turno,TURNOS_2021_03[[#This Row],[FILA]],1)","v":""},{"$f":"INDEX(Turnos_Turno,TURNOS_2021_03[[#This Row],[FILA]],1)","v":""},{"$f":"INDEX(Turnos_Turno,TURNOS_2021_03[[#This Row],[FILA]],1)","v":""},{"$f":"INDEX(Turnos_Turno,TURNOS_2021_03[[#This Row],[FILA]],1)","v":""},{"$f":"INDEX(Turnos_Turno,TURNOS_2021_03[[#This Row],[FILA]],1)","v":""},{"$f":"INDEX(Turnos_Turno,TURNOS_2021_03[[#This Row],[FILA]],1)","v":""},{"$f":"INDEX(Turnos_Turno,TURNOS_2021_03[[#This Row],[FILA]],1)","v":""},{"$f":"INDEX(Turnos_Turno,TURNOS_2021_03[[#This Row],[FILA]],1)","v":""},{"$f":"INDEX(Turnos_Turno,TURNOS_2021_03[[#This Row],[FILA]],1)","v":""},{"$f":"INDEX(Turnos_Turno,TURNOS_2021_03[[#This Row],[FILA]],1)","v":""},{"$f":"INDEX(Turnos_Turno,TURNOS_2021_03[[#This Row],[FILA]],1)","v":""},{"$f":"INDEX(Turnos_Turno,TURNOS_2021_03[[#This Row],[FILA]],1)","v":""},{"$f":"INDEX(Turnos_Turno,TURNOS_2021_03[[#This Row],[FILA]],1)","v":""},{"$f":"INDEX(Turnos_Turno,TURNOS_2021_03[[#This Row],[FILA]],1)","v":""},{"$f":"INDEX(Turnos_Turno,TURNOS_2021_03[[#This Row],[FILA]],1)","v":""},{"$f":"INDEX(Turnos_Turno,TURNOS_2021_03[[#This Row],[FILA]],1)","v":""},{"$f":"INDEX(Turnos_Turno,TURNOS_2021_03[[#This Row],[FILA]],1)","v":""},{"$f":"INDEX(Turnos_Turno,TURNOS_2021_03[[#This Row],[FILA]],1)","v":""},{"$f":"INDEX(Turnos_Turno,TURNOS_2021_03[[#This Row],[FILA]],1)","v":""},{"$f":"INDEX(Turnos_Turno,TURNOS_2021_03[[#This Row],[FILA]],1)","v":""},{"$f":"INDEX(Turnos_Turno,TURNOS_2021_03[[#This Row],[FILA]],1)","v":""},{"$f":"INDEX(Turnos_Turno,TURNOS_2021_03[[#This Row],[FILA]],1)","v":""},{"$f":"INDEX(Turnos_Turno,TURNOS_2021_03[[#This Row],[FILA]],1)","v":""},{"$f":"INDEX(Turnos_Turno,TURNOS_2021_03[[#This Row],[FILA]],1)","v":""},{"$f":"INDEX(Turnos_Turno,TURNOS_2021_03[[#This Row],[FILA]],1)","v":""},{"$f":"INDEX(Turnos_Turno,TURNOS_2021_03[[#This Row],[FILA]],1)","v":""},{"$f":"INDEX(Turnos_Turno,TURNOS_2021_03[[#This Row],[FILA]],1)","v":""},{"$f":"INDEX(Turnos_Turno,TURNOS_2021_03[[#This Row],[FILA]],1)","v":""},{"$f":"INDEX(Turnos_Turno,TURNOS_2021_03[[#This Row],[FILA]],1)","v":""},{"$f":"INDEX(Turnos_Turno,TURNOS_2021_03[[#This Row],[FILA]],1)","v":""},{"$f":"INDEX(Turnos_Turno,TURNOS_2021_03[[#This Row],[FILA]],1)","v":""}]
[null,{"$f":"MATCH(TURNOS_2021_03[[#This Row],[PERSONAL]],Turnos_Personal,0)","v":2},{"$f":"INDEX(Capacidades_Nombre,MATCH(TURNOS_2021_03[[#This Row],[PERSONAL]],Capacidades_Personal,0),1) & \"\"","v":"N2"},"F2",{"$f":"INDEX(Turnos_Turno,TURNOS_2021_03[[#This Row],[FILA]],1)","v":""},{"$f":"INDEX(Turnos_Turno,TURNOS_2021_03[[#This Row],[FILA]],1)","v":""},{"$f":"INDEX(Turnos_Turno,TURNOS_2021_03[[#This Row],[FILA]],1)","v":""},{"$f":"INDEX(Turnos_Turno,TURNOS_2021_03[[#This Row],[FILA]],1)","v":""},{"$f":"INDEX(Turnos_Turno,TURNOS_2021_03[[#This Row],[FILA]],1)","v":""},{"$f":"INDEX(Turnos_Turno,TURNOS_2021_03[[#This Row],[FILA]],1)","v":""},{"$f":"INDEX(Turnos_Turno,TURNOS_2021_03[[#This Row],[FILA]],1)","v":""},{"$f":"INDEX(Turnos_Turno,TURNOS_2021_03[[#This Row],[FILA]],1)","v":""},{"$f":"INDEX(Turnos_Turno,TURNOS_2021_03[[#This Row],[FILA]],1)","v":""},{"$f":"INDEX(Turnos_Turno,TURNOS_2021_03[[#This Row],[FILA]],1)","v":""},{"$f":"INDEX(Turnos_Turno,TURNOS_2021_03[[#This Row],[FILA]],1)","v":""},{"$f":"INDEX(Turnos_Turno,TURNOS_2021_03[[#This Row],[FILA]],1)","v":""},{"$f":"INDEX(Turnos_Turno,TURNOS_2021_03[[#This Row],[FILA]],1)","v":""},{"$f":"INDEX(Turnos_Turno,TURNOS_2021_03[[#This Row],[FILA]],1)","v":""},{"$f":"INDEX(Turnos_Turno,TURNOS_2021_03[[#This Row],[FILA]],1)","v":""},{"$f":"INDEX(Turnos_Turno,TURNOS_2021_03[[#This Row],[FILA]],1)","v":""},{"$f":"INDEX(Turnos_Turno,TURNOS_2021_03[[#This Row],[FILA]],1)","v":""},{"$f":"INDEX(Turnos_Turno,TURNOS_2021_03[[#This Row],[FILA]],1)","v":""},{"$f":"INDEX(Turnos_Turno,TURNOS_2021_03[[#This Row],[FILA]],1)","v":""},{"$f":"INDEX(Turnos_Turno,TURNOS_2021_03[[#This Row],[FILA]],1)","v":""},{"$f":"INDEX(Turnos_Turno,TURNOS_2021_03[[#This Row],[FILA]],1)","v":""},{"$f":"INDEX(Turnos_Turno,TURNOS_2021_03[[#This Row],[FILA]],1)","v":""},{"$f":"INDEX(Turnos_Turno,TURNOS_2021_03[[#This Row],[FILA]],1)","v":""},{"$f":"INDEX(Turnos_Turno,TURNOS_2021_03[[#This Row],[FILA]],1)","v":""},{"$f":"INDEX(Turnos_Turno,TURNOS_2021_03[[#This Row],[FILA]],1)","v":""},{"$f":"INDEX(Turnos_Turno,TURNOS_2021_03[[#This Row],[FILA]],1)","v":""},{"$f":"INDEX(Turnos_Turno,TURNOS_2021_03[[#This Row],[FILA]],1)","v":""},{"$f":"INDEX(Turnos_Turno,TURNOS_2021_03[[#This Row],[FILA]],1)","v":""},{"$f":"INDEX(Turnos_Turno,TURNOS_2021_03[[#This Row],[FILA]],1)","v":""},{"$f":"INDEX(Turnos_Turno,TURNOS_2021_03[[#This Row],[FILA]],1)","v":""},{"$f":"INDEX(Turnos_Turno,TURNOS_2021_03[[#This Row],[FILA]],1)","v":""}]
[null,{"$f":"MATCH(TURNOS_2021_03[[#This Row],[PERSONAL]],Turnos_Personal,0)","v":3},{"$f":"INDEX(Capacidades_Nombre,MATCH(TURNOS_2021_03[[#This Row],[PERSONAL]],Capacidades_Personal,0),1) & \"\"","v":"N3"},"F3",{"$f":"INDEX(Turnos_Turno,TURNOS_2021_03[[#This Row],[FILA]],1)","v":""},{"$f":"INDEX(Turnos_Turno,TURNOS_2021_03[[#This Row],[FILA]],1)","v":""},{"$f":"INDEX(Turnos_Turno,TURNOS_2021_03[[#This Row],[FILA]],1)","v":""},{"$f":"INDEX(Turnos_Turno,TURNOS_2021_03[[#This Row],[FILA]],1)","v":""},{"$f":"INDEX(Turnos_Turno,TURNOS_2021_03[[#This Row],[FILA]],1)","v":""},{"$f":"INDEX(Turnos_Turno,TURNOS_2021_03[[#This Row],[FILA]],1)","v":""},{"$f":"INDEX(Turnos_Turno,TURNOS_2021_03[[#This Row],[FILA]],1)","v":""},{"$f":"INDEX(Turnos_Turno,TURNOS_2021_03[[#This Row],[FILA]],1)","v":""},{"$f":"INDEX(Turnos_Turno,TURNOS_2021_03[[#This Row],[FILA]],1)","v":""},{"$f":"INDEX(Turnos_Turno,TURNOS_2021_03[[#This Row],[FILA]],1)","v":""},{"$f":"INDEX(Turnos_Turno,TURNOS_2021_03[[#This Row],[FILA]],1)","v":""},{"$f":"INDEX(Turnos_Turno,TURNOS_2021_03[[#This Row],[FILA]],1)","v":""},{"$f":"INDEX(Turnos_Turno,TURNOS_2021_03[[#This Row],[FILA]],1)","v":""},{"$f":"INDEX(Turnos_Turno,TURNOS_2021_03[[#This Row],[FILA]],1)","v":""},{"$f":"INDEX(Turnos_Turno,TURNOS_2021_03[[#This Row],[FILA]],1)","v":""},{"$f":"INDEX(Turnos_Turno,TURNOS_2021_03[[#This Row],[FILA]],1)","v":""},{"$f":"INDEX(Turnos_Turno,TURNOS_2021_03[[#This Row],[FILA]],1)","v":""},{"$f":"INDEX(Turnos_Turno,TURNOS_2021_03[[#This Row],[FILA]],1)","v":""},{"$f":"INDEX(Turnos_Turno,TURNOS_2021_03[[#This Row],[FILA]],1)","v":""},{"$f":"INDEX(Turnos_Turno,TURNOS_2021_03[[#This Row],[FILA]],1)","v":""},{"$f":"INDEX(Turnos_Turno,TURNOS_2021_03[[#This Row],[FILA]],1)","v":""},{"$f":"INDEX(Turnos_Turno,TURNOS_2021_03[[#This Row],[FILA]],1)","v":""},{"$f":"INDEX(Turnos_Turno,TURNOS_2021_03[[#This Row],[FILA]],1)","v":""},{"$f":"INDEX(Turnos_Turno,TURNOS_2021_03[[#This Row],[FILA]],1)","v":""},{"$f":"INDEX(Turnos_Turno,TURNOS_2021_03[[#This Row],[FILA]],1)","v":""},{"$f":"INDEX(Turnos_Turno,TURNOS_2021_03[[#This Row],[FILA]],1)","v":""},{"$f":"INDEX(Turnos_Turno,TURNOS_2021_03[[#This Row],[FILA]],1)","v":""},{"$f":"INDEX(Turnos_Turno,TURNOS_2021_03[[#This Row],[FILA]],1)","v":""},{"$f":"INDEX(Turnos_Turno,TURNOS_2021_03[[#This Row],[FILA]],1)","v":""},{"$f":"INDEX(Turnos_Turno,TURNOS_2021_03[[#This Row],[FILA]],1)","v":""},{"$f":"INDEX(Turnos_Turno,TURNOS_2021_03[[#This Row],[FILA]],1)","v":""}]
[null,{"$f":"MATCH(TURNOS_2021_03[[#This Row],[PERSONAL]],Turnos_Personal,0)","v":4},{"$f":"INDEX(Capacidades_Nombre,MATCH(TURNOS_2021_03[[#This Row],[PERSONAL]],Capacidades_Personal,0),1) & \"\"","v":"N4"},"F4",{"$f":"INDEX(Turnos_Turno,TURNOS_2021_03[[#This Row],[FILA]],1)","v":""},{"$f":"INDEX(Turnos_Turno,TURNOS_2021_03[[#This Row],[FILA]],1)","v":""},{"$f":"INDEX(Turnos_Turno,TURNOS_2021_03[[#This Row],[FILA]],1)","v":""},{"$f":"INDEX(Turnos_Turno,TURNOS_2021_03[[#This Row],[FILA]],1)","v":""},{"$f":"INDEX(Turnos_Turno,TURNOS_2021_03[[#This Row],[FILA]],1)","v":""},{"$f":"INDEX(Turnos_Turno,TURNOS_2021_03[[#This Row],[FILA]],1)","v":""},{"$f":"INDEX(Turnos_Turno,TURNOS_2021_03[[#This Row],[FILA]],1)","v":""},{"$f":"INDEX(Turnos_Turno,TURNOS_2021_03[[#This Row],[FILA]],1)","v":""},{"$f":"INDEX(Turnos_Turno,TURNOS_2021_03[[#This Row],[FILA]],1)","v":""},{"$f":"INDEX(Turnos_Turno,TURNOS_2021_03[[#This Row],[FILA]],1)","v":""},{"$f":"INDEX(Turnos_Turno,TURNOS_2021_03[[#This Row],[FILA]],1)","v":""},{"$f":"INDEX(Turnos_Turno,TURNOS_2021_03[[#This Row],[FILA]],1)","v":""},{"$f":"INDEX(Turnos_Turno,TURNOS_2021_03[[#This Row],[FILA]],1)","v":""},{"$f":"INDEX(Turnos_Turno,TURNOS_2021_03[[#This Row],[FILA]],1)","v":""},{"$f":"INDEX(Turnos_Turno,TURNOS_2021_03[[#This Row],[FILA]],1)","v":""},{"$f":"INDEX(Turnos_Turno,TURNOS_2021_03[[#This Row],[FILA]],1)","v":""},{"$f":"INDEX(Turnos_Turno,TURNOS_2021_03[[#This Row],[FILA]],1)","v":""},{"$f":"INDEX(Turnos_Turno,TURNOS_2021_03[[#This Row],[FILA]],1)","v":""},{"$f":"INDEX(Turnos_Turno,TURNOS_2021_03[[#This Row],[FILA]],1)","v":""},{"$f":"INDEX(Turnos_Turno,TURNOS_2021_03[[#This Row],[FILA]],1)","v":""},{"$f":"INDEX(Turnos_Turno,TURNOS_2021_03[[#This Row],[FILA]],1)","v":""},{"$f":"INDEX(Turnos_Turno,TURNOS_2021_03[[#This Row],[FILA]],1)","v":""},{"$f":"INDEX(Turnos_Turno,TURNOS_2021_03[[#This Row],[FILA]],1)","v":""},{"$f":"INDEX(Turnos_Turno,TURNOS_2021_03[[#This Row],[FILA]],1)","v":""},{"$f":"INDEX(Turnos_Turno,TURNOS_2021_03[[#This Row],[FILA]],1)","v":""},{"$f":"INDEX(Turnos_Turno,TURNOS_2021_03[[#This Row],[FILA]],1)","v":""},{"$f":"INDEX(Turnos_Turno,TURNOS_2021_03[[#This Row],[FILA]],1)","v":""},{"$f":"INDEX(Turnos_Turno,TURNOS_2021_03[[#This Row],[FILA]],1)","v":""},{"$f":"INDEX(Turnos_Turno,TURNOS_2021_03[[#This Row],[FILA]],1)","v":""},{"$f":"INDEX(Turnos_Turno,TURNOS_2021_03[[#This Row],[FILA]],1)","v":""},{"$f":"INDEX(Turnos_Turno,TURNOS_2021_03[[#This Row],[FILA]],1)","v":""}]
[null,{"$f":"MATCH(TURNOS_2021_03[[#This Row],[PERSONAL]],Turnos_Personal,0)","v":5},{"$f":"INDEX(Capacidades_Nombre,MATCH(TURNOS_2021_03[[#This Row],[PERSONAL]],Capacidades_Personal,0),1) & \"\"","v":"N5"},"F5",{"$f":"INDEX(Turnos_Turno,TURNOS_2021_03[[#This Row],[FILA]],1)","v":""},{"$f":"INDEX(Turnos_Turno,TURNOS_2021_03[[#This Row],[FILA]],1)","v":""},{"$f":"INDEX(Turnos_Turno,TURNOS_2021_03[[#This Row],[FILA]],1)","v":""},{"$f":"INDEX(Turnos_Turno,TURNOS_2021_03[[#This Row],[FILA]],1)","v":""},{"$f":"INDEX(Turnos_Turno,TURNOS_2021_03[[#This Row],[FILA]],1)","v":""},{"$f":"INDEX(Turnos_Turno,TURNOS_2021_03[[#This Row],[FILA]],1)","v":""},{"$f":"INDEX(Turnos_Turno,TURNOS_2021_03[[#This Row],[FILA]],1)","v":""},{"$f":"INDEX(Turnos_Turno,TURNOS_2021_03[[#This Row],[FILA]],1)","v":""},{"$f":"INDEX(Turnos_Turno,TURNOS_2021_03[[#This Row],[FILA]],1)","v":""},{"$f":"INDEX(Turnos_Turno,TURNOS_2021_03[[#This Row],[FILA]],1)","v":""},{"$f":"INDEX(Turnos_Turno,TURNOS_2021_03[[#This Row],[FILA]],1)","v":""},{"$f":"INDEX(Turnos_Turno,TURNOS_2021_03[[#This Row],[FILA]],1)","v":""},{"$f":"INDEX(Turnos_Turno,TURNOS_2021_03[[#This Row],[FILA]],1)","v":""},{"$f":"INDEX(Turnos_Turno,TURNOS_2021_03[[#This Row],[FILA]],1)","v":""},{"$f":"INDEX(Turnos_Turno,TURNOS_2021_03[[#This Row],[FILA]],1)","v":""},{"$f":"INDEX(Turnos_Turno,TURNOS_2021_03[[#This Row],[FILA]],1)","v":""},{"$f":"INDEX(Turnos_Turno,TURNOS_2021_03[[#This Row],[FILA]],1)","v":""},{"$f":"INDEX(Turnos_Turno,TURNOS_2021_03[[#This Row],[FILA]],1)","v":""},{"$f":"INDEX(Turnos_Turno,TURNOS_2021_03[[#This Row],[FILA]],1)","v":""},{"$f":"INDEX(Turnos_Turno,TURNOS_2021_03[[#This Row],[FILA]],1)","v":""},{"$f":"INDEX(Turnos_Turno,TURNOS_2021_03[[#This Row],[FILA]],1)","v":""},{"$f":"INDEX(Turnos_Turno,TURNOS_2021_03[[#This Row],[FILA]],1)","v":""},{"$f":"INDEX(Turnos_Turno,TURNOS_2021_03[[#This Row],[FILA]],1)","v":""},{"$f":"INDEX(Turnos_Turno,TURNOS_2021_03[[#This Row],[FILA]],1)","v":""},{"$f":"INDEX(Turnos_Turno,TURNOS_2021_03[[#This Row],[FILA]],1)","v":""},{"$f":"INDEX(Turnos_Turno,TURNOS_2021_03[[#This Row],[FILA]],1)","v":""},{"$f":"INDEX(Turnos_Turno,TURNOS_2021_03[[#This Row],[FILA]],1)","v":""},{"$f":"INDEX(Turnos_Turno,TURNOS_2021_03[[#This Row],[FILA]],1)","v":""},{"$f":"INDEX(Turnos_Turno,TURNOS_2021_03[[#This Row],[FILA]],1)","v":""},{"$f":"INDEX(Turnos_Turno,TURNOS_2021_03[[#This Row],[FILA]],1)","v":""},{"$f":"INDEX(Turnos_Turno,TURNOS_2021_03[[#This Row],[FILA]],1)","v":""}]
[null,{"$f":"MATCH(TURNOS_2021_03[[#This Row],[PERSONAL]],Turnos_Personal,0)","v":6},{"$f":"INDEX(Capacidades_Nombre,MATCH(TURNOS_2021_03[[#This Row],[PERSONAL]],Capacidades_Personal,0),1) & \"\"","v":"N6"},"F6",{"$f":"INDEX(Turnos_Turno,TURNOS_2021_03[[#This Row],[FILA]],1)","v":""},{"$f":"INDEX(Turnos_Turno,TURNOS_2021_03[[#This Row],[FILA]],1)","v":""},{"$f":"INDEX(Turnos_Turno,TURNOS_2021_03[[#This Row],[FILA]],1)","v":""},{"$f":"INDEX(Turnos_Turno,TURNOS_2021_03[[#This Row],[FILA]],1)","v":""},{"$f":"INDEX(Turnos_Turno,TURNOS_2021_03[[#This Row],[FILA]],1)","v":""},{"$f":"INDEX(Turnos_Turno,TURNOS_2021_03[[#This Row],[FILA]],1)","v":""},{"$f":"INDEX(Turnos_Turno,TURNOS_2021_03[[#This Row],[FILA]],1)","v":""},{"$f":"INDEX(Turnos_Turno,TURNOS_2021_03[[#This Row],[FILA]],1)","v":""},{"$f":"INDEX(Turnos_Turno,TURNOS_2021_03[[#This Row],[FILA]],1)","v":""},{"$f":"INDEX(Turnos_Turno,TURNOS_2021_03[[#This Row],[FILA]],1)","v":""},{"$f":"INDEX(Turnos_Turno,TURNOS_2021_03[[#This Row],[FILA]],1)","v":""},{"$f":"INDEX(Turnos_Turno,TURNOS_2021_03[[#This Row],[FILA]],1)","v":""},{"$f":"INDEX(Turnos_Turno,TURNOS_2021_03[[#This Row],[FILA]],1)","v":""},{"$f":"INDEX(Turnos_Turno,TURNOS_2021_03[[#This Row],[FILA]],1)","v":""},{"$f":"INDEX(Turnos_Turno,TURNOS_2021_03[[#This Row],[FILA]],1)","v":""},{"$f":"INDEX(Turnos_Turno,TURNOS_2021_03[[#This Row],[FILA]],1)","v":""},{"$f":"INDEX(Turnos_Turno,TURNOS_2021_03[[#This Row],[FILA]],1)","v":""},{"$f":"INDEX(Turnos_Turno,TURNOS_2021_03[[#This Row],[FILA]],1)","v":""},{"$f":"INDEX(Turnos_Turno,TURNOS_2021_03[[#This Row],[FILA]],1)","v":""},{"$f":"INDEX(Turnos_Turno,TURNOS_2021_03[[#This Row],[FILA]],1)","v":""},{"$f":"INDEX(Turnos_Turno,TURNOS_2021_03[[#This Row],[FILA]],1)","v":""},{"$f":"INDEX(Turnos_Turno,TURNOS_2021_03[[#This Row],[FILA]],1)","v":""},{"$f":"INDEX(Turnos_Turno,TURNOS_2021_03[[#This Row],[FILA]],1)","v":""},{"$f":"INDEX(Turnos_Turno,TURNOS_2021_03[[#This Row],[FILA]],1)","v":""},{"$f":"INDEX(Turnos_Turno,TURNOS_2021_03[[#This Row],[FILA]],1)","v":""},{"$f":"INDEX(Turnos_Turno,TURNOS_2021_03[[#This Row],[FILA]],1)","v":""},{"$f":"INDEX(Turnos_Turno,TURNOS_2021_03[[#This Row],[FILA]],1)","v":""},{"$f":"INDEX(Turnos_Turno,TURNOS_2021_03[[#This Row],[FILA]],1)","v":""},{"$f":"INDEX(Turnos_Turno,TURNOS_2021_03[[#This Row],[FILA]],1)","v":""},{"$f":"INDEX(Turnos_Turno,TURNOS_2021_03[[#This Row],[FILA]],1)","v":""},{"$f":"INDEX(Turnos_Turno,TURNOS_2021_03[[#This Row],[FILA]],1)","v":""}]
[null,{"$f":"MATCH(TURNOS_2021_03[[#This Row],[PERSONAL]],Turnos_Personal,0)","v":7},{"$f":"INDEX(Capacidades_Nombre,MATCH(TURNOS_2021_03[[#This Row],[PERSONAL]],Capacidades_Personal,0),1) & \"\"","v":"N7"},"F7",{"$f":"INDEX(Turnos_Turno,TURNOS_2021_03[[#This Row],[FILA]],1)","v":""},{"$f":"INDEX(Turnos_Turno,TURNOS_2021_03[[#This Row],[FILA]],1)","v":""},{"$f":"INDEX(Turnos_Turno,TURNOS_2021_03[[#This Row],[FILA]],1)","v":""},{"$f":"INDEX(Turnos_Turno,TURNOS_2021_03[[#This Row],[FILA]],1)","v":""},{"$f":"INDEX(Turnos_Turno,TURNOS_2021_03[[#This Row],[FILA]],1)","v":""},{"$f":"INDEX(Turnos_Turno,TURNOS_2021_03[[#This Row],[FILA]],1)","v":""},{"$f":"INDEX(Turnos_Turno,TURNOS_2021_03[[#This Row],[FILA]],1)","v":""},{"$f":"INDEX(Turnos_Turno,TURNOS_2021_03[[#This Row],[FILA]],1)","v":""},{"$f":"INDEX(Turnos_Turno,TURNOS_2021_03[[#This Row],[FILA]],1)","v":""},{"$f":"INDEX(Turnos_Turno,TURNOS_2021_03[[#This Row],[FILA]],1)","v":""},{"$f":"INDEX(Turnos_Turno,TURNOS_2021_03[[#This Row],[FILA]],1)","v":""},{"$f":"INDEX(Turnos_Turno,TURNOS_2021_03[[#This Row],[FILA]],1)","v":""},{"$f":"INDEX(Turnos_Turno,TURNOS_2021_03[[#This Row],[FILA]],1)","v":""},{"$f":"INDEX(Turnos_Turno,TURNOS_2021_03[[#This Row],[FILA]],1)","v":""},{"$f":"INDEX(Turnos_Turno,TURNOS_2021_03[[#This Row],[FILA]],1)","v":""},{"$f":"INDEX(Turnos_Turno,TURNOS_2021_03[[#This Row],[FILA]],1)","v":""},{"$f":"INDEX(Turnos_Turno,TURNOS_2021_03[[#This Row],[FILA]],1)","v":""},{"$f":"INDEX(Turnos_Turno,TURNOS_2021_03[[#This Row],[FILA]],1)","v":""},{"$f":"INDEX(Turnos_Turno,TURNOS_2021_03[[#This Row],[FILA]],1)","v":""},{"$f":"INDEX(Turnos_Turno,TURNOS_2021_03[[#This Row],[FILA]],1)","v":""},{"$f":"INDEX(Turnos_Turno,TURNOS_2021_03[[#This Row],[FILA]],1)","v":""},{"$f":"INDEX(Turnos_Turno,TURNOS_2021_03[[#This Row],[FILA]],1)","v":""},{"$f":"INDEX(Turnos_Turno,TURNOS_2021_03[[#This Row],[FILA]],1)","v":""},{"$f":"INDEX(Turnos_Turno,TURNOS_2021_03[[#This Row],[FILA]],1)","v":""},{"$f":"INDEX(Turnos_Turno,TURNOS_2021_03[[#This Row],[FILA]],1)","v":""},{"$f":"INDEX(Turnos_Turno,TURNOS_2021_03[[#This Row],[FILA]],1)","v":""},{"$f":"INDEX(Turnos_Turno,TURNOS_2021_03[[#This Row],[FILA]],1)","v":""},{"$f":"INDEX(Turnos_Turno,TURNOS_2021_03[[#This Row],[FILA]],1)","v":""},{"$f":"INDEX(Turnos_Turno,TURNOS_2021_03[[#This Row],[FILA]],1)","v":""},{"$f":"INDEX(Turnos_Turno,TURNOS_2021_03[[#This Row],[FILA]],1)","v":""},{"$f":"INDEX(Turnos_Turno,TURNOS_2021_03[[#This Row],[FILA]],1)","v":""}]
[null,{"$f":"MATCH(TURNOS_2021_03[[#This Row],[PERSONAL]],Turnos_Personal,0)","v":8},{"$f":"INDEX(Capacidades_Nombre,MATCH(TURNOS_2021_03[[#This Row],[PERSONAL]],Capacidades_Personal,0),1) & \"\"","v":"N8"},"F8",{"$f":"INDEX(Turnos_Turno,TURNOS_2021_03[[#This Row],[FILA]],1)","v":""},{"$f":"INDEX(Turnos_Turno,TURNOS_2021_03[[#This Row],[FILA]],1)","v":""},{"$f":"INDEX(Turnos_Turno,TURNOS_2021_03[[#This Row],[FILA]],1)","v":""},{"$f":"INDEX(Turnos_Turno,TURNOS_2021_03[[#This Row],[FILA]],1)","v":""},{"$f":"INDEX(Turnos_Turno,TURNOS_2021_03[[#This Row],[FILA]],1)","v":""},{"$f":"INDEX(Turnos_Turno,TURNOS_2021_03[[#This Row],[FILA]],1)","v":""},{"$f":"INDEX(Turnos_Turno,TURNOS_2021_03[[#This Row],[FILA]],1)","v":""},{"$f":"INDEX(Turnos_Turno,TURNOS_2021_03[[#This Row],[FILA]],1)","v":""},{"$f":"INDEX(Turnos_Turno,TURNOS_2021_03[[#This Row],[FILA]],1)","v":""},{"$f":"INDEX(Turnos_Turno,TURNOS_2021_03[[#This Row],[FILA]],1)","v":""},{"$f":"INDEX(Turnos_Turno,TURNOS_2021_03[[#This Row],[FILA]],1)","v":""},{"$f":"INDEX(Turnos_Turno,TURNOS_2021_03[[#This Row],[FILA]],1)","v":""},{"$f":"INDEX(Turnos_Turno,TURNOS_2021_03[[#This Row],[FILA]],1)","v":""},{"$f":"INDEX(Turnos_Turno,TURNOS_2021_03[[#This Row],[FILA]],1)","v":""},{"$f":"INDEX(Turnos_Turno,TURNOS_2021_03[[#This Row],[FILA]],1)","v":""},{"$f":"INDEX(Turnos_Turno,TURNOS_2021_03[[#This Row],[FILA]],1)","v":""},{"$f":"INDEX(Turnos_Turno,TURNOS_2021_03[[#This Row],[FILA]],1)","v":""},{"$f":"INDEX(Turnos_Turno,TURNOS_2021_03[[#This Row],[FILA]],1)","v":""},{"$f":"INDEX(Turnos_Turno,TURNOS_2021_03[[#This Row],[FILA]],1)","v":""},{"$f":"INDEX(Turnos_Turno,TURNOS_2021_03[[#This Row],[FILA]],1)","v":""},{"$f":"INDEX(Turnos_Turno,TURNOS_2021_03[[#This Row],[FILA]],1)","v":""},{"$f":"INDEX(Turnos_Turno,TURNOS_2021_03[[#This Row],[FILA]],1)","v":""},{"$f":"INDEX(Turnos_Turno,TURNOS_2021_03[[#This Row],[FILA]],1)","v":""},{"$f":"INDEX(Turnos_Turno,TURNOS_2021_03[[#This Row],[FILA]],1)","v":""},{"$f":"INDEX(Turnos_Turno,TURNOS_2021_03[[#This Row],[FILA]],1)","v":""},{"$f":"INDEX(Turnos_Turno,TURNOS_2021_03[[#This Row],[FILA]],1)","v":""},{"$f":"INDEX(Turnos_Turno,TURNOS_2021_03[[#This Row],[FILA]],1)","v":""},{"$f":"INDEX(Turnos_Turno,TURNOS_2021_03[[#This Row],[FILA]],1)","v":""},{"$f":"INDEX(Turnos_Turno,TURNOS_2021_03[[#This Row],[FILA]],1)","v":""},{"$f":"INDEX(Turnos_Turno,TURNOS_2021_03[[#This Row],[FILA]],1)","v":""},{"$f":"INDEX(Turnos_Turno,TURNOS_2021_03[[#This Row],[FILA]],1)","v":""}]
[null,{"$f":"MATCH(TURNOS_2021_03[[#This Row],[PERSONAL]],Turnos_Personal,0)","v":9},{"$f":"INDEX(Capacidades_Nombre,MATCH(TURNOS_2021_03[[#This Row],[PERSONAL]],Capacidades_Personal,0),1) & \"\"","v":"N9"},"F9",{"$f":"INDEX(Turnos_Turno,TURNOS_2021_03[[#This Row],[FILA]],1)","v":""},{"$f":"INDEX(Turnos_Turno,TURNOS_2021_03[[#This Row],[FILA]],1)","v":""},{"$f":"INDEX(Turnos_Turno,TURNOS_2021_03[[#This Row],[FILA]],1)","v":""},{"$f":"INDEX(Turnos_Turno,TURNOS_2021_03[[#This Row],[FILA]],1)","v":""},{"$f":"INDEX(Turnos_Turno,TURNOS_2021_03[[#This Row],[FILA]],1)","v":""},{"$f":"INDEX(Turnos_Turno,TURNOS_2021_03[[#This Row],[FILA]],1)","v":""},{"$f":"INDEX(Turnos_Turno,TURNOS_2021_03[[#This Row],[FILA]],1)","v":""},{"$f":"INDEX(Turnos_Turno,TURNOS_2021_03[[#This Row],[FILA]],1)","v":""},{"$f":"INDEX(Turnos_Turno,TURNOS_2021_03[[#This Row],[FILA]],1)","v":""},{"$f":"INDEX(Turnos_Turno,TURNOS_2021_03[[#This Row],[FILA]],1)","v":""},{"$f":"INDEX(Turnos_Turno,TURNOS_2021_03[[#This Row],[FILA]],1)","v":""},{"$f":"INDEX(Turnos_Turno,TURNOS_2021_03[[#This Row],[FILA]],1)","v":""},{"$f":"INDEX(Turnos_Turno,TURNOS_2021_03[[#This Row],[FILA]],1)","v":""},{"$f":"INDEX(Turnos_Turno,TURNOS_2021_03[[#This Row],[FILA]],1)","v":""},{"$f":"INDEX(Turnos_Turno,TURNOS_2021_03[[#This Row],[FILA]],1)","v":""},{"$f":"INDEX(Turnos_Turno,TURNOS_2021_03[[#This Row],[FILA]],1)","v":""},{"$f":"INDEX(Turnos_Turno,TURNOS_2021_03[[#This Row],[FILA]],1)","v":""},{"$f":"INDEX(Turnos_Turno,TURNOS_2021_03[[#This Row],[FILA]],1)","v":""},{"$f":"INDEX(Turnos_Turno,TURNOS_2021_03[[#This Row],[FILA]],1)","v":""},{"$f":"INDEX(Turnos_Turno,TURNOS_2021_03[[#This Row],[FILA]],1)","v":""},{"$f":"INDEX(Turnos_Turno,TURNOS_2021_03[[#This Row],[FILA]],1)","v":""},{"$f":"INDEX(Turnos_Turno,TURNOS_2021_03[[#This Row],[FILA]],1)","v":""},{"$f":"INDEX(Turnos_Turno,TURNOS_2021_03[[#This Row],[FILA]],1)","v":""},{"$f":"INDEX(Turnos_Turno,TURNOS_2021_03[[#This Row],[FILA]],1)","v":""},{"$f":"INDEX(Turnos_Turno,TURNOS_2021_03[[#This Row],[FILA]],1)","v":""},{"$f":"INDEX(Turnos_Turno,TURNOS_2021_03[[#This Row],[FILA]],1)","v":""},{"$f":"INDEX(Turnos_Turno,TURNOS_2021_03[[#This Row],[FILA]],1)","v":""},{"$f":"INDEX(Turnos_Turno,TURNOS_2021_03[[#This Row],[FILA]],1)","v":""},{"$f":"INDEX(Turnos_Turno,TURNOS_2021_03[[#This Row],[FILA]],1)","v":""},{"$f":"INDEX(Turnos_Turno,TURNOS_2021_03[[#This Row],[FILA]],1)","v":""},{"$f":"INDEX(Turnos_Turno,TURNOS_2021_03[[#This Row],[FILA]],1)","v":""}]
[null,{"$f":"MATCH(TURNOS_2021_03[[#This Row],[PERSONAL]],Turnos_Personal,0)","v":10},{"$f":"INDEX(Capacidades_Nombre,MATCH(TURNOS_2021_03[[#This Row],[PERSONAL]],Capacidades_Personal,0),1) & \"\"","v":"N10"},"F10",{"$f":"INDEX(Turnos_Turno,TURNOS_2021_03[[#This Row],[FILA]],1)","v":""},{"$f":"INDEX(Turnos_Turno,TURNOS_2021_03[[#This Row],[FILA]],1)","v":""},{"$f":"INDEX(Turnos_Turno,TURNOS_2021_03[[#This Row],[FILA]],1)","v":""},{"$f":"INDEX(Turnos_Turno,TURNOS_2021_03[[#This Row],[FILA]],1)","v":""},{"$f":"INDEX(Turnos_Turno,TURNOS_2021_03[[#This Row],[FILA]],1)","v":""},{"$f":"INDEX(Turnos_Turno,TURNOS_2021_03[[#This Row],[FILA]],1)","v":""},{"$f":"INDEX(Turnos_Turno,TURNOS_2021_03[[#This Row],[FILA]],1)","v":""},{"$f":"INDEX(Turnos_Turno,TURNOS_2021_03[[#This Row],[FILA]],1)","v":""},{"$f":"INDEX(Turnos_Turno,TURNOS_2021_03[[#This Row],[FILA]],1)","v":""},{"$f":"INDEX(Turnos_Turno,TURNOS_2021_03[[#This Row],[FILA]],1)","v":""},{"$f":"INDEX(Turnos_Turno,TURNOS_2021_03[[#This Row],[FILA]],1)","v":""},{"$f":"INDEX(Turnos_Turno,TURNOS_2021_03[[#This Row],[FILA]],1)","v":""},{"$f":"INDEX(Turnos_Turno,TURNOS_2021_03[[#This Row],[FILA]],1)","v":""},{"$f":"INDEX(Turnos_Turno,TURNOS_2021_03[[#This Row],[FILA]],1)","v":""},{"$f":"INDEX(Turnos_Turno,TURNOS_2021_03[[#This Row],[FILA]],1)","v":""},{"$f":"INDEX(Turnos_Turno,TURNOS_2021_03[[#This Row],[FILA]],1)","v":""},{"$f":"INDEX(Turnos_Turno,TURNOS_2021_03[[#This Row],[FILA]],1)","v":""},{"$f":"INDEX(Turnos_Turno,TURNOS_2021_03[[#This Row],[FILA]],1)","v":""},{"$f":"INDEX(Turnos_Turno,TURNOS_2021_03[[#This Row],[FILA]],1)","v":""},{"$f":"INDEX(Turnos_Turno,TURNOS_2021_03[[#This Row],[FILA]],1)","v":""},{"$f":"INDEX(Turnos_Turno,TURNOS_2021_03[[#This Row],[FILA]],1)","v":""},{"$f":"INDEX(Turnos_Turno,TURNOS_2021_03[[#This Row],[FILA]],1)","v":""},{"$f":"INDEX(Turnos_Turno,TURNOS_2021_03[[#This Row],[FILA]],1)","v":""},{"$f":"INDEX(Turnos_Turno,TURNOS_2021_03[[#This Row],[FILA]],1)","v":""},{"$f":"INDEX(Turnos_Turno,TURNOS_2021_03[[#This Row],[FILA]],1)","v":""},{"$f":"INDEX(Turnos_Turno,TURNOS_2021_03[[#This Row],[FILA]],1)","v":""},{"$f":"INDEX(Turnos_Turno,TURNOS_2021_03[[#This Row],[FILA]],1)","v":""},{"$f":"INDEX(Turnos_Turno,TURNOS_2021_03[[#This Row],[FILA]],1)","v":""},{"$f":"INDEX(Turnos_Turno,TURNOS_2021_03[[#This Row],[FILA]],1)","v":""},{"$f":"INDEX(Turnos_Turno,TURNOS_2021_03[[#This Row],[FILA]],1)","v":""},{"$f":"INDEX(Turnos_Turno,TURNOS_2021_03[[#This Row],[FILA]],1)","v":""}]
[null,{"$f":"MATCH(TURNOS_2021_03[[#This Row],[PERSONAL]],Turnos_Personal,0)","v":11},{"$f":"INDEX(Capacidades_Nombre,MATCH(TURNOS_2021_03[[#This Row],[PERSONAL]],Capacidades_Personal,0),1) & \"\"","v":"N11"},"F11",{"$f":"INDEX(Turnos_Turno,TURNOS_2021_03[[#This Row],[FILA]],1)","v":""},{"$f":"INDEX(Turnos_Turno,TURNOS_2021_03[[#This Row],[FILA]],1)","v":""},{"$f":"INDEX(Turnos_Turno,TURNOS_2021_03[[#This Row],[FILA]],1)","v":""},{"$f":"INDEX(Turnos_Turno,TURNOS_2021_03[[#This Row],[FILA]],1)","v":""},{"$f":"INDEX(Turnos_Turno,TURNOS_2021_03[[#This Row],[FILA]],1)","v":""},{"$f":"INDEX(Turnos_Turno,TURNOS_2021_03[[#This Row],[FILA]],1)","v":""},{"$f":"INDEX(Turnos_Turno,TURNOS_2021_03[[#This Row],[FILA]],1)","v":""},{"$f":"INDEX(Turnos_Turno,TURNOS_2021_03[[#This Row],[FILA]],1)","v":""},{"$f":"INDEX(Turnos_Turno,TURNOS_2021_03[[#This Row],[FILA]],1)","v":""},{"$f":"INDEX(Turnos_Turno,TURNOS_2021_03[[#This Row],[FILA]],1)","v":""},{"$f":"INDEX(Turnos_Turno,TURNOS_2021_03[[#This Row],[FILA]],1)","v":""},{"$f":"INDEX(Turnos_Turno,TURNOS_2021_03[[#This Row],[FILA]],1)","v":""},{"$f":"INDEX(Turnos_Turno,TURNOS_2021_03[[#This Row],[FILA]],1)","v":""},{"$f":"INDEX(Turnos_Turno,TURNOS_2021_03[[#This Row],[FILA]],1)","v":""},{"$f":"INDEX(Turnos_Turno,TURNOS_2021_03[[#This Row],[FILA]],1)","v":""},{"$f":"INDEX(Turnos_Turno,TURNOS_2021_03[[#This Row],[FILA]],1)","v":""},{"$f":"INDEX(Turnos_Turno,TURNOS_2021_03[[#This Row],[FILA]],1)","v":""},{"$f":"INDEX(Turnos_Turno,TURNOS_2021_03[[#This Row],[FILA]],1)","v":""},{"$f":"INDEX(Turnos_Turno,TURNOS_2021_03[[#This Row],[FILA]],1)","v":""},{"$f":"INDEX(Turnos_Turno,TURNOS_2021_03[[#This Row],[FILA]],1)","v":""},{"$f":"INDEX(Turnos_Turno,TURNOS_2021_03[[#This Row],[FILA]],1)","v":""},{"$f":"INDEX(Turnos_Turno,TURNOS_2021_03[[#This Row],[FILA]],1)","v":""},{"$f":"INDEX(Turnos_Turno,TURNOS_2021_03[[#This Row],[FILA]],1)","v":""},{"$f":"INDEX(Turnos_Turno,TURNOS_2021_03[[#This Row],[FILA]],1)","v":""},{"$f":"INDEX(Turnos_Turno,TURNOS_2021_03[[#This Row],[FILA]],1)","v":""},{"$f":"INDEX(Turnos_Turno,TURNOS_2021_03[[#This Row],[FILA]],1)","v":""},{"$f":"INDEX(Turnos_Turno,TURNOS_2021_03[[#This Row],[FILA]],1)","v":""},{"$f":"INDEX(Turnos_Turno,TURNOS_2021_03[[#This Row],[FILA]],1)","v":""},{"$f":"INDEX(Turnos_Turno,TURNOS_2021_03[[#This Row],[FILA]],1)","v":""},{"$f":"INDEX(Turnos_Turno,TURNOS_2021_03[[#This Row],[FILA]],1)","v":""},{"$f":"INDEX(Turnos_Turno,TURNOS_2021_03[[#This Row],[FILA]],1)","v":""}]
[null,{"$f":"MATCH(TURNOS_2021_03[[#This Row],[PERSONAL]],Turnos_Personal,0)","v":12},{"$f":"INDEX(Capacidades_Nombre,MATCH(TURNOS_2021_03[[#This Row],[PERSONAL]],Capacidades_Personal,0),1) & \"\"","v":"N12"},"F12",{"$f":"INDEX(Turnos_Turno,TURNOS_2021_03[[#This Row],[FILA]],1)","v":""},{"$f":"INDEX(Turnos_Turno,TURNOS_2021_03[[#This Row],[FILA]],1)","v":""},{"$f":"INDEX(Turnos_Turno,TURNOS_2021_03[[#This Row],[FILA]],1)","v":""},{"$f":"INDEX(Turnos_Turno,TURNOS_2021_03[[#This Row],[FILA]],1)","v":""},{"$f":"INDEX(Turnos_Turno,TURNOS_2021_03[[#This Row],[FILA]],1)","v":""},{"$f":"INDEX(Turnos_Turno,TURNOS_2021_03[[#This Row],[FILA]],1)","v":""},{"$f":"INDEX(Turnos_Turno,TURNOS_2021_03[[#This Row],[FILA]],1)","v":""},{"$f":"INDEX(Turnos_Turno,TURNOS_2021_03[[#This Row],[FILA]],1)","v":""},{"$f":"INDEX(Turnos_Turno,TURNOS_2021_03[[#This Row],[FILA]],1)","v":""},{"$f":"INDEX(Turnos_Turno,TURNOS_2021_03[[#This Row],[FILA]],1)","v":""},{"$f":"INDEX(Turnos_Turno,TURNOS_2021_03[[#This Row],[FILA]],1)","v":""},{"$f":"INDEX(Turnos_Turno,TURNOS_2021_03[[#This Row],[FILA]],1)","v":""},{"$f":"INDEX(Turnos_Turno,TURNOS_2021_03[[#This Row],[FILA]],1)","v":""},{"$f":"INDEX(Turnos_Turno,TURNOS_2021_03[[#This Row],[FILA]],1)","v":""},{"$f":"INDEX(Turnos_Turno,TURNOS_2021_03[[#This Row],[FILA]],1)","v":""},{"$f":"INDEX(Turnos_Turno,TURNOS_2021_03[[#This Row],[FILA]],1)","v":""},{"$f":"INDEX(Turnos_Turno,TURNOS_2021_03[[#This Row],[FILA]],1)","v":""},{"$f":"INDEX(Turnos_Turno,TURNOS_2021_03[[#This Row],[FILA]],1)","v":""},{"$f":"INDEX(Turnos_Turno,TURNOS_2021_03[[#This Row],[FILA]],1)","v":""},{"$f":"INDEX(Turnos_Turno,TURNOS_2021_03[[#This Row],[FILA]],1)","v":""},{"$f":"INDEX(Turnos_Turno,TURNOS_2021_03[[#This Row],[FILA]],1)","v":""},{"$f":"INDEX(Turnos_Turno,TURNOS_2021_03[[#This Row],[FILA]],1)","v":""},{"$f":"INDEX(Turnos_Turno,TURNOS_2021_03[[#This Row],[FILA]],1)","v":""},{"$f":"INDEX(Turnos_Turno,TURNOS_2021_03[[#This Row],[FILA]],1)","v":""},{"$f":"INDEX(Turnos_Turno,TURNOS_2021_03[[#This Row],[FILA]],1)","v":""},{"$f":"INDEX(Turnos_Turno,TURNOS_2021_03[[#This Row],[FILA]],1)","v":""},{"$f":"INDEX(Turnos_Turno,TURNOS_2021_03[[#This Row],[FILA]],1)","v":""},{"$f":"INDEX(Turnos_Turno,TURNOS_2021_03[[#This Row],[FILA]],1)","v":""},{"$f":"INDEX(Turnos_Turno,TURNOS_2021_03[[#This Row],[FILA]],1)","v":""},{"$f":"INDEX(Turnos_Turno,TURNOS_2021_03[[#This Row],[FILA]],1)","v":""},{"$f":"INDEX(Turnos_Turno,TURNOS_2021_03[[#This Row],[FILA]],1)","v":""}]
[null,{"$f":"MATCH(TURNOS_2021_03[[#This Row],[PERSONAL]],Turnos_Personal,0)","v":13},{"$f":"INDEX(Capacidades_Nombre,MATCH(TURNOS_2021_03[[#This Row],[PERSONAL]],Capacidades_Personal,0),1) & \"\"","v":"N13"},"F13",{"$f":"INDEX(Turnos_Turno,TURNOS_2021_03[[#This Row],[FILA]],1)","v":""},{"$f":"INDEX(Turnos_Turno,TURNOS_2021_03[[#This Row],[FILA]],1)","v":""},{"$f":"INDEX(Turnos_Turno,TURNOS_2021_03[[#This Row],[FILA]],1)","v":""},{"$f":"INDEX(Turnos_Turno,TURNOS_2021_03[[#This Row],[FILA]],1)","v":""},{"$f":"INDEX(Turnos_Turno,TURNOS_2021_03[[#This Row],[FILA]],1)","v":""},{"$f":"INDEX(Turnos_Turno,TURNOS_2021_03[[#This Row],[FILA]],1)","v":""},{"$f":"INDEX(Turnos_Turno,TURNOS_2021_03[[#This Row],[FILA]],1)","v":""},{"$f":"INDEX(Turnos_Turno,TURNOS_2021_03[[#This Row],[FILA]],1)","v":""},{"$f":"INDEX(Turnos_Turno,TURNOS_2021_03[[#This Row],[FILA]],1)","v":""},{"$f":"INDEX(Turnos_Turno,TURNOS_2021_03[[#This Row],[FILA]],1)","v":""},{"$f":"INDEX(Turnos_Turno,TURNOS_2021_03[[#This Row],[FILA]],1)","v":""},{"$f":"INDEX(Turnos_Turno,TURNOS_2021_03[[#This Row],[FILA]],1)","v":""},{"$f":"INDEX(Turnos_Turno,TURNOS_2021_03[[#This Row],[FILA]],1)","v":""},{"$f":"INDEX(Turnos_Turno,TURNOS_2021_03[[#This Row],[FILA]],1)","v":""},{"$f":"INDEX(Turnos_Turno,TURNOS_2021_03[[#This Row],[FILA]],1)","v":""},{"$f":"INDEX(Turnos_Turno,TURNOS_2021_03[[#This Row],[FILA]],1)","v":""},{"$f":"INDEX(Turnos_Turno,TURNOS_2021_03[[#This Row],[FILA]],1)","v":""},{"$f":"INDEX(Turnos_Turno,TURNOS_2021_03[[#This Row],[FILA]],1)","v":""},{"$f":"INDEX(Turnos_Turno,TURNOS_2021_03[[#This Row],[FILA]],1)","v":""},{"$f":"INDEX(Turnos_Turno,TURNOS_2021_03[[#This Row],[FILA]],1)","v":""},{"$f":"INDEX(Turnos_Turno,TURNOS_2021_03[[#This Row],[FILA]],1)","v":""},{"$f":"INDEX(Turnos_Turno,TURNOS_2021_03[[#This Row],[FILA]],1)","v":""},{"$f":"INDEX(Turnos_Turno,TURNOS_2021_03[[#This Row],[FILA]],1)","v":""},{"$f":"INDEX(Turnos_Turno,TURNOS_2021_03[[#This Row],[FILA]],1)","v":""},{"$f":"INDEX(Turnos_Turno,TURNOS_2021_03[[#This Row],[FILA]],1)","v":""},{"$f":"INDEX(Turnos_Turno,TURNOS_2021_03[[#This Row],[FILA]],1)","v":""},{"$f":"INDEX(Turnos_Turno,TURNOS_2021_03[[#This Row],[FILA]],1)","v":""},{"$f":"INDEX(Turnos_Turno,TURNOS_2021_03[[#This Row],[FILA]],1)","v":""},{"$f":"INDEX(Turnos_Turno,TURNOS_2021_03[[#This Row],[FILA]],1)","v":""},{"$f":"INDEX(Turnos_Turno,TURNOS_2021_03[[#This Row],[FILA]],1)","v":""},{"$f":"INDEX(Turnos_Turno,TURNOS_2021_03[[#This Row],[FILA]],1)","v":""}]
[null,{"$f":"MATCH(TURNOS_2021_03[[#This Row],[PERSONAL]],Turnos_Personal,0)","v":14},{"$f":"INDEX(Capacidades_Nombre,MATCH(TURNOS_2021_03[[#This Row],[PERSONAL]],Capacidades_Personal,0),1) & \"\"","v":"N14"},"F14",{"$f":"INDEX(Turnos_Turno,TURNOS_2021_03[[#This Row],[FILA]],1)","v":""},{"$f":"INDEX(Turnos_Turno,TURNOS_2021_03[[#This Row],[FILA]],1)","v":""},{"$f":"INDEX(Turnos_Turno,TURNOS_2021_03[[#This Row],[FILA]],1)","v":""},{"$f":"INDEX(Turnos_Turno,TURNOS_2021_03[[#This Row],[FILA]],1)","v":""},{"$f":"INDEX(Turnos_Turno,TURNOS_2021_03[[#This Row],[FILA]],1)","v":""},{"$f":"INDEX(Turnos_Turno,TURNOS_2021_03[[#This Row],[FILA]],1)","v":""},{"$f":"INDEX(Turnos_Turno,TURNOS_2021_03[[#This Row],[FILA]],1)","v":""},{"$f":"INDEX(Turnos_Turno,TURNOS_2021_03[[#This Row],[FILA]],1)","v":""},{"$f":"INDEX(Turnos_Turno,TURNOS_2021_03[[#This Row],[FILA]],1)","v":""},{"$f":"INDEX(Turnos_Turno,TURNOS_2021_03[[#This Row],[FILA]],1)","v":""},{"$f":"INDEX(Turnos_Turno,TURNOS_2021_03[[#This Row],[FILA]],1)","v":""},{"$f":"INDEX(Turnos_Turno,TURNOS_2021_03[[#This Row],[FILA]],1)","v":""},{"$f":"INDEX(Turnos_Turno,TURNOS_2021_03[[#This Row],[FILA]],1)","v":""},{"$f":"INDEX(Turnos_Turno,TURNOS_2021_03[[#This Row],[FILA]],1)","v":""},{"$f":"INDEX(Turnos_Turno,TURNOS_2021_03[[#This Row],[FILA]],1)","v":""},{"$f":"INDEX(Turnos_Turno,TURNOS_2021_03[[#This Row],[FILA]],1)","v":""},{"$f":"INDEX(Turnos_Turno,TURNOS_2021_03[[#This Row],[FILA]],1)","v":""},{"$f":"INDEX(Turnos_Turno,TURNOS_2021_03[[#This Row],[FILA]],1)","v":""},{"$f":"INDEX(Turnos_Turno,TURNOS_2021_03[[#This Row],[FILA]],1)","v":""},{"$f":"INDEX(Turnos_Turno,TURNOS_2021_03[[#This Row],[FILA]],1)","v":""},{"$f":"INDEX(Turnos_Turno,TURNOS_2021_03[[#This Row],[FILA]],1)","v":""},{"$f":"INDEX(Turnos_Turno,TURNOS_2021_03[[#This Row],[FILA]],1)","v":""},{"$f":"INDEX(Turnos_Turno,TURNOS_2021_03[[#This Row],[FILA]],1)","v":""},{"$f":"INDEX(Turnos_Turno,TURNOS_2021_03[[#This Row],[FILA]],1)","v":""},{"$f":"INDEX(Turnos_Turno,TURNOS_2021_03[[#This Row],[FILA]],1)","v":""},{"$f":"INDEX(Turnos_Turno,TURNOS_2021_03[[#This Row],[FILA]],1)","v":""},{"$f":"INDEX(Turnos_Turno,TURNOS_2021_03[[#This Row],[FILA]],1)","v":""},{"$f":"INDEX(Turnos_Turno,TURNOS_2021_03[[#This Row],[FILA]],1)","v":""},{"$f":"INDEX(Turnos_Turno,TURNOS_2021_03[[#This Row],[FILA]],1)","v":""},{"$f":"INDEX(Turnos_Turno,TURNOS_2021_03[[#This Row],[FILA]],1)","v":""},{"$f":"INDEX(Turnos_Turno,TURNOS_2021_03[[#This Row],[FILA]],1)","v":""}]
[null,{"$f":"MATCH(TURNOS_2021_03[[#This Row],[PERSONAL]],Turnos_Personal,0)","v":15},{"$f":"INDEX(Capacidades_Nombre,MATCH(TURNOS_2021_03[[#This Row],[PERSONAL]],Capacidades_Personal,0),1) & \"\"","v":"N15"},"F15",{"$f":"INDEX(Turnos_Turno,TURNOS_2021_03[[#This Row],[FILA]],1)","v":""},{"$f":"INDEX(Turnos_Turno,TURNOS_2021_03[[#This Row],[FILA]],1)","v":""},{"$f":"INDEX(Turnos_Turno,TURNOS_2021_03[[#This Row],[FILA]],1)","v":""},{"$f":"INDEX(Turnos_Turno,TURNOS_2021_03[[#This Row],[FILA]],1)","v":""},{"$f":"INDEX(Turnos_Turno,TURNOS_2021_03[[#This Row],[FILA]],1)","v":""},{"$f":"INDEX(Turnos_Turno,TURNOS_2021_03[[#This Row],[FILA]],1)","v":""},{"$f":"INDEX(Turnos_Turno,TURNOS_2021_03[[#This Row],[FILA]],1)","v":""},{"$f":"INDEX(Turnos_Turno,TURNOS_2021_03[[#This Row],[FILA]],1)","v":""},{"$f":"INDEX(Turnos_Turno,TURNOS_2021_03[[#This Row],[FILA]],1)","v":""},{"$f":"INDEX(Turnos_Turno,TURNOS_2021_03[[#This Row],[FILA]],1)","v":""},{"$f":"INDEX(Turnos_Turno,TURNOS_2021_03[[#This Row],[FILA]],1)","v":""},{"$f":"INDEX(Turnos_Turno,TURNOS_2021_03[[#This Row],[FILA]],1)","v":""},{"$f":"INDEX(Turnos_Turno,TURNOS_2021_03[[#This Row],[FILA]],1)","v":""},{"$f":"INDEX(Turnos_Turno,TURNOS_2021_03[[#This Row],[FILA]],1)","v":""},{"$f":"INDEX(Turnos_Turno,TURNOS_2021_03[[#This Row],[FILA]],1)","v":""},{"$f":"INDEX(Turnos_Turno,TURNOS_2021_03[[#This Row],[FILA]],1)","v":""},{"$f":"INDEX(Turnos_Turno,TURNOS_2021_03[[#This Row],[FILA]],1)","v":""},{"$f":"INDEX(Turnos_Turno,TURNOS_2021_03[[#This Row],[FILA]],1)","v":""},{"$f":"INDEX(Turnos_Turno,TURNOS_2021_03[[#This Row],[FILA]],1)","v":""},{"$f":"INDEX(Turnos_Turno,TURNOS_2021_03[[#This Row],[FILA]],1)","v":""},{"$f":"INDEX(Turnos_Turno,TURNOS_2021_03[[#This Row],[FILA]],1)","v":""},{"$f":"INDEX(Turnos_Turno,TURNOS_2021_03[[#This Row],[FILA]],1)","v":""},{"$f":"INDEX(Turnos_Turno,TURNOS_2021_03[[#This Row],[FILA]],1)","v":""},{"$f":"INDEX(Turnos_Turno,TURNOS_2021_03[[#This Row],[FILA]],1)","v":""},{"$f":"INDEX(Turnos_Turno,TURNOS_2021_03[[#This Row],[FILA]],1)","v":""},{"$f":"INDEX(Turnos_Turno,TURNOS_2021_03[[#This Row],[FILA]],1)","v":""},{"$f":"INDEX(Turnos_Turno,TURNOS_2021_03[[#This Row],[FILA]],1)","v":""},{"$f":"INDEX(Turnos_Turno,TURNOS_2021_03[[#This Row],[FILA]],1)","v":""},{"$f":"INDEX(Turnos_Turno,TURNOS_2021_03[[#This Row],[FILA]],1)","v":""},{"$f":"INDEX(Turnos_Turno,TURNOS_2021_03[[#This Row],[FILA]],1)","v":""},{"$f":"INDEX(Turnos_Turno,TURNOS_2021_03[[#This Row],[FILA]],1)","v":""}]
[null,{"$f":"MATCH(TURNOS_2021_03[[#This Row],[PERSONAL]],Turnos_Personal,0)","v":16},{"$f":"INDEX(Capacidades_Nombre,MATCH(TURNOS_2021_03[[#This Row],[PERSONAL]],Capacidades_Personal,0),1) & \"\"","v":"N16"},"F16",{"$f":"INDEX(Turnos_Turno,TURNOS_2021_03[[#This Row],[FILA]],1)","v":""},{"$f":"INDEX(Turnos_Turno,TURNOS_2021_03[[#This Row],[FILA]],1)","v":""},{"$f":"INDEX(Turnos_Turno,TURNOS_2021_03[[#This Row],[FILA]],1)","v":""},{"$f":"INDEX(Turnos_Turno,TURNOS_2021_03[[#This Row],[FILA]],1)","v":""},{"$f":"INDEX(Turnos_Turno,TURNOS_2021_03[[#This Row],[FILA]],1)","v":""},{"$f":"INDEX(Turnos_Turno,TURNOS_2021_03[[#This Row],[FILA]],1)","v":""},{"$f":"INDEX(Turnos_Turno,TURNOS_2021_03[[#This Row],[FILA]],1)","v":""},{"$f":"INDEX(Turnos_Turno,TURNOS_2021_03[[#This Row],[FILA]],1)","v":""},{"$f":"INDEX(Turnos_Turno,TURNOS_2021_03[[#This Row],[FILA]],1)","v":""},{"$f":"INDEX(Turnos_Turno,TURNOS_2021_03[[#This Row],[FILA]],1)","v":""},{"$f":"INDEX(Turnos_Turno,TURNOS_2021_03[[#This Row],[FILA]],1)","v":""},{"$f":"INDEX(Turnos_Turno,TURNOS_2021_03[[#This Row],[FILA]],1)","v":""},{"$f":"INDEX(Turnos_Turno,TURNOS_2021_03[[#This Row],[FILA]],1)","v":""},{"$f":"INDEX(Turnos_Turno,TURNOS_2021_03[[#This Row],[FILA]],1)","v":""},{"$f":"INDEX(Turnos_Turno,TURNOS_2021_03[[#This Row],[FILA]],1)","v":""},{"$f":"INDEX(Turnos_Turno,TURNOS_2021_03[[#This Row],[FILA]],1)","v":""},{"$f":"INDEX(Turnos_Turno,TURNOS_2021_03[[#This Row],[FILA]],1)","v":""},{"$f":"INDEX(Turnos_Turno,TURNOS_2021_03[[#This Row],[FILA]],1)","v":""},{"$f":"INDEX(Turnos_Turno,TURNOS_2021_03[[#This Row],[FILA]],1)","v":""},{"$f":"INDEX(Turnos_Turno,TURNOS_2021_03[[#This Row],[FILA]],1)","v":""},{"$f":"INDEX(Turnos_Turno,TURNOS_2021_03[[#This Row],[FILA]],1)","v":""},{"$f":"INDEX(Turnos_Turno,TURNOS_2021_03[[#This Row],[FILA]],1)","v":""},{"$f":"INDEX(Turnos_Turno,TURNOS_2021_03[[#This Row],[FILA]],1)","v":""},{"$f":"INDEX(Turnos_Turno,TURNOS_2021_03[[#This Row],[FILA]],1)","v":""},{"$f":"INDEX(Turnos_Turno,TURNOS_2021_03[[#This Row],[FILA]],1)","v":""},{"$f":"INDEX(Turnos_Turno,TURNOS_2021_03[[#This Row],[FILA]],1)","v":""},{"$f":"INDEX(Turnos_Turno,TURNOS_2021_03[[#This Row],[FILA]],1)","v":""},{"$f":"INDEX(Turnos_Turno,TURNOS_2021_03[[#This Row],[FILA]],1)","v":""},{"$f":"INDEX(Turnos_Turno,TURNOS_2021_03[[#This Row],[FILA]],1)","v":""},{"$f":"INDEX(Turnos_Turno,TURNOS_2021_03[[#This Row],[FILA]],1)","v":""},{"$f":"INDEX(Turnos_Turno,TURNOS_2021_03[[#This Row],[FILA]],1)","v":""}]
[null,{"$f":"MATCH(TURNOS_2021_03[[#This Row],[PERSONAL]],Turnos_Personal,0)","v":17},{"$f":"INDEX(Capacidades_Nombre,MATCH(TURNOS_2021_03[[#This Row],[PERSONAL]],Capacidades_Personal,0),1) & \"\"","v":"N17"},"F17",{"$f":"INDEX(Turnos_Turno,TURNOS_2021_03[[#This Row],[FILA]],1)","v":""},{"$f":"INDEX(Turnos_Turno,TURNOS_2021_03[[#This Row],[FILA]],1)","v":""},{"$f":"INDEX(Turnos_Turno,TURNOS_2021_03[[#This Row],[FILA]],1)","v":""},{"$f":"INDEX(Turnos_Turno,TURNOS_2021_03[[#This Row],[FILA]],1)","v":""},{"$f":"INDEX(Turnos_Turno,TURNOS_2021_03[[#This Row],[FILA]],1)","v":""},{"$f":"INDEX(Turnos_Turno,TURNOS_2021_03[[#This Row],[FILA]],1)","v":""},{"$f":"INDEX(Turnos_Turno,TURNOS_2021_03[[#This Row],[FILA]],1)","v":""},{"$f":"INDEX(Turnos_Turno,TURNOS_2021_03[[#This Row],[FILA]],1)","v":""},{"$f":"INDEX(Turnos_Turno,TURNOS_2021_03[[#This Row],[FILA]],1)","v":""},{"$f":"INDEX(Turnos_Turno,TURNOS_2021_03[[#This Row],[FILA]],1)","v":""},{"$f":"INDEX(Turnos_Turno,TURNOS_2021_03[[#This Row],[FILA]],1)","v":""},{"$f":"INDEX(Turnos_Turno,TURNOS_2021_03[[#This Row],[FILA]],1)","v":""},{"$f":"INDEX(Turnos_Turno,TURNOS_2021_03[[#This Row],[FILA]],1)","v":""},{"$f":"INDEX(Turnos_Turno,TURNOS_2021_03[[#This Row],[FILA]],1)","v":""},{"$f":"INDEX(Turnos_Turno,TURNOS_2021_03[[#This Row],[FILA]],1)","v":""},{"$f":"INDEX(Turnos_Turno,TURNOS_2021_03[[#This Row],[FILA]],1)","v":""},{"$f":"INDEX(Turnos_Turno,TURNOS_2021_03[[#This Row],[FILA]],1)","v":""},{"$f":"INDEX(Turnos_Turno,TURNOS_2021_03[[#This Row],[FILA]],1)","v":""},{"$f":"INDEX(Turnos_Turno,TURNOS_2021_03[[#This Row],[FILA]],1)","v":""},{"$f":"INDEX(Turnos_Turno,TURNOS_2021_03[[#This Row],[FILA]],1)","v":""},{"$f":"INDEX(Turnos_Turno,TURNOS_2021_03[[#This Row],[FILA]],1)","v":""},{"$f":"INDEX(Turnos_Turno,TURNOS_2021_03[[#This Row],[FILA]],1)","v":""},{"$f":"INDEX(Turnos_Turno,TURNOS_2021_03[[#This Row],[FILA]],1)","v":""},{"$f":"INDEX(Turnos_Turno,TURNOS_2021_03[[#This Row],[FILA]],1)","v":""},{"$f":"INDEX(Turnos_Turno,TURNOS_2021_03[[#This Row],[FILA]],1)","v":""},{"$f":"INDEX(Turnos_Turno,TURNOS_2021_03[[#This Row],[FILA]],1)","v":""},{"$f":"INDEX(Turnos_Turno,TURNOS_2021_03[[#This Row],[FILA]],1)","v":""},{"$f":"INDEX(Turnos_Turno,TURNOS_2021_03[[#This Row],[FILA]],1)","v":""},{"$f":"INDEX(Turnos_Turno,TURNOS_2021_03[[#This Row],[FILA]],1)","v":""},{"$f":"INDEX(Turnos_Turno,TURNOS_2021_03[[#This Row],[FILA]],1)","v":""},{"$f":"INDEX(Turnos_Turno,TURNOS_2021_03[[#This Row],[FILA]],1)","v":""}]
[null,{"$f":"MATCH(TURNOS_2021_03[[#This Row],[PERSONAL]],Turnos_Personal,0)","v":18},{"$f":"INDEX(Capacidades_Nombre,MATCH(TURNOS_2021_03[[#This Row],[PERSONAL]],Capacidades_Personal,0),1) & \"\"","v":"N18"},"F18",{"$f":"INDEX(Turnos_Turno,TURNOS_2021_03[[#This Row],[FILA]],1)","v":""},{"$f":"INDEX(Turnos_Turno,TURNOS_2021_03[[#This Row],[FILA]],1)","v":""},{"$f":"INDEX(Turnos_Turno,TURNOS_2021_03[[#This Row],[FILA]],1)","v":""},{"$f":"INDEX(Turnos_Turno,TURNOS_2021_03[[#This Row],[FILA]],1)","v":""},{"$f":"INDEX(Turnos_Turno,TURNOS_2021_03[[#This Row],[FILA]],1)","v":""},{"$f":"INDEX(Turnos_Turno,TURNOS_2021_03[[#This Row],[FILA]],1)","v":""},{"$f":"INDEX(Turnos_Turno,TURNOS_2021_03[[#This Row],[FILA]],1)","v":""},{"$f":"INDEX(Turnos_Turno,TURNOS_2021_03[[#This Row],[FILA]],1)","v":""},{"$f":"INDEX(Turnos_Turno,TURNOS_2021_03[[#This Row],[FILA]],1)","v":""},{"$f":"INDEX(Turnos_Turno,TURNOS_2021_03[[#This Row],[FILA]],1)","v":""},{"$f":"INDEX(Turnos_Turno,TURNOS_2021_03[[#This Row],[FILA]],1)","v":""},{"$f":"INDEX(Turnos_Turno,TURNOS_2021_03[[#This Row],[FILA]],1)","v":""},{"$f":"INDEX(Turnos_Turno,TURNOS_2021_03[[#This Row],[FILA]],1)","v":""},{"$f":"INDEX(Turnos_Turno,TURNOS_2021_03[[#This Row],[FILA]],1)","v":""},{"$f":"INDEX(Turnos_Turno,TURNOS_2021_03[[#This Row],[FILA]],1)","v":""},{"$f":"INDEX(Turnos_Turno,TURNOS_2021_03[[#This Row],[FILA]],1)","v":""},{"$f":"INDEX(Turnos_Turno,TURNOS_2021_03[[#This Row],[FILA]],1)","v":""},{"$f":"INDEX(Turnos_Turno,TURNOS_2021_03[[#This Row],[FILA]],1)","v":""},{"$f":"INDEX(Turnos_Turno,TURNOS_2021_03[[#This Row],[FILA]],1)","v":""},{"$f":"INDEX(Turnos_Turno,TURNOS_2021_03[[#This Row],[FILA]],1)","v":""},{"$f":"INDEX(Turnos_Turno,TURNOS_2021_03[[#This Row],[FILA]],1)","v":""},{"$f":"INDEX(Turnos_Turno,TURNOS_2021_03[[#This Row],[FILA]],1)","v":""},{"$f":"INDEX(Turnos_Turno,TURNOS_2021_03[[#This Row],[FILA]],1)","v":""},{"$f":"INDEX(Turnos_Turno,TURNOS_2021_03[[#This Row],[FILA]],1)","v":""},{"$f":"INDEX(Turnos_Turno,TURNOS_2021_03[[#This Row],[FILA]],1)","v":""},{"$f":"INDEX(Turnos_Turno,TURNOS_2021_03[[#This Row],[FILA]],1)","v":""},{"$f":"INDEX(Turnos_Turno,TURNOS_2021_03[[#This Row],[FILA]],1)","v":""},{"$f":"INDEX(Turnos_Turno,TURNOS_2021_03[[#This Row],[FILA]],1)","v":""},{"$f":"INDEX(Turnos_Turno,TURNOS_2021_03[[#This Row],[FILA]],1)","v":""},{"$f":"INDEX(Turnos_Turno,TURNOS_2021_03[[#This Row],[FILA]],1)","v":""},{"$f":"INDEX(Turnos_Turno,TURNOS_2021_03[[#This Row],[FILA]],1)","v":""}]
[null,{"$f":"MATCH(TURNOS_2021_03[[#This Row],[PERSONAL]],Turnos_Personal,0)","v":19},{"$f":"INDEX(Capacidades_Nombre,MATCH(TURNOS_2021_03[[#This Row],[PERSONAL]],Capacidades_Personal,0),1) & \"\"","v":"N19"},"F19",{"$f":"INDEX(Turnos_Turno,TURNOS_2021_03[[#This Row],[FILA]],1)","v":""},{"$f":"INDEX(Turnos_Turno,TURNOS_2021_03[[#This Row],[FILA]],1)","v":""},{"$f":"INDEX(Turnos_Turno,TURNOS_2021_03[[#This Row],[FILA]],1)","v":""},{"$f":"INDEX(Turnos_Turno,TURNOS_2021_03[[#This Row],[FILA]],1)","v":""},{"$f":"INDEX(Turnos_Turno,TURNOS_2021_03[[#This Row],[FILA]],1)","v":""},{"$f":"INDEX(Turnos_Turno,TURNOS_2021_03[[#This Row],[FILA]],1)","v":""},{"$f":"INDEX(Turnos_Turno,TURNOS_2021_03[[#This Row],[FILA]],1)","v":""},{"$f":"INDEX(Turnos_Turno,TURNOS_2021_03[[#This Row],[FILA]],1)","v":""},{"$f":"INDEX(Turnos_Turno,TURNOS_2021_03[[#This Row],[FILA]],1)","v":""},{"$f":"INDEX(Turnos_Turno,TURNOS_2021_03[[#This Row],[FILA]],1)","v":""},{"$f":"INDEX(Turnos_Turno,TURNOS_2021_03[[#This Row],[FILA]],1)","v":""},{"$f":"INDEX(Turnos_Turno,TURNOS_2021_03[[#This Row],[FILA]],1)","v":""},{"$f":"INDEX(Turnos_Turno,TURNOS_2021_03[[#This Row],[FILA]],1)","v":""},{"$f":"INDEX(Turnos_Turno,TURNOS_2021_03[[#This Row],[FILA]],1)","v":""},{"$f":"INDEX(Turnos_Turno,TURNOS_2021_03[[#This Row],[FILA]],1)","v":""},{"$f":"INDEX(Turnos_Turno,TURNOS_2021_03[[#This Row],[FILA]],1)","v":""},{"$f":"INDEX(Turnos_Turno,TURNOS_2021_03[[#This Row],[FILA]],1)","v":""},{"$f":"INDEX(Turnos_Turno,TURNOS_2021_03[[#This Row],[FILA]],1)","v":""},{"$f":"INDEX(Turnos_Turno,TURNOS_2021_03[[#This Row],[FILA]],1)","v":""},{"$f":"INDEX(Turnos_Turno,TURNOS_2021_03[[#This Row],[FILA]],1)","v":""},{"$f":"INDEX(Turnos_Turno,TURNOS_2021_03[[#This Row],[FILA]],1)","v":""},{"$f":"INDEX(Turnos_Turno,TURNOS_2021_03[[#This Row],[FILA]],1)","v":""},{"$f":"INDEX(Turnos_Turno,TURNOS_2021_03[[#This Row],[FILA]],1)","v":""},{"$f":"INDEX(Turnos_Turno,TURNOS_2021_03[[#This Row],[FILA]],1)","v":""},{"$f":"INDEX(Turnos_Turno,TURNOS_2021_03[[#This Row],[FILA]],1)","v":""},{"$f":"INDEX(Turnos_Turno,TURNOS_2021_03[[#This Row],[FILA]],1)","v":""},{"$f":"INDEX(Turnos_Turno,TURNOS_2021_03[[#This Row],[FILA]],1)","v":""},{"$f":"INDEX(Turnos_Turno,TURNOS_2021_03[[#This Row],[FILA]],1)","v":""},{"$f":"INDEX(Turnos_Turno,TURNOS_2021_03[[#This Row],[FILA]],1)","v":""},{"$f":"INDEX(Turnos_Turno,TURNOS_2021_03[[#This Row],[FILA]],1)","v":""},{"$f":"INDEX(Turnos_Turno,TURNOS_2021_03[[#This Row],[FILA]],1)","v":""}]
[null,{"$f":"MATCH(TURNOS_2021_03[[#This Row],[PERSONAL]],Turnos_Personal,0)","v":20},{"$f":"INDEX(Capacidades_Nombre,MATCH(TURNOS_2021_03[[#This Row],[PERSONAL]],Capacidades_Personal,0),1) & \"\"","v":"N20"},"F20",{"$f":"INDEX(Turnos_Turno,TURNOS_2021_03[[#This Row],[FILA]],1)","v":""},{"$f":"INDEX(Turnos_Turno,TURNOS_2021_03[[#This Row],[FILA]],1)","v":""},{"$f":"INDEX(Turnos_Turno,TURNOS_2021_03[[#This Row],[FILA]],1)","v":""},{"$f":"INDEX(Turnos_Turno,TURNOS_2021_03[[#This Row],[FILA]],1)","v":""},{"$f":"INDEX(Turnos_Turno,TURNOS_2021_03[[#This Row],[FILA]],1)","v":""},{"$f":"INDEX(Turnos_Turno,TURNOS_2021_03[[#This Row],[FILA]],1)","v":""},{"$f":"INDEX(Turnos_Turno,TURNOS_2021_03[[#This Row],[FILA]],1)","v":""},{"$f":"INDEX(Turnos_Turno,TURNOS_2021_03[[#This Row],[FILA]],1)","v":""},{"$f":"INDEX(Turnos_Turno,TURNOS_2021_03[[#This Row],[FILA]],1)","v":""},{"$f":"INDEX(Turnos_Turno,TURNOS_2021_03[[#This Row],[FILA]],1)","v":""},{"$f":"INDEX(Turnos_Turno,TURNOS_2021_03[[#This Row],[FILA]],1)","v":""},{"$f":"INDEX(Turnos_Turno,TURNOS_2021_03[[#This Row],[FILA]],1)","v":""},{"$f":"INDEX(Turnos_Turno,TURNOS_2021_03[[#This Row],[FILA]],1)","v":""},{"$f":"INDEX(Turnos_Turno,TURNOS_2021_03[[#This Row],[FILA]],1)","v":""},{"$f":"INDEX(Turnos_Turno,TURNOS_2021_03[[#This Row],[FILA]],1)","v":""},{"$f":"INDEX(Turnos_Turno,TURNOS_2021_03[[#This Row],[FILA]],1)","v":""},{"$f":"INDEX(Turnos_Turno,TURNOS_2021_03[[#This Row],[FILA]],1)","v":""},{"$f":"INDEX(Turnos_Turno,TURNOS_2021_03[[#This Row],[FILA]],1)","v":""},{"$f":"INDEX(Turnos_Turno,TURNOS_2021_03[[#This Row],[FILA]],1)","v":""},{"$f":"INDEX(Turnos_Turno,TURNOS_2021_03[[#This Row],[FILA]],1)","v":""},{"$f":"INDEX(Turnos_Turno,TURNOS_2021_03[[#This Row],[FILA]],1)","v":""},{"$f":"INDEX(Turnos_Turno,TURNOS_2021_03[[#This Row],[FILA]],1)","v":""},{"$f":"INDEX(Turnos_Turno,TURNOS_2021_03[[#This Row],[FILA]],1)","v":""},{"$f":"INDEX(Turnos_Turno,TURNOS_2021_03[[#This Row],[FILA]],1)","v":""},{"$f":"INDEX(Turnos_Turno,TURNOS_2021_03[[#This Row],[FILA]],1)","v":""},{"$f":"INDEX(Turnos_Turno,TURNOS_2021_03[[#This Row],[FILA]],1)","v":""},{"$f":"INDEX(Turnos_Turno,TURNOS_2021_03[[#This Row],[FILA]],1)","v":""},{"$f":"INDEX(Turnos_Turno,TURNOS_2021_03[[#This Row],[FILA]],1)","v":""},{"$f":"INDEX(Turnos_Turno,TURNOS_2021_03[[#This Row],[FILA]],1)","v":""},{"$f":"INDEX(Turnos_Turno,TURNOS_2021_03[[#This Row],[FILA]],1)","v":""},{"$f":"INDEX(Turnos_Turno,TURNOS_2021_03[[#This Row],[FILA]],1)","v":""}]
[null,{"$f":"MATCH(TURNOS_2021_03[[#This Row],[PERSONAL]],Turnos_Personal,0)","v":21},{"$f":"INDEX(Capacidades_Nombre,MATCH(TURNOS_2021_03[[#This Row],[PERSONAL]],Capacidades_Personal,0),1) & \"\"","v":"N21"},"F21",{"$f":"INDEX(Turnos_Turno,TURNOS_2021_03[[#This Row],[FILA]],1)","v":""},{"$f":"INDEX(Turnos_Turno,TURNOS_2021_03[[#This Row],[FILA]],1)","v":""},{"$f":"INDEX(Turnos_Turno,TURNOS_2021_03[[#This Row],[FILA]],1)","v":""},{"$f":"INDEX(Turnos_Turno,TURNOS_2021_03[[#This Row],[FILA]],1)","v":""},{"$f":"INDEX(Turnos_Turno,TURNOS_2021_03[[#This Row],[FILA]],1)","v":""},{"$f":"INDEX(Turnos_Turno,TURNOS_2021_03[[#This Row],[FILA]],1)","v":""},{"$f":"INDEX(Turnos_Turno,TURNOS_2021_03[[#This Row],[FILA]],1)","v":""},{"$f":"INDEX(Turnos_Turno,TURNOS_2021_03[[#This Row],[FILA]],1)","v":""},{"$f":"INDEX(Turnos_Turno,TURNOS_2021_03[[#This Row],[FILA]],1)","v":""},{"$f":"INDEX(Turnos_Turno,TURNOS_2021_03[[#This Row],[FILA]],1)","v":""},{"$f":"INDEX(Turnos_Turno,TURNOS_2021_03[[#This Row],[FILA]],1)","v":""},{"$f":"INDEX(Turnos_Turno,TURNOS_2021_03[[#This Row],[FILA]],1)","v":""},{"$f":"INDEX(Turnos_Turno,TURNOS_2021_03[[#This Row],[FILA]],1)","v":""},{"$f":"INDEX(Turnos_Turno,TURNOS_2021_03[[#This Row],[FILA]],1)","v":""},{"$f":"INDEX(Turnos_Turno,TURNOS_2021_03[[#This Row],[FILA]],1)","v":""},{"$f":"INDEX(Turnos_Turno,TURNOS_2021_03[[#This Row],[FILA]],1)","v":""},{"$f":"INDEX(Turnos_Turno,TURNOS_2021_03[[#This Row],[FILA]],1)","v":""},{"$f":"INDEX(Turnos_Turno,TURNOS_2021_03[[#This Row],[FILA]],1)","v":""},{"$f":"INDEX(Turnos_Turno,TURNOS_2021_03[[#This Row],[FILA]],1)","v":""},{"$f":"INDEX(Turnos_Turno,TURNOS_2021_03[[#This Row],[FILA]],1)","v":""},{"$f":"INDEX(Turnos_Turno,TURNOS_2021_03[[#This Row],[FILA]],1)","v":""},{"$f":"INDEX(Turnos_Turno,TURNOS_2021_03[[#This Row],[FILA]],1)","v":""},{"$f":"INDEX(Turnos_Turno,TURNOS_2021_03[[#This Row],[FILA]],1)","v":""},{"$f":"INDEX(Turnos_Turno,TURNOS_2021_03[[#This Row],[FILA]],1)","v":""},{"$f":"INDEX(Turnos_Turno,TURNOS_2021_03[[#This Row],[FILA]],1)","v":""},{"$f":"INDEX(Turnos_Turno,TURNOS_2021_03[[#This Row],[FILA]],1)","v":""},{"$f":"INDEX(Turnos_Turno,TURNOS_2021_03[[#This Row],[FILA]],1)","v":""},{"$f":"INDEX(Turnos_Turno,TURNOS_2021_03[[#This Row],[FILA]],1)","v":""},{"$f":"INDEX(Turnos_Turno,TURNOS_2021_03[[#This Row],[FILA]],1)","v":""},{"$f":"INDEX(Turnos_Turno,TURNOS_2021_03[[#This Row],[FILA]],1)","v":""},{"$f":"INDEX(Turnos_Turno,TURNOS_2021_03[[#This Row],[FILA]],1)","v":""}]
[null,{"$f":"MATCH(TURNOS_2021_03[[#This Row],[PERSONAL]],Turnos_Personal,0)","v":22},{"$f":"INDEX(Capacidades_Nombre,MATCH(TURNOS_2021_03[[#This Row],[PERSONAL]],Capacidades_Personal,0),1) & \"\"","v":"N22"},"F22",{"$f":"INDEX(Turnos_Turno,TURNOS_2021_03[[#This Row],[FILA]],1)","v":""},{"$f":"INDEX(Turnos_Turno,TURNOS_2021_03[[#This Row],[FILA]],1)","v":""},{"$f":"INDEX(Turnos_Turno,TURNOS_2021_03[[#This Row],[FILA]],1)","v":""},{"$f":"INDEX(Turnos_Turno,TURNOS_2021_03[[#This Row],[FILA]],1)","v":""},{"$f":"INDEX(Turnos_Turno,TURNOS_2021_03[[#This Row],[FILA]],1)","v":""},{"$f":"INDEX(Turnos_Turno,TURNOS_2021_03[[#This Row],[FILA]],1)","v":""},{"$f":"INDEX(Turnos_Turno,TURNOS_2021_03[[#This Row],[FILA]],1)","v":""},{"$f":"INDEX(Turnos_Turno,TURNOS_2021_03[[#This Row],[FILA]],1)","v":""},{"$f":"INDEX(Turnos_Turno,TURNOS_2021_03[[#This Row],[FILA]],1)","v":""},{"$f":"INDEX(Turnos_Turno,TURNOS_2021_03[[#This Row],[FILA]],1)","v":""},{"$f":"INDEX(Turnos_Turno,TURNOS_2021_03[[#This Row],[FILA]],1)","v":""},{"$f":"INDEX(Turnos_Turno,TURNOS_2021_03[[#This Row],[FILA]],1)","v":""},{"$f":"INDEX(Turnos_Turno,TURNOS_2021_03[[#This Row],[FILA]],1)","v":""},{"$f":"INDEX(Turnos_Turno,TURNOS_2021_03[[#This Row],[FILA]],1)","v":""},{"$f":"INDEX(Turnos_Turno,TURNOS_2021_03[[#This Row],[FILA]],1)","v":""},{"$f":"INDEX(Turnos_Turno,TURNOS_2021_03[[#This Row],[FILA]],1)","v":""},{"$f":"INDEX(Turnos_Turno,TURNOS_2021_03[[#This Row],[FILA]],1)","v":""},{"$f":"INDEX(Turnos_Turno,TURNOS_2021_03[[#This Row],[FILA]],1)","v":""},{"$f":"INDEX(Turnos_Turno,TURNOS_2021_03[[#This Row],[FILA]],1)","v":""},{"$f":"INDEX(Turnos_Turno,TURNOS_2021_03[[#This Row],[FILA]],1)","v":""},{"$f":"INDEX(Turnos_Turno,TURNOS_2021_03[[#This Row],[FILA]],1)","v":""},{"$f":"INDEX(Turnos_Turno,TURNOS_2021_03[[#This Row],[FILA]],1)","v":""},{"$f":"INDEX(Turnos_Turno,TURNOS_2021_03[[#This Row],[FILA]],1)","v":""},{"$f":"INDEX(Turnos_Turno,TURNOS_2021_03[[#This Row],[FILA]],1)","v":""},{"$f":"INDEX(Turnos_Turno,TURNOS_2021_03[[#This Row],[FILA]],1)","v":""},{"$f":"INDEX(Turnos_Turno,TURNOS_2021_03[[#This Row],[FILA]],1)","v":""},{"$f":"INDEX(Turnos_Turno,TURNOS_2021_03[[#This Row],[FILA]],1)","v":""},{"$f":"INDEX(Turnos_Turno,TURNOS_2021_03[[#This Row],[FILA]],1)","v":""},{"$f":"INDEX(Turnos_Turno,TURNOS_2021_03[[#This Row],[FILA]],1)","v":""},{"$f":"INDEX(Turnos_Turno,TURNOS_2021_03[[#This Row],[FILA]],1)","v":""},{"$f":"INDEX(Turnos_Turno,TURNOS_2021_03[[#This Row],[FILA]],1)","v":""}]
[null,{"$f":"MATCH(TURNOS_2021_03[[#This Row],[PERSONAL]],Turnos_Personal,0)","v":23},{"$f":"INDEX(Capacidades_Nombre,MATCH(TURNOS_2021_03[[#This Row],[PERSONAL]],Capacidades_Personal,0),1) & \"\"","v":"N23"},"F23",{"$f":"INDEX(Turnos_Turno,TURNOS_2021_03[[#This Row],[FILA]],1)","v":""},{"$f":"INDEX(Turnos_Turno,TURNOS_2021_03[[#This Row],[FILA]],1)","v":""},{"$f":"INDEX(Turnos_Turno,TURNOS_2021_03[[#This Row],[FILA]],1)","v":""},{"$f":"INDEX(Turnos_Turno,TURNOS_2021_03[[#This Row],[FILA]],1)","v":""},{"$f":"INDEX(Turnos_Turno,TURNOS_2021_03[[#This Row],[FILA]],1)","v":""},{"$f":"INDEX(Turnos_Turno,TURNOS_2021_03[[#This Row],[FILA]],1)","v":""},{"$f":"INDEX(Turnos_Turno,TURNOS_2021_03[[#This Row],[FILA]],1)","v":""},{"$f":"INDEX(Turnos_Turno,TURNOS_2021_03[[#This Row],[FILA]],1)","v":""},{"$f":"INDEX(Turnos_Turno,TURNOS_2021_03[[#This Row],[FILA]],1)","v":""},{"$f":"INDEX(Turnos_Turno,TURNOS_2021_03[[#This Row],[FILA]],1)","v":""},{"$f":"INDEX(Turnos_Turno,TURNOS_2021_03[[#This Row],[FILA]],1)","v":""},{"$f":"INDEX(Turnos_Turno,TURNOS_2021_03[[#This Row],[FILA]],1)","v":""},{"$f":"INDEX(Turnos_Turno,TURNOS_2021_03[[#This Row],[FILA]],1)","v":""},{"$f":"INDEX(Turnos_Turno,TURNOS_2021_03[[#This Row],[FILA]],1)","v":""},{"$f":"INDEX(Turnos_Turno,TURNOS_2021_03[[#This Row],[FILA]],1)","v":""},{"$f":"INDEX(Turnos_Turno,TURNOS_2021_03[[#This Row],[FILA]],1)","v":""},{"$f":"INDEX(Turnos_Turno,TURNOS_2021_03[[#This Row],[FILA]],1)","v":""},{"$f":"INDEX(Turnos_Turno,TURNOS_2021_03[[#This Row],[FILA]],1)","v":""},{"$f":"INDEX(Turnos_Turno,TURNOS_2021_03[[#This Row],[FILA]],1)","v":""},{"$f":"INDEX(Turnos_Turno,TURNOS_2021_03[[#This Row],[FILA]],1)","v":""},{"$f":"INDEX(Turnos_Turno,TURNOS_2021_03[[#This Row],[FILA]],1)","v":""},{"$f":"INDEX(Turnos_Turno,TURNOS_2021_03[[#This Row],[FILA]],1)","v":""},{"$f":"INDEX(Turnos_Turno,TURNOS_2021_03[[#This Row],[FILA]],1)","v":""},{"$f":"INDEX(Turnos_Turno,TURNOS_2021_03[[#This Row],[FILA]],1)","v":""},{"$f":"INDEX(Turnos_Turno,TURNOS_2021_03[[#This Row],[FILA]],1)","v":""},{"$f":"INDEX(Turnos_Turno,TURNOS_2021_03[[#This Row],[FILA]],1)","v":""},{"$f":"INDEX(Turnos_Turno,TURNOS_2021_03[[#This Row],[FILA]],1)","v":""},{"$f":"INDEX(Turnos_Turno,TURNOS_2021_03[[#This Row],[FILA]],1)","v":""},{"$f":"INDEX(Turnos_Turno,TURNOS_2021_03[[#This Row],[FILA]],1)","v":""},{"$f":"INDEX(Turnos_Turno,TURNOS_2021_03[[#This Row],[FILA]],1)","v":""},{"$f":"INDEX(Turnos_Turno,TURNOS_2021_03[[#This Row],[FILA]],1)","v":""}]
[null,{"$f":"MATCH(TURNOS_2021_03[[#This Row],[PERSONAL]],Turnos_Personal,0)","v":24},{"$f":"INDEX(Capacidades_Nombre,MATCH(TURNOS_2021_03[[#This Row],[PERSONAL]],Capacidades_Personal,0),1) & \"\"","v":"N24"},"F24",{"$f":"INDEX(Turnos_Turno,TURNOS_2021_03[[#This Row],[FILA]],1)","v":"N"},{"$f":"INDEX(Turnos_Turno,TURNOS_2021_03[[#This Row],[FILA]],1)","v":"N"},{"$f":"INDEX(Turnos_Turno,TURNOS_2021_03[[#This Row],[FILA]],1)","v":"N"},{"$f":"INDEX(Turnos_Turno,TURNOS_2021_03[[#This Row],[FILA]],1)","v":"N"},{"$f":"INDEX(Turnos_Turno,TURNOS_2021_03[[#This Row],[FILA]],1)","v":"N"},{"$f":"INDEX(Turnos_Turno,TURNOS_2021_03[[#This Row],[FILA]],1)","v":"N"},{"$f":"INDEX(Turnos_Turno,TURNOS_2021_03[[#This Row],[FILA]],1)","v":"N"},{"$f":"INDEX(Turnos_Turno,TURNOS_2021_03[[#This Row],[FILA]],1)","v":"N"},{"$f":"INDEX(Turnos_Turno,TURNOS_2021_03[[#This Row],[FILA]],1)","v":"N"},{"$f":"INDEX(Turnos_Turno,TURNOS_2021_03[[#This Row],[FILA]],1)","v":"N"},{"$f":"INDEX(Turnos_Turno,TURNOS_2021_03[[#This Row],[FILA]],1)","v":"N"},{"$f":"INDEX(Turnos_Turno,TURNOS_2021_03[[#This Row],[FILA]],1)","v":"N"},{"$f":"INDEX(Turnos_Turno,TURNOS_2021_03[[#This Row],[FILA]],1)","v":"N"},{"$f":"INDEX(Turnos_Turno,TURNOS_2021_03[[#This Row],[FILA]],1)","v":"N"},{"$f":"INDEX(Turnos_Turno,TURNOS_2021_03[[#This Row],[FILA]],1)","v":"N"},{"$f":"INDEX(Turnos_Turno,TURNOS_2021_03[[#This Row],[FILA]],1)","v":"N"},{"$f":"INDEX(Turnos_Turno,TURNOS_2021_03[[#This Row],[FILA]],1)","v":"N"},{"$f":"INDEX(Turnos_Turno,TURNOS_2021_03[[#This Row],[FILA]],1)","v":"N"},{"$f":"INDEX(Turnos_Turno,TURNOS_2021_03[[#This Row],[FILA]],1)","v":"N"},{"$f":"INDEX(Turnos_Turno,TURNOS_2021_03[[#This Row],[FILA]],1)","v":"N"},{"$f":"INDEX(Turnos_Turno,TURNOS_2021_03[[#This Row],[FILA]],1)","v":"N"},{"$f":"INDEX(Turnos_Turno,TURNOS_2021_03[[#This Row],[FILA]],1)","v":"N"},{"$f":"INDEX(Turnos_Turno,TURNOS_2021_03[[#This Row],[FILA]],1)","v":"N"},{"$f":"INDEX(Turnos_Turno,TURNOS_2021_03[[#This Row],[FILA]],1)","v":"N"},{"$f":"INDEX(Turnos_Turno,TURNOS_2021_03[[#This Row],[FILA]],1)","v":"N"},{"$f":"INDEX(Turnos_Turno,TURNOS_2021_03[[#This Row],[FILA]],1)","v":"N"},{"$f":"INDEX(Turnos_Turno,TURNOS_2021_03[[#This Row],[FILA]],1)","v":"N"},{"$f":"INDEX(Turnos_Turno,TURNOS_2021_03[[#This Row],[FILA]],1)","v":"N"},{"$f":"INDEX(Turnos_Turno,TURNOS_2021_03[[#This Row],[FILA]],1)","v":"N"},{"$f":"INDEX(Turnos_Turno,TURNOS_2021_03[[#This Row],[FILA]],1)","v":"N"},{"$f":"INDEX(Turnos_Turno,TURNOS_2021_03[[#This Row],[FILA]],1)","v":"N"}]
[null,{"$f":"MATCH(TURNOS_2021_03[[#This Row],[PERSONAL]],Turnos_Personal,0)","v":25},{"$f":"INDEX(Capacidades_Nombre,MATCH(TURNOS_2021_03[[#This Row],[PERSONAL]],Capacidades_Personal,0),1) & \"\"","v":"N25"},"F25",{"$f":"INDEX(Turnos_Turno,TURNOS_2021_03[[#This Row],[FILA]],1)","v":"T"},{"$f":"INDEX(Turnos_Turno,TURNOS_2021_03[[#This Row],[FILA]],1)","v":"T"},{"$f":"INDEX(Turnos_Turno,TURNOS_2021_03[[#This Row],[FILA]],1)","v":"T"},{"$f":"INDEX(Turnos_Turno,TURNOS_2021_03[[#This Row],[FILA]],1)","v":"T"},{"$f":"INDEX(Turnos_Turno,TURNOS_2021_03[[#This Row],[FILA]],1)","v":"T"},{"$f":"INDEX(Turnos_Turno,TURNOS_2021_03[[#This Row],[FILA]],1)","v":"T"},{"$f":"INDEX(Turnos_Turno,TURNOS_2021_03[[#This Row],[FILA]],1)","v":"T"},{"$f":"INDEX(Turnos_Turno,TURNOS_2021_03[[#This Row],[FILA]],1)","v":"T"},{"$f":"INDEX(Turnos_Turno,TURNOS_2021_03[[#This Row],[FILA]],1)","v":"T"},{"$f":"INDEX(Turnos_Turno,TURNOS_2021_03[[#This Row],[FILA]],1)","v":"T"},{"$f":"INDEX(Turnos_Turno,TURNOS_2021_03[[#This Row],[FILA]],1)","v":"T"},{"$f":"INDEX(Turnos_Turno,TURNOS_2021_03[[#This Row],[FILA]],1)","v":"T"},{"$f":"INDEX(Turnos_Turno,TURNOS_2021_03[[#This Row],[FILA]],1)","v":"T"},{"$f":"INDEX(Turnos_Turno,TURNOS_2021_03[[#This Row],[FILA]],1)","v":"T"},{"$f":"INDEX(Turnos_Turno,TURNOS_2021_03[[#This Row],[FILA]],1)","v":"T"},{"$f":"INDEX(Turnos_Turno,TURNOS_2021_03[[#This Row],[FILA]],1)","v":"T"},{"$f":"INDEX(Turnos_Turno,TURNOS_2021_03[[#This Row],[FILA]],1)","v":"T"},{"$f":"INDEX(Turnos_Turno,TURNOS_2021_03[[#This Row],[FILA]],1)","v":"T"},{"$f":"INDEX(Turnos_Turno,TURNOS_2021_03[[#This Row],[FILA]],1)","v":"T"},{"$f":"INDEX(Turnos_Turno,TURNOS_2021_03[[#This Row],[FILA]],1)","v":"T"},{"$f":"INDEX(Turnos_Turno,TURNOS_2021_03[[#This Row],[FILA]],1)","v":"T"},{"$f":"INDEX(Turnos_Turno,TURNOS_2021_03[[#This Row],[FILA]],1)","v":"T"},{"$f":"INDEX(Turnos_Turno,TURNOS_2021_03[[#This Row],[FILA]],1)","v":"T"},{"$f":"INDEX(Turnos_Turno,TURNOS_2021_03[[#This Row],[FILA]],1)","v":"T"},{"$f":"INDEX(Turnos_Turno,TURNOS_2021_03[[#This Row],[FILA]],1)","v":"T"},{"$f":"INDEX(Turnos_Turno,TURNOS_2021_03[[#This Row],[FILA]],1)","v":"T"},{"$f":"INDEX(Turnos_Turno,TURNOS_2021_03[[#This Row],[FILA]],1)","v":"T"},{"$f":"INDEX(Turnos_Turno,TURNOS_2021_03[[#This Row],[FILA]],1)","v":"T"},{"$f":"INDEX(Turnos_Turno,TURNOS_2021_03[[#This Row],[FILA]],1)","v":"T"},{"$f":"INDEX(Turnos_Turno,TURNOS_2021_03[[#This Row],[FILA]],1)","v":"T"},{"$f":"INDEX(Turnos_Turno,TURNOS_2021_03[[#This Row],[FILA]],1)","v":"T"}]
[null,{"$f":"MATCH(TURNOS_2021_03[[#This Row],[PERSONAL]],Turnos_Personal,0)","v":26},{"$f":"INDEX(Capacidades_Nombre,MATCH(TURNOS_2021_03[[#This Row],[PERSONAL]],Capacidades_Personal,0),1) & \"\"","v":"N26"},"F26",{"$f":"INDEX(Turnos_Turno,TURNOS_2021_03[[#This Row],[FILA]],1)","v":"T"},{"$f":"INDEX(Turnos_Turno,TURNOS_2021_03[[#This Row],[FILA]],1)","v":"T"},{"$f":"INDEX(Turnos_Turno,TURNOS_2021_03[[#This Row],[FILA]],1)","v":"T"},{"$f":"INDEX(Turnos_Turno,TURNOS_2021_03[[#This Row],[FILA]],1)","v":"T"},{"$f":"INDEX(Turnos_Turno,TURNOS_2021_03[[#This Row],[FILA]],1)","v":"T"},{"$f":"INDEX(Turnos_Turno,TURNOS_2021_03[[#This Row],[FILA]],1)","v":"T"},{"$f":"INDEX(Turnos_Turno,TURNOS_2021_03[[#This Row],[FILA]],1)","v":"T"},{"$f":"INDEX(Turnos_Turno,TURNOS_2021_03[[#This Row],[FILA]],1)","v":"T"},{"$f":"INDEX(Turnos_Turno,TURNOS_2021_03[[#This Row],[FILA]],1)","v":"T"},{"$f":"INDEX(Turnos_Turno,TURNOS_2021_03[[#This Row],[FILA]],1)","v":"T"},{"$f":"INDEX(Turnos_Turno,TURNOS_2021_03[[#This Row],[FILA]],1)","v":"T"},{"$f":"INDEX(Turnos_Turno,TURNOS_2021_03[[#This Row],[FILA]],1)","v":"T"},{"$f":"INDEX(Turnos_Turno,TURNOS_2021_03[[#This Row],[FILA]],1)","v":"T"},{"$f":"INDEX(Turnos_Turno,TURNOS_2021_03[[#This Row],[FILA]],1)","v":"T"},{"$f":"INDEX(Turnos_Turno,TURNOS_2021_03[[#This Row],[FILA]],1)","v":"T"},{"$f":"INDEX(Turnos_Turno,TURNOS_2021_03[[#This Row],[FILA]],1)","v":"T"},{"$f":"INDEX(Turnos_Turno,TURNOS_2021_03[[#This Row],[FILA]],1)","v":"T"},{"$f":"INDEX(Turnos_Turno,TURNOS_2021_03[[#This Row],[FILA]],1)","v":"T"},{"$f":"INDEX(Turnos_Turno,TURNOS_2021_03[[#This Row],[FILA]],1)","v":"T"},{"$f":"INDEX(Turnos_Turno,TURNOS_2021_03[[#This Row],[FILA]],1)","v":"T"},{"$f":"INDEX(Turnos_Turno,TURNOS_2021_03[[#This Row],[FILA]],1)","v":"T"},{"$f":"INDEX(Turnos_Turno,TURNOS_2021_03[[#This Row],[FILA]],1)","v":"T"},{"$f":"INDEX(Turnos_Turno,TURNOS_2021_03[[#This Row],[FILA]],1)","v":"T"},{"$f":"INDEX(Turnos_Turno,TURNOS_2021_03[[#This Row],[FILA]],1)","v":"T"},{"$f":"INDEX(Turnos_Turno,TURNOS_2021_03[[#This Row],[FILA]],1)","v":"T"},{"$f":"INDEX(Turnos_Turno,TURNOS_2021_03[[#This Row],[FILA]],1)","v":"T"},{"$f":"INDEX(Turnos_Turno,TURNOS_2021_03[[#This Row],[FILA]],1)","v":"T"},{"$f":"INDEX(Turnos_Turno,TURNOS_2021_03[[#This Row],[FILA]],1)","v":"T"},{"$f":"INDEX(Turnos_Turno,TURNOS_2021_03[[#This Row],[FILA]],1)","v":"T"},{"$f":"INDEX(Turnos_Turno,TURNOS_2021_03[[#This Row],[FILA]],1)","v":"T"},{"$f":"INDEX(Turnos_Turno,TURNOS_2021_03[[#This Row],[FILA]],1)","v":"T"}]
[null,{"$f":"MATCH(TURNOS_2021_03[[#This Row],[PERSONAL]],Turnos_Personal,0)","v":27},{"$f":"INDEX(Capacidades_Nombre,MATCH(TURNOS_2021_03[[#This Row],[PERSONAL]],Capacidades_Personal,0),1) & \"\"","v":"N27"},"F27",{"$f":"INDEX(Turnos_Turno,TURNOS_2021_03[[#This Row],[FILA]],1)","v":"T"},{"$f":"INDEX(Turnos_Turno,TURNOS_2021_03[[#This Row],[FILA]],1)","v":"T"},{"$f":"INDEX(Turnos_Turno,TURNOS_2021_03[[#This Row],[FILA]],1)","v":"T"},{"$f":"INDEX(Turnos_Turno,TURNOS_2021_03[[#This Row],[FILA]],1)","v":"T"},{"$f":"INDEX(Turnos_Turno,TURNOS_2021_03[[#This Row],[FILA]],1)","v":"T"},{"$f":"INDEX(Turnos_Turno,TURNOS_2021_03[[#This Row],[FILA]],1)","v":"T"},{"$f":"INDEX(Turnos_Turno,TURNOS_2021_03[[#This Row],[FILA]],1)","v":"T"},{"$f":"INDEX(Turnos_Turno,TURNOS_2021_03[[#This Row],[FILA]],1)","v":"T"},{"$f":"INDEX(Turnos_Turno,TURNOS_2021_03[[#This Row],[FILA]],1)","v":"T"},{"$f":"INDEX(Turnos_Turno,TURNOS_2021_03[[#This Row],[FILA]],1)","v":"T"},{"$f":"INDEX(Turnos_Turno,TURNOS_2021_03[[#This Row],[FILA]],1)","v":"T"},{"$f":"INDEX(Turnos_Turno,TURNOS_2021_03[[#This Row],[FILA]],1)","v":"T"},{"$f":"INDEX(Turnos_Turno,TURNOS_2021_03[[#This Row],[FILA]],1)","v":"T"},{"$f":"INDEX(Turnos_Turno,TURNOS_2021_03[[#This Row],[FILA]],1)","v":"T"},{"$f":"INDEX(Turnos_Turno,TURNOS_2021_03[[#This Row],[FILA]],1)","v":"T"},{"$f":"INDEX(Turnos_Turno,TURNOS_2021_03[[#This Row],[FILA]],1)","v":"T"},{"$f":"INDEX(Turnos_Turno,TURNOS_2021_03[[#This Row],[FILA]],1)","v":"T"},{"$f":"INDEX(Turnos_Turno,TURNOS_2021_03[[#This Row],[FILA]],1)","v":"T"},{"$f":"INDEX(Turnos_Turno,TURNOS_2021_03[[#This Row],[FILA]],1)","v":"T"},{"$f":"INDEX(Turnos_Turno,TURNOS_2021_03[[#This Row],[FILA]],1)","v":"T"},{"$f":"INDEX(Turnos_Turno,TURNOS_2021_03[[#This Row],[FILA]],1)","v":"T"},{"$f":"INDEX(Turnos_Turno,TURNOS_2021_03[[#This Row],[FILA]],1)","v":"T"},{"$f":"INDEX(Turnos_Turno,TURNOS_2021_03[[#This Row],[FILA]],1)","v":"T"},{"$f":"INDEX(Turnos_Turno,TURNOS_2021_03[[#This Row],[FILA]],1)","v":"T"},{"$f":"INDEX(Turnos_Turno,TURNOS_2021_03[[#This Row],[FILA]],1)","v":"T"},{"$f":"INDEX(Turnos_Turno,TURNOS_2021_03[[#This Row],[FILA]],1)","v":"T"},{"$f":"INDEX(Turnos_Turno,TURNOS_2021_03[[#This Row],[FILA]],1)","v":"T"},{"$f":"INDEX(Turnos_Turno,TURNOS_2021_03[[#This Row],[FILA]],1)","v":"T"},{"$f":"INDEX(Turnos_Turno,TURNOS_2021_03[[#This Row],[FILA]],1)","v":"T"},{"$f":"INDEX(Turnos_Turno,TURNOS_2021_03[[#This Row],[FILA]],1)","v":"T"},{"$f":"INDEX(Turnos_Turno,TURNOS_2021_03[[#This Row],[FILA]],1)","v":"T"}]
[null,{"$f":"MATCH(TURNOS_2021_03[[#This Row],[PERSONAL]],Turnos_Personal,0)","v":28},{"$f":"INDEX(Capacidades_Nombre,MATCH(TURNOS_2021_03[[#This Row],[PERSONAL]],Capacidades_Personal,0),1) & \"\"","v":"N28"},"F28",{"$f":"INDEX(Turnos_Turno,TURNOS_2021_03[[#This Row],[FILA]],1)","v":"T"},{"$f":"INDEX(Turnos_Turno,TURNOS_2021_03[[#This Row],[FILA]],1)","v":"T"},{"$f":"INDEX(Turnos_Turno,TURNOS_2021_03[[#This Row],[FILA]],1)","v":"T"},{"$f":"INDEX(Turnos_Turno,TURNOS_2021_03[[#This Row],[FILA]],1)","v":"T"},{"$f":"INDEX(Turnos_Turno,TURNOS_2021_03[[#This Row],[FILA]],1)","v":"T"},{"$f":"INDEX(Turnos_Turno,TURNOS_2021_03[[#This Row],[FILA]],1)","v":"T"},{"$f":"INDEX(Turnos_Turno,TURNOS_2021_03[[#This Row],[FILA]],1)","v":"T"},{"$f":"INDEX(Turnos_Turno,TURNOS_2021_03[[#This Row],[FILA]],1)","v":"T"},{"$f":"INDEX(Turnos_Turno,TURNOS_2021_03[[#This Row],[FILA]],1)","v":"T"},{"$f":"INDEX(Turnos_Turno,TURNOS_2021_03[[#This Row],[FILA]],1)","v":"T"},{"$f":"INDEX(Turnos_Turno,TURNOS_2021_03[[#This Row],[FILA]],1)","v":"T"},{"$f":"INDEX(Turnos_Turno,TURNOS_2021_03[[#This Row],[FILA]],1)","v":"T"},{"$f":"INDEX(Turnos_Turno,TURNOS_2021_03[[#This Row],[FILA]],1)","v":"T"},{"$f":"INDEX(Turnos_Turno,TURNOS_2021_03[[#This Row],[FILA]],1)","v":"T"},{"$f":"INDEX(Turnos_Turno,TURNOS_2021_03[[#This Row],[FILA]],1)","v":"T"},{"$f":"INDEX(Turnos_Turno,TURNOS_2021_03[[#This Row],[FILA]],1)","v":"T"},{"$f":"INDEX(Turnos_Turno,TURNOS_2021_03[[#This Row],[FILA]],1)","v":"T"},{"$f":"INDEX(Turnos_Turno,TURNOS_2021_03[[#This Row],[FILA]],1)","v":"T"},{"$f":"INDEX(Turnos_Turno,TURNOS_2021_03[[#This Row],[FILA]],1)","v":"T"},{"$f":"INDEX(Turnos_Turno,TURNOS_2021_03[[#This Row],[FILA]],1)","v":"T"},{"$f":"INDEX(Turnos_Turno,TURNOS_2021_03[[#This Row],[FILA]],1)","v":"T"},{"$f":"INDEX(Turnos_Turno,TURNOS_2021_03[[#This Row],[FILA]],1)","v":"T"},{"$f":"INDEX(Turnos_Turno,TURNOS_2021_03[[#This Row],[FILA]],1)","v":"T"},{"$f":"INDEX(Turnos_Turno,TURNOS_2021_03[[#This Row],[FILA]],1)","v":"T"},{"$f":"INDEX(Turnos_Turno,TURNOS_2021_03[[#This Row],[FILA]],1)","v":"T"},{"$f":"INDEX(Turnos_Turno,TURNOS_2021_03[[#This Row],[FILA]],1)","v":"T"},{"$f":"INDEX(Turnos_Turno,TURNOS_2021_03[[#This Row],[FILA]],1)","v":"T"},{"$f":"INDEX(Turnos_Turno,TURNOS_2021_03[[#This Row],[FILA]],1)","v":"T"},{"$f":"INDEX(Turnos_Turno,TURNOS_2021_03[[#This Row],[FILA]],1)","v":"T"},{"$f":"INDEX(Turnos_Turno,TURNOS_2021_03[[#This Row],[FILA]],1)","v":"T"},{"$f":"INDEX(Turnos_Turno,TURNOS_2021_03[[#This Row],[FILA]],1)","v":"T"}]
[null,{"$f":"MATCH(TURNOS_2021_03[[#This Row],[PERSONAL]],Turnos_Personal,0)","v":29},{"$f":"INDEX(Capacidades_Nombre,MATCH(TURNOS_2021_03[[#This Row],[PERSONAL]],Capacidades_Personal,0),1) & \"\"","v":"N29"},"F29",{"$f":"INDEX(Turnos_Turno,TURNOS_2021_03[[#This Row],[FILA]],1)","v":"T"},{"$f":"INDEX(Turnos_Turno,TURNOS_2021_03[[#This Row],[FILA]],1)","v":"T"},{"$f":"INDEX(Turnos_Turno,TURNOS_2021_03[[#This Row],[FILA]],1)","v":"T"},{"$f":"INDEX(Turnos_Turno,TURNOS_2021_03[[#This Row],[FILA]],1)","v":"T"},{"$f":"INDEX(Turnos_Turno,TURNOS_2021_03[[#This Row],[FILA]],1)","v":"T"},{"$f":"INDEX(Turnos_Turno,TURNOS_2021_03[[#This Row],[FILA]],1)","v":"T"},{"$f":"INDEX(Turnos_Turno,TURNOS_2021_03[[#This Row],[FILA]],1)","v":"T"},{"$f":"INDEX(Turnos_Turno,TURNOS_2021_03[[#This Row],[FILA]],1)","v":"T"},{"$f":"INDEX(Turnos_Turno,TURNOS_2021_03[[#This Row],[FILA]],1)","v":"T"},{"$f":"INDEX(Turnos_Turno,TURNOS_2021_03[[#This Row],[FILA]],1)","v":"T"},{"$f":"INDEX(Turnos_Turno,TURNOS_2021_03[[#This Row],[FILA]],1)","v":"T"},{"$f":"INDEX(Turnos_Turno,TURNOS_2021_03[[#This Row],[FILA]],1)","v":"T"},{"$f":"INDEX(Turnos_Turno,TURNOS_2021_03[[#This Row],[FILA]],1)","v":"T"},{"$f":"INDEX(Turnos_Turno,TURNOS_2021_03[[#This Row],[FILA]],1)","v":"T"},{"$f":"INDEX(Turnos_Turno,TURNOS_2021_03[[#This Row],[FILA]],1)","v":"T"},{"$f":"INDEX(Turnos_Turno,TURNOS_2021_03[[#This Row],[FILA]],1)","v":"T"},{"$f":"INDEX(Turnos_Turno,TURNOS_2021_03[[#This Row],[FILA]],1)","v":"T"},{"$f":"INDEX(Turnos_Turno,TURNOS_2021_03[[#This Row],[FILA]],1)","v":"T"},{"$f":"INDEX(Turnos_Turno,TURNOS_2021_03[[#This Row],[FILA]],1)","v":"T"},{"$f":"INDEX(Turnos_Turno,TURNOS_2021_03[[#This Row],[FILA]],1)","v":"T"},{"$f":"INDEX(Turnos_Turno,TURNOS_2021_03[[#This Row],[FILA]],1)","v":"T"},{"$f":"INDEX(Turnos_Turno,TURNOS_2021_03[[#This Row],[FILA]],1)","v":"T"},{"$f":"INDEX(Turnos_Turno,TURNOS_2021_03[[#This Row],[FILA]],1)","v":"T"},{"$f":"INDEX(Turnos_Turno,TURNOS_2021_03[[#This Row],[FILA]],1)","v":"T"},{"$f":"INDEX(Turnos_Turno,TURNOS_2021_03[[#This Row],[FILA]],1)","v":"T"},{"$f":"INDEX(Turnos_Turno,TURNOS_2021_03[[#This Row],[FILA]],1)","v":"T"},{"$f":"INDEX(Turnos_Turno,TURNOS_2021_03[[#This Row],[FILA]],1)","v":"T"},{"$f":"INDEX(Turnos_Turno,TURNOS_2021_03[[#This Row],[FILA]],1)","v":"T"},{"$f":"INDEX(Turnos_Turno,TURNOS_2021_03[[#This Row],[FILA]],1)","v":"T"},{"$f":"INDEX(Turnos_Turno,TURNOS_2021_03[[#This Row],[FILA]],1)","v":"T"},{"$f":"INDEX(Turnos_Turno,TURNOS_2021_03[[#This Row],[FILA]],1)","v":"T"}]
[null,{"$f":"MATCH(TURNOS_2021_03[[#This Row],[PERSONAL]],Turnos_Personal,0)","v":30},{"$f":"INDEX(Capacidades_Nombre,MATCH(TURNOS_2021_03[[#This Row],[PERSONAL]],Capacidades_Personal,0),1) & \"\"","v":"N30"},"F30",{"$f":"INDEX(Turnos_Turno,TURNOS_2021_03[[#This Row],[FILA]],1)","v":"N"},{"$f":"INDEX(Turnos_Turno,TURNOS_2021_03[[#This Row],[FILA]],1)","v":"N"},{"$f":"INDEX(Turnos_Turno,TURNOS_2021_03[[#This Row],[FILA]],1)","v":"N"},{"$f":"INDEX(Turnos_Turno,TURNOS_2021_03[[#This Row],[FILA]],1)","v":"N"},{"$f":"INDEX(Turnos_Turno,TURNOS_2021_03[[#This Row],[FILA]],1)","v":"N"},{"$f":"INDEX(Turnos_Turno,TURNOS_2021_03[[#This Row],[FILA]],1)","v":"N"},{"$f":"INDEX(Turnos_Turno,TURNOS_2021_03[[#This Row],[FILA]],1)","v":"N"},{"$f":"INDEX(Turnos_Turno,TURNOS_2021_03[[#This Row],[FILA]],1)","v":"N"},{"$f":"INDEX(Turnos_Turno,TURNOS_2021_03[[#This Row],[FILA]],1)","v":"N"},{"$f":"INDEX(Turnos_Turno,TURNOS_2021_03[[#This Row],[FILA]],1)","v":"N"},{"$f":"INDEX(Turnos_Turno,TURNOS_2021_03[[#This Row],[FILA]],1)","v":"N"},{"$f":"INDEX(Turnos_Turno,TURNOS_2021_03[[#This Row],[FILA]],1)","v":"N"},{"$f":"INDEX(Turnos_Turno,TURNOS_2021_03[[#This Row],[FILA]],1)","v":"N"},{"$f":"INDEX(Turnos_Turno,TURNOS_2021_03[[#This Row],[FILA]],1)","v":"N"},{"$f":"INDEX(Turnos_Turno,TURNOS_2021_03[[#This Row],[FILA]],1)","v":"N"},{"$f":"INDEX(Turnos_Turno,TURNOS_2021_03[[#This Row],[FILA]],1)","v":"N"},{"$f":"INDEX(Turnos_Turno,TURNOS_2021_03[[#This Row],[FILA]],1)","v":"N"},{"$f":"INDEX(Turnos_Turno,TURNOS_2021_03[[#This Row],[FILA]],1)","v":"N"},{"$f":"INDEX(Turnos_Turno,TURNOS_2021_03[[#This Row],[FILA]],1)","v":"N"},{"$f":"INDEX(Turnos_Turno,TURNOS_2021_03[[#This Row],[FILA]],1)","v":"N"},{"$f":"INDEX(Turnos_Turno,TURNOS_2021_03[[#This Row],[FILA]],1)","v":"N"},{"$f":"INDEX(Turnos_Turno,TURNOS_2021_03[[#This Row],[FILA]],1)","v":"N"},{"$f":"INDEX(Turnos_Turno,TURNOS_2021_03[[#This Row],[FILA]],1)","v":"N"},{"$f":"INDEX(Turnos_Turno,TURNOS_2021_03[[#This Row],[FILA]],1)","v":"N"},{"$f":"INDEX(Turnos_Turno,TURNOS_2021_03[[#This Row],[FILA]],1)","v":"N"},{"$f":"INDEX(Turnos_Turno,TURNOS_2021_03[[#This Row],[FILA]],1)","v":"N"},{"$f":"INDEX(Turnos_Turno,TURNOS_2021_03[[#This Row],[FILA]],1)","v":"N"},{"$f":"INDEX(Turnos_Turno,TURNOS_2021_03[[#This Row],[FILA]],1)","v":"N"},{"$f":"INDEX(Turnos_Turno,TURNOS_2021_03[[#This Row],[FILA]],1)","v":"N"},{"$f":"INDEX(Turnos_Turno,TURNOS_2021_03[[#This Row],[FILA]],1)","v":"N"},{"$f":"INDEX(Turnos_Turno,TURNOS_2021_03[[#This Row],[FILA]],1)","v":"N"}]
[null,{"$f":"MATCH(TURNOS_2021_03[[#This Row],[PERSONAL]],Turnos_Personal,0)","v":31},{"$f":"INDEX(Capacidades_Nombre,MATCH(TURNOS_2021_03[[#This Row],[PERSONAL]],Capacidades_Personal,0),1) & \"\"","v":"N31"},"F31",{"$f":"INDEX(Turnos_Turno,TURNOS_2021_03[[#This Row],[FILA]],1)","v":"N"},{"$f":"INDEX(Turnos_Turno,TURNOS_2021_03[[#This Row],[FILA]],1)","v":"N"},{"$f":"INDEX(Turnos_Turno,TURNOS_2021_03[[#This Row],[FILA]],1)","v":"N"},{"$f":"INDEX(Turnos_Turno,TURNOS_2021_03[[#This Row],[FILA]],1)","v":"N"},{"$f":"INDEX(Turnos_Turno,TURNOS_2021_03[[#This Row],[FILA]],1)","v":"N"},{"$f":"INDEX(Turnos_Turno,TURNOS_2021_03[[#This Row],[FILA]],1)","v":"N"},{"$f":"INDEX(Turnos_Turno,TURNOS_2021_03[[#This Row],[FILA]],1)","v":"N"},{"$f":"INDEX(Turnos_Turno,TURNOS_2021_03[[#This Row],[FILA]],1)","v":"N"},{"$f":"INDEX(Turnos_Turno,TURNOS_2021_03[[#This Row],[FILA]],1)","v":"N"},{"$f":"INDEX(Turnos_Turno,TURNOS_2021_03[[#This Row],[FILA]],1)","v":"N"},{"$f":"INDEX(Turnos_Turno,TURNOS_2021_03[[#This Row],[FILA]],1)","v":"N"},{"$f":"INDEX(Turnos_Turno,TURNOS_2021_03[[#This Row],[FILA]],1)","v":"N"},{"$f":"INDEX(Turnos_Turno,TURNOS_2021_03[[#This Row],[FILA]],1)","v":"N"},{"$f":"INDEX(Turnos_Turno,TURNOS_2021_03[[#This Row],[FILA]],1)","v":"N"},{"$f":"INDEX(Turnos_Turno,TURNOS_2021_03[[#This Row],[FILA]],1)","v":"N"},{"$f":"INDEX(Turnos_Turno,TURNOS_2021_03[[#This Row],[FILA]],1)","v":"N"},{"$f":"INDEX(Turnos_Turno,TURNOS_2021_03[[#This Row],[FILA]],1)","v":"N"},{"$f":"INDEX(Turnos_Turno,TURNOS_2021_03[[#This Row],[FILA]],1)","v":"N"},{"$f":"INDEX(Turnos_Turno,TURNOS_2021_03[[#This Row],[FILA]],1)","v":"N"},{"$f":"INDEX(Turnos_Turno,TURNOS_2021_03[[#This Row],[FILA]],1)","v":"N"},{"$f":"INDEX(Turnos_Turno,TURNOS_2021_03[[#This Row],[FILA]],1)","v":"N"},{"$f":"INDEX(Turnos_Turno,TURNOS_2021_03[[#This Row],[FILA]],1)","v":"N"},{"$f":"INDEX(Turnos_Turno,TURNOS_2021_03[[#This Row],[FILA]],1)","v":"N"},{"$f":"INDEX(Turnos_Turno,TURNOS_2021_03[[#This Row],[FILA]],1)","v":"N"},{"$f":"INDEX(Turnos_Turno,TURNOS_2021_03[[#This Row],[FILA]],1)","v":"N"},{"$f":"INDEX(Turnos_Turno,TURNOS_2021_03[[#This Row],[FILA]],1)","v":"N"},{"$f":"INDEX(Turnos_Turno,TURNOS_2021_03[[#This Row],[FILA]],1)","v":"N"},{"$f":"INDEX(Turnos_Turno,TURNOS_2021_03[[#This Row],[FILA]],1)","v":"N"},{"$f":"INDEX(Turnos_Turno,TURNOS_2021_03[[#This Row],[FILA]],1)","v":"N"},{"$f":"INDEX(Turnos_Turno,TURNOS_2021_03[[#This Row],[FILA]],1)","v":"N"},{"$f":"INDEX(Turnos_Turno,TURNOS_2021_03[[#This Row],[FILA]],1)","v":"N"}]
[null,{"$f":"MATCH(TURNOS_2021_03[[#This Row],[PERSONAL]],Turnos_Personal,0)","v":32},{"$f":"INDEX(Capacidades_Nombre,MATCH(TURNOS_2021_03[[#This Row],[PERSONAL]],Capacidades_Personal,0),1) & \"\"","v":"N32"},"F32",{"$f":"INDEX(Turnos_Turno,TURNOS_2021_03[[#This Row],[FILA]],1)","v":"N"},{"$f":"INDEX(Turnos_Turno,TURNOS_2021_03[[#This Row],[FILA]],1)","v":"N"},{"$f":"INDEX(Turnos_Turno,TURNOS_2021_03[[#This Row],[FILA]],1)","v":"N"},{"$f":"INDEX(Turnos_Turno,TURNOS_2021_03[[#This Row],[FILA]],1)","v":"N"},{"$f":"INDEX(Turnos_Turno,TURNOS_2021_03[[#This Row],[FILA]],1)","v":"N"},{"$f":"INDEX(Turnos_Turno,TURNOS_2021_03[[#This Row],[FILA]],1)","v":"N"},{"$f":"INDEX(Turnos_Turno,TURNOS_2021_03[[#This Row],[FILA]],1)","v":"N"},{"$f":"INDEX(Turnos_Turno,TURNOS_2021_03[[#This Row],[FILA]],1)","v":"N"},{"$f":"INDEX(Turnos_Turno,TURNOS_2021_03[[#This Row],[FILA]],1)","v":"N"},{"$f":"INDEX(Turnos_Turno,TURNOS_2021_03[[#This Row],[FILA]],1)","v":"N"},{"$f":"INDEX(Turnos_Turno,TURNOS_2021_03[[#This Row],[FILA]],1)","v":"N"},{"$f":"INDEX(Turnos_Turno,TURNOS_2021_03[[#This Row],[FILA]],1)","v":"N"},{"$f":"INDEX(Turnos_Turno,TURNOS_2021_03[[#This Row],[FILA]],1)","v":"N"},{"$f":"INDEX(Turnos_Turno,TURNOS_2021_03[[#This Row],[FILA]],1)","v":"N"},{"$f":"INDEX(Turnos_Turno,TURNOS_2021_03[[#This Row],[FILA]],1)","v":"N"},{"$f":"INDEX(Turnos_Turno,TURNOS_2021_03[[#This Row],[FILA]],1)","v":"N"},{"$f":"INDEX(Turnos_Turno,TURNOS_2021_03[[#This Row],[FILA]],1)","v":"N"},{"$f":"INDEX(Turnos_Turno,TURNOS_2021_03[[#This Row],[FILA]],1)","v":"N"},{"$f":"INDEX(Turnos_Turno,TURNOS_2021_03[[#This Row],[FILA]],1)","v":"N"},{"$f":"INDEX(Turnos_Turno,TURNOS_2021_03[[#This Row],[FILA]],1)","v":"N"},{"$f":"INDEX(Turnos_Turno,TURNOS_2021_03[[#This Row],[FILA]],1)","v":"N"},{"$f":"INDEX(Turnos_Turno,TURNOS_2021_03[[#This Row],[FILA]],1)","v":"N"},{"$f":"INDEX(Turnos_Turno,TURNOS_2021_03[[#This Row],[FILA]],1)","v":"N"},{"$f":"INDEX(Turnos_Turno,TURNOS_2021_03[[#This Row],[FILA]],1)","v":"N"},{"$f":"INDEX(Turnos_Turno,TURNOS_2021_03[[#This Row],[FILA]],1)","v":"N"},{"$f":"INDEX(Turnos_Turno,TURNOS_2021_03[[#This Row],[FILA]],1)","v":"N"},{"$f":"INDEX(Turnos_Turno,TURNOS_2021_03[[#This Row],[FILA]],1)","v":"N"},{"$f":"INDEX(Turnos_Turno,TURNOS_2021_03[[#This Row],[FILA]],1)","v":"N"},{"$f":"INDEX(Turnos_Turno,TURNOS_2021_03[[#This Row],[FILA]],1)","v":"N"},{"$f":"INDEX(Turnos_Turno,TURNOS_2021_03[[#This Row],[FILA]],1)","v":"N"},{"$f":"INDEX(Turnos_Turno,TURNOS_2021_03[[#This Row],[FILA]],1)","v":"N"}]
[null,{"$f":"MATCH(TURNOS_2021_03[[#This Row],[PERSONAL]],Turnos_Personal,0)","v":33},{"$f":"INDEX(Capacidades_Nombre,MATCH(TURNOS_2021_03[[#This Row],[PERSONAL]],Capacidades_Personal,0),1) & \"\"","v":"N33"},"F33",{"$f":"INDEX(Turnos_Turno,TURNOS_2021_03[[#This Row],[FILA]],1)","v":"N"},{"$f":"INDEX(Turnos_Turno,TURNOS_2021_03[[#This Row],[FILA]],1)","v":"N"},{"$f":"INDEX(Turnos_Turno,TURNOS_2021_03[[#This Row],[FILA]],1)","v":"N"},{"$f":"INDEX(Turnos_Turno,TURNOS_2021_03[[#This Row],[FILA]],1)","v":"N"},{"$f":"INDEX(Turnos_Turno,TURNOS_2021_03[[#This Row],[FILA]],1)","v":"N"},{"$f":"INDEX(Turnos_Turno,TURNOS_2021_03[[#This Row],[FILA]],1)","v":"N"},{"$f":"INDEX(Turnos_Turno,TURNOS_2021_03[[#This Row],[FILA]],1)","v":"N"},{"$f":"INDEX(Turnos_Turno,TURNOS_2021_03[[#This Row],[FILA]],1)","v":"N"},{"$f":"INDEX(Turnos_Turno,TURNOS_2021_03[[#This Row],[FILA]],1)","v":"N"},{"$f":"INDEX(Turnos_Turno,TURNOS_2021_03[[#This Row],[FILA]],1)","v":"N"},{"$f":"INDEX(Turnos_Turno,TURNOS_2021_03[[#This Row],[FILA]],1)","v":"N"},{"$f":"INDEX(Turnos_Turno,TURNOS_2021_03[[#This Row],[FILA]],1)","v":"N"},{"$f":"INDEX(Turnos_Turno,TURNOS_2021_03[[#This Row],[FILA]],1)","v":"N"},{"$f":"INDEX(Turnos_Turno,TURNOS_2021_03[[#This Row],[FILA]],1)","v":"N"},{"$f":"INDEX(Turnos_Turno,TURNOS_2021_03[[#This Row],[FILA]],1)","v":"N"},{"$f":"INDEX(Turnos_Turno,TURNOS_2021_03[[#This Row],[FILA]],1)","v":"N"},{"$f":"INDEX(Turnos_Turno,TURNOS_2021_03[[#This Row],[FILA]],1)","v":"N"},{"$f":"INDEX(Turnos_Turno,TURNOS_2021_03[[#This Row],[FILA]],1)","v":"N"},{"$f":"INDEX(Turnos_Turno,TURNOS_2021_03[[#This Row],[FILA]],1)","v":"N"},{"$f":"INDEX(Turnos_Turno,TURNOS_2021_03[[#This Row],[FILA]],1)","v":"N"},{"$f":"INDEX(Turnos_Turno,TURNOS_2021_03[[#This Row],[FILA]],1)","v":"N"},{"$f":"INDEX(Turnos_Turno,TURNOS_2021_03[[#This Row],[FILA]],1)","v":"N"},{"$f":"INDEX(Turnos_Turno,TURNOS_2021_03[[#This Row],[FILA]],1)","v":"N"},{"$f":"INDEX(Turnos_Turno,TURNOS_2021_03[[#This Row],[FILA]],1)","v":"N"},{"$f":"INDEX(Turnos_Turno,TURNOS_2021_03[[#This Row],[FILA]],1)","v":"N"},{"$f":"INDEX(Turnos_Turno,TURNOS_2021_03[[#This Row],[FILA]],1)","v":"N"},{"$f":"INDEX(Turnos_Turno,TURNOS_2021_03[[#This Row],[FILA]],1)","v":"N"},{"$f":"INDEX(Turnos_Turno,TURNOS_2021_03[[#This Row],[FILA]],1)","v":"N"},{"$f":"INDEX(Turnos_Turno,TURNOS_2021_03[[#This Row],[FILA]],1)","v":"N"},{"$f":"INDEX(Turnos_Turno,TURNOS_2021_03[[#This Row],[FILA]],1)","v":"N"},{"$f":"INDEX(Turnos_Turno,TURNOS_2021_03[[#This Row],[FILA]],1)","v":"N"}]
[null,{"$f":"MATCH(TURNOS_2021_03[[#This Row],[PERSONAL]],Turnos_Personal,0)","v":34},{"$f":"INDEX(Capacidades_Nombre,MATCH(TURNOS_2021_03[[#This Row],[PERSONAL]],Capacidades_Personal,0),1) & \"\"","v":"N34"},"F34",{"$f":"INDEX(Turnos_Turno,TURNOS_2021_03[[#This Row],[FILA]],1)","v":"N"},{"$f":"INDEX(Turnos_Turno,TURNOS_2021_03[[#This Row],[FILA]],1)","v":"N"},{"$f":"INDEX(Turnos_Turno,TURNOS_2021_03[[#This Row],[FILA]],1)","v":"N"},{"$f":"INDEX(Turnos_Turno,TURNOS_2021_03[[#This Row],[FILA]],1)","v":"N"},{"$f":"INDEX(Turnos_Turno,TURNOS_2021_03[[#This Row],[FILA]],1)","v":"N"},{"$f":"INDEX(Turnos_Turno,TURNOS_2021_03[[#This Row],[FILA]],1)","v":"N"},{"$f":"INDEX(Turnos_Turno,TURNOS_2021_03[[#This Row],[FILA]],1)","v":"N"},{"$f":"INDEX(Turnos_Turno,TURNOS_2021_03[[#This Row],[FILA]],1)","v":"N"},{"$f":"INDEX(Turnos_Turno,TURNOS_2021_03[[#This Row],[FILA]],1)","v":"N"},{"$f":"INDEX(Turnos_Turno,TURNOS_2021_03[[#This Row],[FILA]],1)","v":"N"},{"$f":"INDEX(Turnos_Turno,TURNOS_2021_03[[#This Row],[FILA]],1)","v":"N"},{"$f":"INDEX(Turnos_Turno,TURNOS_2021_03[[#This Row],[FILA]],1)","v":"N"},{"$f":"INDEX(Turnos_Turno,TURNOS_2021_03[[#This Row],[FILA]],1)","v":"N"},{"$f":"INDEX(Turnos_Turno,TURNOS_2021_03[[#This Row],[FILA]],1)","v":"N"},{"$f":"INDEX(Turnos_Turno,TURNOS_2021_03[[#This Row],[FILA]],1)","v":"N"},{"$f":"INDEX(Turnos_Turno,TURNOS_2021_03[[#This Row],[FILA]],1)","v":"N"},{"$f":"INDEX(Turnos_Turno,TURNOS_2021_03[[#This Row],[FILA]],1)","v":"N"},{"$f":"INDEX(Turnos_Turno,TURNOS_2021_03[[#This Row],[FILA]],1)","v":"N"},{"$f":"INDEX(Turnos_Turno,TURNOS_2021_03[[#This Row],[FILA]],1)","v":"N"},{"$f":"INDEX(Turnos_Turno,TURNOS_2021_03[[#This Row],[FILA]],1)","v":"N"},{"$f":"INDEX(Turnos_Turno,TURNOS_2021_03[[#This Row],[FILA]],1)","v":"N"},{"$f":"INDEX(Turnos_Turno,TURNOS_2021_03[[#This Row],[FILA]],1)","v":"N"},{"$f":"INDEX(Turnos_Turno,TURNOS_2021_03[[#This Row],[FILA]],1)","v":"N"},{"$f":"INDEX(Turnos_Turno,TURNOS_2021_03[[#This Row],[FILA]],1)","v":"N"},{"$f":"INDEX(Turnos_Turno,TURNOS_2021_03[[#This Row],[FILA]],1)","v":"N"},{"$f":"INDEX(Turnos_Turno,TURNOS_2021_03[[#This Row],[FILA]],1)","v":"N"},{"$f":"INDEX(Turnos_Turno,TURNOS_2021_03[[#This Row],[FILA]],1)","v":"N"},{"$f":"INDEX(Turnos_Turno,TURNOS_2021_03[[#This Row],[FILA]],1)","v":"N"},{"$f":"INDEX(Turnos_Turno,TURNOS_2021_03[[#This Row],[FILA]],1)","v":"N"},{"$f":"INDEX(Turnos_Turno,TURNOS_2021_03[[#This Row],[FILA]],1)","v":"N"},{"$f":"INDEX(Turnos_Turno,TURNOS_2021_03[[#This Row],[FILA]],1)","v":"N"}]
[null,{"$f":"MATCH(TURNOS_2021_03[[#This Row],[PERSONAL]],Turnos_Personal,0)","v":35},{"$f":"INDEX(Capacidades_Nombre,MATCH(TURNOS_2021_03[[#This Row],[PERSONAL]],Capacidades_Personal,0),1) & \"\"","v":"N35"},"F35",{"$f":"INDEX(Turnos_Turno,TURNOS_2021_03[[#This Row],[FILA]],1)","v":"N"},{"$f":"INDEX(Turnos_Turno,TURNOS_2021_03[[#This Row],[FILA]],1)","v":"N"},{"$f":"INDEX(Turnos_Turno,TURNOS_2021_03[[#This Row],[FILA]],1)","v":"N"},{"$f":"INDEX(Turnos_Turno,TURNOS_2021_03[[#This Row],[FILA]],1)","v":"N"},{"$f":"INDEX(Turnos_Turno,TURNOS_2021_03[[#This Row],[FILA]],1)","v":"N"},{"$f":"INDEX(Turnos_Turno,TURNOS_2021_03[[#This Row],[FILA]],1)","v":"N"},{"$f":"INDEX(Turnos_Turno,TURNOS_2021_03[[#This Row],[FILA]],1)","v":"N"},{"$f":"INDEX(Turnos_Turno,TURNOS_2021_03[[#This Row],[FILA]],1)","v":"N"},{"$f":"INDEX(Turnos_Turno,TURNOS_2021_03[[#This Row],[FILA]],1)","v":"N"},{"$f":"INDEX(Turnos_Turno,TURNOS_2021_03[[#This Row],[FILA]],1)","v":"N"},{"$f":"INDEX(Turnos_Turno,TURNOS_2021_03[[#This Row],[FILA]],1)","v":"N"},{"$f":"INDEX(Turnos_Turno,TURNOS_2021_03[[#This Row],[FILA]],1)","v":"N"},{"$f":"INDEX(Turnos_Turno,TURNOS_2021_03[[#This Row],[FILA]],1)","v":"N"},{"$f":"INDEX(Turnos_Turno,TURNOS_2021_03[[#This Row],[FILA]],1)","v":"N"},{"$f":"INDEX(Turnos_Turno,TURNOS_2021_03[[#This Row],[FILA]],1)","v":"N"},{"$f":"INDEX(Turnos_Turno,TURNOS_2021_03[[#This Row],[FILA]],1)","v":"N"},{"$f":"INDEX(Turnos_Turno,TURNOS_2021_03[[#This Row],[FILA]],1)","v":"N"},{"$f":"INDEX(Turnos_Turno,TURNOS_2021_03[[#This Row],[FILA]],1)","v":"N"},{"$f":"INDEX(Turnos_Turno,TURNOS_2021_03[[#This Row],[FILA]],1)","v":"N"},{"$f":"INDEX(Turnos_Turno,TURNOS_2021_03[[#This Row],[FILA]],1)","v":"N"},{"$f":"INDEX(Turnos_Turno,TURNOS_2021_03[[#This Row],[FILA]],1)","v":"N"},{"$f":"INDEX(Turnos_Turno,TURNOS_2021_03[[#This Row],[FILA]],1)","v":"N"},{"$f":"INDEX(Turnos_Turno,TURNOS_2021_03[[#This Row],[FILA]],1)","v":"N"},{"$f":"INDEX(Turnos_Turno,TURNOS_2021_03[[#This Row],[FILA]],1)","v":"N"},{"$f":"INDEX(Turnos_Turno,TURNOS_2021_03[[#This Row],[FILA]],1)","v":"N"},{"$f":"INDEX(Turnos_Turno,TURNOS_2021_03[[#This Row],[FILA]],1)","v":"N"},{"$f":"INDEX(Turnos_Turno,TURNOS_2021_03[[#This Row],[FILA]],1)","v":"N"},{"$f":"INDEX(Turnos_Turno,TURNOS_2021_03[[#This Row],[FILA]],1)","v":"N"},{"$f":"INDEX(Turnos_Turno,TURNOS_2021_03[[#This Row],[FILA]],1)","v":"N"},{"$f":"INDEX(Turnos_Turno,TURNOS_2021_03[[#This Row],[FILA]],1)","v":"N"},{"$f":"INDEX(Turnos_Turno,TURNOS_2021_03[[#This Row],[FILA]],1)","v":"N"}]
[null,{"$f":"MATCH(TURNOS_2021_03[[#This Row],[PERSONAL]],Turnos_Personal,0)","v":36},{"$f":"INDEX(Capacidades_Nombre,MATCH(TURNOS_2021_03[[#This Row],[PERSONAL]],Capacidades_Personal,0),1) & \"\"","v":"N36"},"F36",{"$f":"INDEX(Turnos_Turno,TURNOS_2021_03[[#This Row],[FILA]],1)","v":"N"},{"$f":"INDEX(Turnos_Turno,TURNOS_2021_03[[#This Row],[FILA]],1)","v":"N"},{"$f":"INDEX(Turnos_Turno,TURNOS_2021_03[[#This Row],[FILA]],1)","v":"N"},{"$f":"INDEX(Turnos_Turno,TURNOS_2021_03[[#This Row],[FILA]],1)","v":"N"},{"$f":"INDEX(Turnos_Turno,TURNOS_2021_03[[#This Row],[FILA]],1)","v":"N"},{"$f":"INDEX(Turnos_Turno,TURNOS_2021_03[[#This Row],[FILA]],1)","v":"N"},{"$f":"INDEX(Turnos_Turno,TURNOS_2021_03[[#This Row],[FILA]],1)","v":"N"},{"$f":"INDEX(Turnos_Turno,TURNOS_2021_03[[#This Row],[FILA]],1)","v":"N"},{"$f":"INDEX(Turnos_Turno,TURNOS_2021_03[[#This Row],[FILA]],1)","v":"N"},{"$f":"INDEX(Turnos_Turno,TURNOS_2021_03[[#This Row],[FILA]],1)","v":"N"},{"$f":"INDEX(Turnos_Turno,TURNOS_2021_03[[#This Row],[FILA]],1)","v":"N"},{"$f":"INDEX(Turnos_Turno,TURNOS_2021_03[[#This Row],[FILA]],1)","v":"N"},{"$f":"INDEX(Turnos_Turno,TURNOS_2021_03[[#This Row],[FILA]],1)","v":"N"},{"$f":"INDEX(Turnos_Turno,TURNOS_2021_03[[#This Row],[FILA]],1)","v":"N"},{"$f":"INDEX(Turnos_Turno,TURNOS_2021_03[[#This Row],[FILA]],1)","v":"N"},{"$f":"INDEX(Turnos_Turno,TURNOS_2021_03[[#This Row],[FILA]],1)","v":"N"},{"$f":"INDEX(Turnos_Turno,TURNOS_2021_03[[#This Row],[FILA]],1)","v":"N"},{"$f":"INDEX(Turnos_Turno,TURNOS_2021_03[[#This Row],[FILA]],1)","v":"N"},{"$f":"INDEX(Turnos_Turno,TURNOS_2021_03[[#This Row],[FILA]],1)","v":"N"},{"$f":"INDEX(Turnos_Turno,TURNOS_2021_03[[#This Row],[FILA]],1)","v":"N"},{"$f":"INDEX(Turnos_Turno,TURNOS_2021_03[[#This Row],[FILA]],1)","v":"N"},{"$f":"INDEX(Turnos_Turno,TURNOS_2021_03[[#This Row],[FILA]],1)","v":"N"},{"$f":"INDEX(Turnos_Turno,TURNOS_2021_03[[#This Row],[FILA]],1)","v":"N"},{"$f":"INDEX(Turnos_Turno,TURNOS_2021_03[[#This Row],[FILA]],1)","v":"N"},{"$f":"INDEX(Turnos_Turno,TURNOS_2021_03[[#This Row],[FILA]],1)","v":"N"},{"$f":"INDEX(Turnos_Turno,TURNOS_2021_03[[#This Row],[FILA]],1)","v":"N"},{"$f":"INDEX(Turnos_Turno,TURNOS_2021_03[[#This Row],[FILA]],1)","v":"N"},{"$f":"INDEX(Turnos_Turno,TURNOS_2021_03[[#This Row],[FILA]],1)","v":"N"},{"$f":"INDEX(Turnos_Turno,TURNOS_2021_03[[#This Row],[FILA]],1)","v":"N"},{"$f":"INDEX(Turnos_Turno,TURNOS_2021_03[[#This Row],[FILA]],1)","v":"N"},{"$f":"INDEX(Turnos_Turno,TURNOS_2021_03[[#This Row],[FILA]],1)","v":"N"}]
[null,{"$f":"MATCH(TURNOS_2021_03[[#This Row],[PERSONAL]],Turnos_Personal,0)","v":37},{"$f":"INDEX(Capacidades_Nombre,MATCH(TURNOS_2021_03[[#This Row],[PERSONAL]],Capacidades_Personal,0),1) & \"\"","v":"N37"},"F37",{"$f":"INDEX(Turnos_Turno,TURNOS_2021_03[[#This Row],[FILA]],1)","v":"N"},{"$f":"INDEX(Turnos_Turno,TURNOS_2021_03[[#This Row],[FILA]],1)","v":"N"},{"$f":"INDEX(Turnos_Turno,TURNOS_2021_03[[#This Row],[FILA]],1)","v":"N"},{"$f":"INDEX(Turnos_Turno,TURNOS_2021_03[[#This Row],[FILA]],1)","v":"N"},{"$f":"INDEX(Turnos_Turno,TURNOS_2021_03[[#This Row],[FILA]],1)","v":"N"},{"$f":"INDEX(Turnos_Turno,TURNOS_2021_03[[#This Row],[FILA]],1)","v":"N"},{"$f":"INDEX(Turnos_Turno,TURNOS_2021_03[[#This Row],[FILA]],1)","v":"N"},{"$f":"INDEX(Turnos_Turno,TURNOS_2021_03[[#This Row],[FILA]],1)","v":"N"},{"$f":"INDEX(Turnos_Turno,TURNOS_2021_03[[#This Row],[FILA]],1)","v":"N"},{"$f":"INDEX(Turnos_Turno,TURNOS_2021_03[[#This Row],[FILA]],1)","v":"N"},{"$f":"INDEX(Turnos_Turno,TURNOS_2021_03[[#This Row],[FILA]],1)","v":"N"},{"$f":"INDEX(Turnos_Turno,TURNOS_2021_03[[#This Row],[FILA]],1)","v":"N"},{"$f":"INDEX(Turnos_Turno,TURNOS_2021_03[[#This Row],[FILA]],1)","v":"N"},{"$f":"INDEX(Turnos_Turno,TURNOS_2021_03[[#This Row],[FILA]],1)","v":"N"},{"$f":"INDEX(Turnos_Turno,TURNOS_2021_03[[#This Row],[FILA]],1)","v":"N"},{"$f":"INDEX(Turnos_Turno,TURNOS_2021_03[[#This Row],[FILA]],1)","v":"N"},{"$f":"INDEX(Turnos_Turno,TURNOS_2021_03[[#This Row],[FILA]],1)","v":"N"},{"$f":"INDEX(Turnos_Turno,TURNOS_2021_03[[#This Row],[FILA]],1)","v":"N"},{"$f":"INDEX(Turnos_Turno,TURNOS_2021_03[[#This Row],[FILA]],1)","v":"N"},{"$f":"INDEX(Turnos_Turno,TURNOS_2021_03[[#This Row],[FILA]],1)","v":"N"},{"$f":"INDEX(Turnos_Turno,TURNOS_2021_03[[#This Row],[FILA]],1)","v":"N"},{"$f":"INDEX(Turnos_Turno,TURNOS_2021_03[[#This Row],[FILA]],1)","v":"N"},{"$f":"INDEX(Turnos_Turno,TURNOS_2021_03[[#This Row],[FILA]],1)","v":"N"},{"$f":"INDEX(Turnos_Turno,TURNOS_2021_03[[#This Row],[FILA]],1)","v":"N"},{"$f":"INDEX(Turnos_Turno,TURNOS_2021_03[[#This Row],[FILA]],1)","v":"N"},{"$f":"INDEX(Turnos_Turno,TURNOS_2021_03[[#This Row],[FILA]],1)","v":"N"},{"$f":"INDEX(Turnos_Turno,TURNOS_2021_03[[#This Row],[FILA]],1)","v":"N"},{"$f":"INDEX(Turnos_Turno,TURNOS_2021_03[[#This Row],[FILA]],1)","v":"N"},{"$f":"INDEX(Turnos_Turno,TURNOS_2021_03[[#This Row],[FILA]],1)","v":"N"},{"$f":"INDEX(Turnos_Turno,TURNOS_2021_03[[#This Row],[FILA]],1)","v":"N"},{"$f":"INDEX(Turnos_Turno,TURNOS_2021_03[[#This Row],[FILA]],1)","v":"N"}]
[null,{"$f":"MATCH(TURNOS_2021_03[[#This Row],[PERSONAL]],Turnos_Personal,0)","v":38},{"$f":"INDEX(Capacidades_Nombre,MATCH(TURNOS_2021_03[[#This Row],[PERSONAL]],Capacidades_Personal,0),1) & \"\"","v":"N38"},"F38",{"$f":"INDEX(Turnos_Turno,TURNOS_2021_03[[#This Row],[FILA]],1)","v":"T"},{"$f":"INDEX(Turnos_Turno,TURNOS_2021_03[[#This Row],[FILA]],1)","v":"T"},{"$f":"INDEX(Turnos_Turno,TURNOS_2021_03[[#This Row],[FILA]],1)","v":"T"},{"$f":"INDEX(Turnos_Turno,TURNOS_2021_03[[#This Row],[FILA]],1)","v":"T"},{"$f":"INDEX(Turnos_Turno,TURNOS_2021_03[[#This Row],[FILA]],1)","v":"T"},{"$f":"INDEX(Turnos_Turno,TURNOS_2021_03[[#This Row],[FILA]],1)","v":"T"},{"$f":"INDEX(Turnos_Turno,TURNOS_2021_03[[#This Row],[FILA]],1)","v":"T"},{"$f":"INDEX(Turnos_Turno,TURNOS_2021_03[[#This Row],[FILA]],1)","v":"T"},{"$f":"INDEX(Turnos_Turno,TURNOS_2021_03[[#This Row],[FILA]],1)","v":"T"},{"$f":"INDEX(Turnos_Turno,TURNOS_2021_03[[#This Row],[FILA]],1)","v":"T"},{"$f":"INDEX(Turnos_Turno,TURNOS_2021_03[[#This Row],[FILA]],1)","v":"T"},{"$f":"INDEX(Turnos_Turno,TURNOS_2021_03[[#This Row],[FILA]],1)","v":"T"},{"$f":"INDEX(Turnos_Turno,TURNOS_2021_03[[#This Row],[FILA]],1)","v":"T"},{"$f":"INDEX(Turnos_Turno,TURNOS_2021_03[[#This Row],[FILA]],1)","v":"T"},{"$f":"INDEX(Turnos_Turno,TURNOS_2021_03[[#This Row],[FILA]],1)","v":"T"},{"$f":"INDEX(Turnos_Turno,TURNOS_2021_03[[#This Row],[FILA]],1)","v":"T"},{"$f":"INDEX(Turnos_Turno,TURNOS_2021_03[[#This Row],[FILA]],1)","v":"T"},{"$f":"INDEX(Turnos_Turno,TURNOS_2021_03[[#This Row],[FILA]],1)","v":"T"},{"$f":"INDEX(Turnos_Turno,TURNOS_2021_03[[#This Row],[FILA]],1)","v":"T"},{"$f":"INDEX(Turnos_Turno,TURNOS_2021_03[[#This Row],[FILA]],1)","v":"T"},{"$f":"INDEX(Turnos_Turno,TURNOS_2021_03[[#This Row],[FILA]],1)","v":"T"},{"$f":"INDEX(Turnos_Turno,TURNOS_2021_03[[#This Row],[FILA]],1)","v":"T"},{"$f":"INDEX(Turnos_Turno,TURNOS_2021_03[[#This Row],[FILA]],1)","v":"T"},{"$f":"INDEX(Turnos_Turno,TURNOS_2021_03[[#This Row],[FILA]],1)","v":"T"},{"$f":"INDEX(Turnos_Turno,TURNOS_2021_03[[#This Row],[FILA]],1)","v":"T"},{"$f":"INDEX(Turnos_Turno,TURNOS_2021_03[[#This Row],[FILA]],1)","v":"T"},{"$f":"INDEX(Turnos_Turno,TURNOS_2021_03[[#This Row],[FILA]],1)","v":"T"},{"$f":"INDEX(Turnos_Turno,TURNOS_2021_03[[#This Row],[FILA]],1)","v":"T"},{"$f":"INDEX(Turnos_Turno,TURNOS_2021_03[[#This Row],[FILA]],1)","v":"T"},{"$f":"INDEX(Turnos_Turno,TURNOS_2021_03[[#This Row],[FILA]],1)","v":"T"},{"$f":"INDEX(Turnos_Turno,TURNOS_2021_03[[#This Row],[FILA]],1)","v":"T"}]
[null,{"$f":"MATCH(TURNOS_2021_03[[#This Row],[PERSONAL]],Turnos_Personal,0)","v":39},{"$f":"INDEX(Capacidades_Nombre,MATCH(TURNOS_2021_03[[#This Row],[PERSONAL]],Capacidades_Personal,0),1) & \"\"","v":"N39"},"F39",{"$f":"INDEX(Turnos_Turno,TURNOS_2021_03[[#This Row],[FILA]],1)","v":"T"},{"$f":"INDEX(Turnos_Turno,TURNOS_2021_03[[#This Row],[FILA]],1)","v":"T"},{"$f":"INDEX(Turnos_Turno,TURNOS_2021_03[[#This Row],[FILA]],1)","v":"T"},{"$f":"INDEX(Turnos_Turno,TURNOS_2021_03[[#This Row],[FILA]],1)","v":"T"},{"$f":"INDEX(Turnos_Turno,TURNOS_2021_03[[#This Row],[FILA]],1)","v":"T"},{"$f":"INDEX(Turnos_Turno,TURNOS_2021_03[[#This Row],[FILA]],1)","v":"T"},{"$f":"INDEX(Turnos_Turno,TURNOS_2021_03[[#This Row],[FILA]],1)","v":"T"},{"$f":"INDEX(Turnos_Turno,TURNOS_2021_03[[#This Row],[FILA]],1)","v":"T"},{"$f":"INDEX(Turnos_Turno,TURNOS_2021_03[[#This Row],[FILA]],1)","v":"T"},{"$f":"INDEX(Turnos_Turno,TURNOS_2021_03[[#This Row],[FILA]],1)","v":"T"},{"$f":"INDEX(Turnos_Turno,TURNOS_2021_03[[#This Row],[FILA]],1)","v":"T"},{"$f":"INDEX(Turnos_Turno,TURNOS_2021_03[[#This Row],[FILA]],1)","v":"T"},{"$f":"INDEX(Turnos_Turno,TURNOS_2021_03[[#This Row],[FILA]],1)","v":"T"},{"$f":"INDEX(Turnos_Turno,TURNOS_2021_03[[#This Row],[FILA]],1)","v":"T"},{"$f":"INDEX(Turnos_Turno,TURNOS_2021_03[[#This Row],[FILA]],1)","v":"T"},{"$f":"INDEX(Turnos_Turno,TURNOS_2021_03[[#This Row],[FILA]],1)","v":"T"},{"$f":"INDEX(Turnos_Turno,TURNOS_2021_03[[#This Row],[FILA]],1)","v":"T"},{"$f":"INDEX(Turnos_Turno,TURNOS_2021_03[[#This Row],[FILA]],1)","v":"T"},{"$f":"INDEX(Turnos_Turno,TURNOS_2021_03[[#This Row],[FILA]],1)","v":"T"},{"$f":"INDEX(Turnos_Turno,TURNOS_2021_03[[#This Row],[FILA]],1)","v":"T"},{"$f":"INDEX(Turnos_Turno,TURNOS_2021_03[[#This Row],[FILA]],1)","v":"T"},{"$f":"INDEX(Turnos_Turno,TURNOS_2021_03[[#This Row],[FILA]],1)","v":"T"},{"$f":"INDEX(Turnos_Turno,TURNOS_2021_03[[#This Row],[FILA]],1)","v":"T"},{"$f":"INDEX(Turnos_Turno,TURNOS_2021_03[[#This Row],[FILA]],1)","v":"T"},{"$f":"INDEX(Turnos_Turno,TURNOS_2021_03[[#This Row],[FILA]],1)","v":"T"},{"$f":"INDEX(Turnos_Turno,TURNOS_2021_03[[#This Row],[FILA]],1)","v":"T"},{"$f":"INDEX(Turnos_Turno,TURNOS_2021_03[[#This Row],[FILA]],1)","v":"T"},{"$f":"INDEX(Turnos_Turno,TURNOS_2021_03[[#This Row],[FILA]],1)","v":"T"},{"$f":"INDEX(Turnos_Turno,TURNOS_2021_03[[#This Row],[FILA]],1)","v":"T"},{"$f":"INDEX(Turnos_Turno,TURNOS_2021_03[[#This Row],[FILA]],1)","v":"T"},{"$f":"INDEX(Turnos_Turno,TURNOS_2021_03[[#This Row],[FILA]],1)","v":"T"}]
[null,{"$f":"MATCH(TURNOS_2021_03[[#This Row],[PERSONAL]],Turnos_Personal,0)","v":40},{"$f":"INDEX(Capacidades_Nombre,MATCH(TURNOS_2021_03[[#This Row],[PERSONAL]],Capacidades_Personal,0),1) & \"\"","v":"N40"},"F40",{"$f":"INDEX(Turnos_Turno,TURNOS_2021_03[[#This Row],[FILA]],1)","v":"M"},{"$f":"INDEX(Turnos_Turno,TURNOS_2021_03[[#This Row],[FILA]],1)","v":"M"},{"$f":"INDEX(Turnos_Turno,TURNOS_2021_03[[#This Row],[FILA]],1)","v":"M"},{"$f":"INDEX(Turnos_Turno,TURNOS_2021_03[[#This Row],[FILA]],1)","v":"M"},{"$f":"INDEX(Turnos_Turno,TURNOS_2021_03[[#This Row],[FILA]],1)","v":"M"},{"$f":"INDEX(Turnos_Turno,TURNOS_2021_03[[#This Row],[FILA]],1)","v":"M"},{"$f":"INDEX(Turnos_Turno,TURNOS_2021_03[[#This Row],[FILA]],1)","v":"M"},{"$f":"INDEX(Turnos_Turno,TURNOS_2021_03[[#This Row],[FILA]],1)","v":"M"},{"$f":"INDEX(Turnos_Turno,TURNOS_2021_03[[#This Row],[FILA]],1)","v":"M"},{"$f":"INDEX(Turnos_Turno,TURNOS_2021_03[[#This Row],[FILA]],1)","v":"M"},{"$f":"INDEX(Turnos_Turno,TURNOS_2021_03[[#This Row],[FILA]],1)","v":"M"},{"$f":"INDEX(Turnos_Turno,TURNOS_2021_03[[#This Row],[FILA]],1)","v":"M"},{"$f":"INDEX(Turnos_Turno,TURNOS_2021_03[[#This Row],[FILA]],1)","v":"M"},{"$f":"INDEX(Turnos_Turno,TURNOS_2021_03[[#This Row],[FILA]],1)","v":"M"},{"$f":"INDEX(Turnos_Turno,TURNOS_2021_03[[#This Row],[FILA]],1)","v":"M"},{"$f":"INDEX(Turnos_Turno,TURNOS_2021_03[[#This Row],[FILA]],1)","v":"M"},{"$f":"INDEX(Turnos_Turno,TURNOS_2021_03[[#This Row],[FILA]],1)","v":"M"},{"$f":"INDEX(Turnos_Turno,TURNOS_2021_03[[#This Row],[FILA]],1)","v":"M"},{"$f":"INDEX(Turnos_Turno,TURNOS_2021_03[[#This Row],[FILA]],1)","v":"M"},{"$f":"INDEX(Turnos_Turno,TURNOS_2021_03[[#This Row],[FILA]],1)","v":"M"},{"$f":"INDEX(Turnos_Turno,TURNOS_2021_03[[#This Row],[FILA]],1)","v":"M"},{"$f":"INDEX(Turnos_Turno,TURNOS_2021_03[[#This Row],[FILA]],1)","v":"M"},{"$f":"INDEX(Turnos_Turno,TURNOS_2021_03[[#This Row],[FILA]],1)","v":"M"},{"$f":"INDEX(Turnos_Turno,TURNOS_2021_03[[#This Row],[FILA]],1)","v":"M"},{"$f":"INDEX(Turnos_Turno,TURNOS_2021_03[[#This Row],[FILA]],1)","v":"M"},{"$f":"INDEX(Turnos_Turno,TURNOS_2021_03[[#This Row],[FILA]],1)","v":"M"},{"$f":"INDEX(Turnos_Turno,TURNOS_2021_03[[#This Row],[FILA]],1)","v":"M"},{"$f":"INDEX(Turnos_Turno,TURNOS_2021_03[[#This Row],[FILA]],1)","v":"M"},{"$f":"INDEX(Turnos_Turno,TURNOS_2021_03[[#This Row],[FILA]],1)","v":"M"},{"$f":"INDEX(Turnos_Turno,TURNOS_2021_03[[#This Row],[FILA]],1)","v":"M"},{"$f":"INDEX(Turnos_Turno,TURNOS_2021_03[[#This Row],[FILA]],1)","v":"M"}]
[null,{"$f":"MATCH(TURNOS_2021_03[[#This Row],[PERSONAL]],Turnos_Personal,0)","v":41},{"$f":"INDEX(Capacidades_Nombre,MATCH(TURNOS_2021_03[[#This Row],[PERSONAL]],Capacidades_Personal,0),1) & \"\"","v":"N41"},"F41",{"$f":"INDEX(Turnos_Turno,TURNOS_2021_03[[#This Row],[FILA]],1)","v":"T"},{"$f":"INDEX(Turnos_Turno,TURNOS_2021_03[[#This Row],[FILA]],1)","v":"T"},{"$f":"INDEX(Turnos_Turno,TURNOS_2021_03[[#This Row],[FILA]],1)","v":"T"},{"$f":"INDEX(Turnos_Turno,TURNOS_2021_03[[#This Row],[FILA]],1)","v":"T"},{"$f":"INDEX(Turnos_Turno,TURNOS_2021_03[[#This Row],[FILA]],1)","v":"T"},{"$f":"INDEX(Turnos_Turno,TURNOS_2021_03[[#This Row],[FILA]],1)","v":"T"},{"$f":"INDEX(Turnos_Turno,TURNOS_2021_03[[#This Row],[FILA]],1)","v":"T"},{"$f":"INDEX(Turnos_Turno,TURNOS_2021_03[[#This Row],[FILA]],1)","v":"T"},{"$f":"INDEX(Turnos_Turno,TURNOS_2021_03[[#This Row],[FILA]],1)","v":"T"},{"$f":"INDEX(Turnos_Turno,TURNOS_2021_03[[#This Row],[FILA]],1)","v":"T"},{"$f":"INDEX(Turnos_Turno,TURNOS_2021_03[[#This Row],[FILA]],1)","v":"T"},{"$f":"INDEX(Turnos_Turno,TURNOS_2021_03[[#This Row],[FILA]],1)","v":"T"},{"$f":"INDEX(Turnos_Turno,TURNOS_2021_03[[#This Row],[FILA]],1)","v":"T"},{"$f":"INDEX(Turnos_Turno,TURNOS_2021_03[[#This Row],[FILA]],1)","v":"T"},{"$f":"INDEX(Turnos_Turno,TURNOS_2021_03[[#This Row],[FILA]],1)","v":"T"},{"$f":"INDEX(Turnos_Turno,TURNOS_2021_03[[#This Row],[FILA]],1)","v":"T"},{"$f":"INDEX(Turnos_Turno,TURNOS_2021_03[[#This Row],[FILA]],1)","v":"T"},{"$f":"INDEX(Turnos_Turno,TURNOS_2021_03[[#This Row],[FILA]],1)","v":"T"},{"$f":"INDEX(Turnos_Turno,TURNOS_2021_03[[#This Row],[FILA]],1)","v":"T"},{"$f":"INDEX(Turnos_Turno,TURNOS_2021_03[[#This Row],[FILA]],1)","v":"T"},{"$f":"INDEX(Turnos_Turno,TURNOS_2021_03[[#This Row],[FILA]],1)","v":"T"},{"$f":"INDEX(Turnos_Turno,TURNOS_2021_03[[#This Row],[FILA]],1)","v":"T"},{"$f":"INDEX(Turnos_Turno,TURNOS_2021_03[[#This Row],[FILA]],1)","v":"T"},{"$f":"INDEX(Turnos_Turno,TURNOS_2021_03[[#This Row],[FILA]],1)","v":"T"},{"$f":"INDEX(Turnos_Turno,TURNOS_2021_03[[#This Row],[FILA]],1)","v":"T"},{"$f":"INDEX(Turnos_Turno,TURNOS_2021_03[[#This Row],[FILA]],1)","v":"T"},{"$f":"INDEX(Turnos_Turno,TURNOS_2021_03[[#This Row],[FILA]],1)","v":"T"},{"$f":"INDEX(Turnos_Turno,TURNOS_2021_03[[#This Row],[FILA]],1)","v":"T"},{"$f":"INDEX(Turnos_Turno,TURNOS_2021_03[[#This Row],[FILA]],1)","v":"T"},{"$f":"INDEX(Turnos_Turno,TURNOS_2021_03[[#This Row],[FILA]],1)","v":"T"},{"$f":"INDEX(Turnos_Turno,TURNOS_2021_03[[#This Row],[FILA]],1)","v":"T"}]
[null,{"$f":"MATCH(TURNOS_2021_03[[#This Row],[PERSONAL]],Turnos_Personal,0)","v":42},{"$f":"INDEX(Capacidades_Nombre,MATCH(TURNOS_2021_03[[#This Row],[PERSONAL]],Capacidades_Personal,0),1) & \"\"","v":"N42"},"F42",{"$f":"INDEX(Turnos_Turno,TURNOS_2021_03[[#This Row],[FILA]],1)","v":"T"},{"$f":"INDEX(Turnos_Turno,TURNOS_2021_03[[#This Row],[FILA]],1)","v":"T"},{"$f":"INDEX(Turnos_Turno,TURNOS_2021_03[[#This Row],[FILA]],1)","v":"T"},{"$f":"INDEX(Turnos_Turno,TURNOS_2021_03[[#This Row],[FILA]],1)","v":"T"},{"$f":"INDEX(Turnos_Turno,TURNOS_2021_03[[#This Row],[FILA]],1)","v":"T"},{"$f":"INDEX(Turnos_Turno,TURNOS_2021_03[[#This Row],[FILA]],1)","v":"T"},{"$f":"INDEX(Turnos_Turno,TURNOS_2021_03[[#This Row],[FILA]],1)","v":"T"},{"$f":"INDEX(Turnos_Turno,TURNOS_2021_03[[#This Row],[FILA]],1)","v":"T"},{"$f":"INDEX(Turnos_Turno,TURNOS_2021_03[[#This Row],[FILA]],1)","v":"T"},{"$f":"INDEX(Turnos_Turno,TURNOS_2021_03[[#This Row],[FILA]],1)","v":"T"},{"$f":"INDEX(Turnos_Turno,TURNOS_2021_03[[#This Row],[FILA]],1)","v":"T"},{"$f":"INDEX(Turnos_Turno,TURNOS_2021_03[[#This Row],[FILA]],1)","v":"T"},{"$f":"INDEX(Turnos_Turno,TURNOS_2021_03[[#This Row],[FILA]],1)","v":"T"},{"$f":"INDEX(Turnos_Turno,TURNOS_2021_03[[#This Row],[FILA]],1)","v":"T"},{"$f":"INDEX(Turnos_Turno,TURNOS_2021_03[[#This Row],[FILA]],1)","v":"T"},{"$f":"INDEX(Turnos_Turno,TURNOS_2021_03[[#This Row],[FILA]],1)","v":"T"},{"$f":"INDEX(Turnos_Turno,TURNOS_2021_03[[#This Row],[FILA]],1)","v":"T"},{"$f":"INDEX(Turnos_Turno,TURNOS_2021_03[[#This Row],[FILA]],1)","v":"T"},{"$f":"INDEX(Turnos_Turno,TURNOS_2021_03[[#This Row],[FILA]],1)","v":"T"},{"$f":"INDEX(Turnos_Turno,TURNOS_2021_03[[#This Row],[FILA]],1)","v":"T"},{"$f":"INDEX(Turnos_Turno,TURNOS_2021_03[[#This Row],[FILA]],1)","v":"T"},{"$f":"INDEX(Turnos_Turno,TURNOS_2021_03[[#This Row],[FILA]],1)","v":"T"},{"$f":"INDEX(Turnos_Turno,TURNOS_2021_03[[#This Row],[FILA]],1)","v":"T"},{"$f":"INDEX(Turnos_Turno,TURNOS_2021_03[[#This Row],[FILA]],1)","v":"T"},{"$f":"INDEX(Turnos_Turno,TURNOS_2021_03[[#This Row],[FILA]],1)","v":"T"},{"$f":"INDEX(Turnos_Turno,TURNOS_2021_03[[#This Row],[FILA]],1)","v":"T"},{"$f":"INDEX(Turnos_Turno,TURNOS_2021_03[[#This Row],[FILA]],1)","v":"T"},{"$f":"INDEX(Turnos_Turno,TURNOS_2021_03[[#This Row],[FILA]],1)","v":"T"},{"$f":"INDEX(Turnos_Turno,TURNOS_2021_03[[#This Row],[FILA]],1)","v":"T"},{"$f":"INDEX(Turnos_Turno,TURNOS_2021_03[[#This Row],[FILA]],1)","v":"T"},{"$f":"INDEX(Turnos_Turno,TURNOS_2021_03[[#This Row],[FILA]],1)","v":"T"}]
[null,{"$f":"MATCH(TURNOS_2021_03[[#This Row],[PERSONAL]],Turnos_Personal,0)","v":43},{"$f":"INDEX(Capacidades_Nombre,MATCH(TURNOS_2021_03[[#This Row],[PERSONAL]],Capacidades_Personal,0),1) & \"\"","v":"N43"},"F43",{"$f":"INDEX(Turnos_Turno,TURNOS_2021_03[[#This Row],[FILA]],1)","v":"T"},{"$f":"INDEX(Turnos_Turno,TURNOS_2021_03[[#This Row],[FILA]],1)","v":"T"},{"$f":"INDEX(Turnos_Turno,TURNOS_2021_03[[#This Row],[FILA]],1)","v":"T"},{"$f":"INDEX(Turnos_Turno,TURNOS_2021_03[[#This Row],[FILA]],1)","v":"T"},{"$f":"INDEX(Turnos_Turno,TURNOS_2021_03[[#This Row],[FILA]],1)","v":"T"},{"$f":"INDEX(Turnos_Turno,TURNOS_2021_03[[#This Row],[FILA]],1)","v":"T"},{"$f":"INDEX(Turnos_Turno,TURNOS_2021_03[[#This Row],[FILA]],1)","v":"T"},{"$f":"INDEX(Turnos_Turno,TURNOS_2021_03[[#This Row],[FILA]],1)","v":"T"},{"$f":"INDEX(Turnos_Turno,TURNOS_2021_03[[#This Row],[FILA]],1)","v":"T"},{"$f":"INDEX(Turnos_Turno,TURNOS_2021_03[[#This Row],[FILA]],1)","v":"T"},{"$f":"INDEX(Turnos_Turno,TURNOS_2021_03[[#This Row],[FILA]],1)","v":"T"},{"$f":"INDEX(Turnos_Turno,TURNOS_2021_03[[#This Row],[FILA]],1)","v":"T"},{"$f":"INDEX(Turnos_Turno,TURNOS_2021_03[[#This Row],[FILA]],1)","v":"T"},{"$f":"INDEX(Turnos_Turno,TURNOS_2021_03[[#This Row],[FILA]],1)","v":"T"},{"$f":"INDEX(Turnos_Turno,TURNOS_2021_03[[#This Row],[FILA]],1)","v":"T"},{"$f":"INDEX(Turnos_Turno,TURNOS_2021_03[[#This Row],[FILA]],1)","v":"T"},{"$f":"INDEX(Turnos_Turno,TURNOS_2021_03[[#This Row],[FILA]],1)","v":"T"},{"$f":"INDEX(Turnos_Turno,TURNOS_2021_03[[#This Row],[FILA]],1)","v":"T"},{"$f":"INDEX(Turnos_Turno,TURNOS_2021_03[[#This Row],[FILA]],1)","v":"T"},{"$f":"INDEX(Turnos_Turno,TURNOS_2021_03[[#This Row],[FILA]],1)","v":"T"},{"$f":"INDEX(Turnos_Turno,TURNOS_2021_03[[#This Row],[FILA]],1)","v":"T"},{"$f":"INDEX(Turnos_Turno,TURNOS_2021_03[[#This Row],[FILA]],1)","v":"T"},{"$f":"INDEX(Turnos_Turno,TURNOS_2021_03[[#This Row],[FILA]],1)","v":"T"},{"$f":"INDEX(Turnos_Turno,TURNOS_2021_03[[#This Row],[FILA]],1)","v":"T"},{"$f":"INDEX(Turnos_Turno,TURNOS_2021_03[[#This Row],[FILA]],1)","v":"T"},{"$f":"INDEX(Turnos_Turno,TURNOS_2021_03[[#This Row],[FILA]],1)","v":"T"},{"$f":"INDEX(Turnos_Turno,TURNOS_2021_03[[#This Row],[FILA]],1)","v":"T"},{"$f":"INDEX(Turnos_Turno,TURNOS_2021_03[[#This Row],[FILA]],1)","v":"T"},{"$f":"INDEX(Turnos_Turno,TURNOS_2021_03[[#This Row],[FILA]],1)","v":"T"},{"$f":"INDEX(Turnos_Turno,TURNOS_2021_03[[#This Row],[FILA]],1)","v":"T"},{"$f":"INDEX(Turnos_Turno,TURNOS_2021_03[[#This Row],[FILA]],1)","v":"T"}]
[null,{"$f":"MATCH(TURNOS_2021_03[[#This Row],[PERSONAL]],Turnos_Personal,0)","v":44},{"$f":"INDEX(Capacidades_Nombre,MATCH(TURNOS_2021_03[[#This Row],[PERSONAL]],Capacidades_Personal,0),1) & \"\"","v":"N44"},"F44",{"$f":"INDEX(Turnos_Turno,TURNOS_2021_03[[#This Row],[FILA]],1)","v":"T"},{"$f":"INDEX(Turnos_Turno,TURNOS_2021_03[[#This Row],[FILA]],1)","v":"T"},{"$f":"INDEX(Turnos_Turno,TURNOS_2021_03[[#This Row],[FILA]],1)","v":"T"},{"$f":"INDEX(Turnos_Turno,TURNOS_2021_03[[#This Row],[FILA]],1)","v":"T"},{"$f":"INDEX(Turnos_Turno,TURNOS_2021_03[[#This Row],[FILA]],1)","v":"T"},{"$f":"INDEX(Turnos_Turno,TURNOS_2021_03[[#This Row],[FILA]],1)","v":"T"},{"$f":"INDEX(Turnos_Turno,TURNOS_2021_03[[#This Row],[FILA]],1)","v":"T"},{"$f":"INDEX(Turnos_Turno,TURNOS_2021_03[[#This Row],[FILA]],1)","v":"T"},{"$f":"INDEX(Turnos_Turno,TURNOS_2021_03[[#This Row],[FILA]],1)","v":"T"},{"$f":"INDEX(Turnos_Turno,TURNOS_2021_03[[#This Row],[FILA]],1)","v":"T"},{"$f":"INDEX(Turnos_Turno,TURNOS_2021_03[[#This Row],[FILA]],1)","v":"T"},{"$f":"INDEX(Turnos_Turno,TURNOS_2021_03[[#This Row],[FILA]],1)","v":"T"},{"$f":"INDEX(Turnos_Turno,TURNOS_2021_03[[#This Row],[FILA]],1)","v":"T"},{"$f":"INDEX(Turnos_Turno,TURNOS_2021_03[[#This Row],[FILA]],1)","v":"T"},{"$f":"INDEX(Turnos_Turno,TURNOS_2021_03[[#This Row],[FILA]],1)","v":"T"},{"$f":"INDEX(Turnos_Turno,TURNOS_2021_03[[#This Row],[FILA]],1)","v":"T"},{"$f":"INDEX(Turnos_Turno,TURNOS_2021_03[[#This Row],[FILA]],1)","v":"T"},{"$f":"INDEX(Turnos_Turno,TURNOS_2021_03[[#This Row],[FILA]],1)","v":"T"},{"$f":"INDEX(Turnos_Turno,TURNOS_2021_03[[#This Row],[FILA]],1)","v":"T"},{"$f":"INDEX(Turnos_Turno,TURNOS_2021_03[[#This Row],[FILA]],1)","v":"T"},{"$f":"INDEX(Turnos_Turno,TURNOS_2021_03[[#This Row],[FILA]],1)","v":"T"},{"$f":"INDEX(Turnos_Turno,TURNOS_2021_03[[#This Row],[FILA]],1)","v":"T"},{"$f":"INDEX(Turnos_Turno,TURNOS_2021_03[[#This Row],[FILA]],1)","v":"T"},{"$f":"INDEX(Turnos_Turno,TURNOS_2021_03[[#This Row],[FILA]],1)","v":"T"},{"$f":"INDEX(Turnos_Turno,TURNOS_2021_03[[#This Row],[FILA]],1)","v":"T"},{"$f":"INDEX(Turnos_Turno,TURNOS_2021_03[[#This Row],[FILA]],1)","v":"T"},{"$f":"INDEX(Turnos_Turno,TURNOS_2021_03[[#This Row],[FILA]],1)","v":"T"},{"$f":"INDEX(Turnos_Turno,TURNOS_2021_03[[#This Row],[FILA]],1)","v":"T"},{"$f":"INDEX(Turnos_Turno,TURNOS_2021_03[[#This Row],[FILA]],1)","v":"T"},{"$f":"INDEX(Turnos_Turno,TURNOS_2021_03[[#This Row],[FILA]],1)","v":"T"},{"$f":"INDEX(Turnos_Turno,TURNOS_2021_03[[#This Row],[FILA]],1)","v":"T"}]
[null,{"$f":"MATCH(TURNOS_2021_03[[#This Row],[PERSONAL]],Turnos_Personal,0)","v":45},{"$f":"INDEX(Capacidades_Nombre,MATCH(TURNOS_2021_03[[#This Row],[PERSONAL]],Capacidades_Personal,0),1) & \"\"","v":"N45"},"F45",{"$f":"INDEX(Turnos_Turno,TURNOS_2021_03[[#This Row],[FILA]],1)","v":"T"},{"$f":"INDEX(Turnos_Turno,TURNOS_2021_03[[#This Row],[FILA]],1)","v":"T"},{"$f":"INDEX(Turnos_Turno,TURNOS_2021_03[[#This Row],[FILA]],1)","v":"T"},{"$f":"INDEX(Turnos_Turno,TURNOS_2021_03[[#This Row],[FILA]],1)","v":"T"},{"$f":"INDEX(Turnos_Turno,TURNOS_2021_03[[#This Row],[FILA]],1)","v":"T"},{"$f":"INDEX(Turnos_Turno,TURNOS_2021_03[[#This Row],[FILA]],1)","v":"T"},{"$f":"INDEX(Turnos_Turno,TURNOS_2021_03[[#This Row],[FILA]],1)","v":"T"},{"$f":"INDEX(Turnos_Turno,TURNOS_2021_03[[#This Row],[FILA]],1)","v":"T"},{"$f":"INDEX(Turnos_Turno,TURNOS_2021_03[[#This Row],[FILA]],1)","v":"T"},{"$f":"INDEX(Turnos_Turno,TURNOS_2021_03[[#This Row],[FILA]],1)","v":"T"},{"$f":"INDEX(Turnos_Turno,TURNOS_2021_03[[#This Row],[FILA]],1)","v":"T"},{"$f":"INDEX(Turnos_Turno,TURNOS_2021_03[[#This Row],[FILA]],1)","v":"T"},{"$f":"INDEX(Turnos_Turno,TURNOS_2021_03[[#This Row],[FILA]],1)","v":"T"},{"$f":"INDEX(Turnos_Turno,TURNOS_2021_03[[#This Row],[FILA]],1)","v":"T"},{"$f":"INDEX(Turnos_Turno,TURNOS_2021_03[[#This Row],[FILA]],1)","v":"T"},{"$f":"INDEX(Turnos_Turno,TURNOS_2021_03[[#This Row],[FILA]],1)","v":"T"},{"$f":"INDEX(Turnos_Turno,TURNOS_2021_03[[#This Row],[FILA]],1)","v":"T"},{"$f":"INDEX(Turnos_Turno,TURNOS_2021_03[[#This Row],[FILA]],1)","v":"T"},{"$f":"INDEX(Turnos_Turno,TURNOS_2021_03[[#This Row],[FILA]],1)","v":"T"},{"$f":"INDEX(Turnos_Turno,TURNOS_2021_03[[#This Row],[FILA]],1)","v":"T"},{"$f":"INDEX(Turnos_Turno,TURNOS_2021_03[[#This Row],[FILA]],1)","v":"T"},{"$f":"INDEX(Turnos_Turno,TURNOS_2021_03[[#This Row],[FILA]],1)","v":"T"},{"$f":"INDEX(Turnos_Turno,TURNOS_2021_03[[#This Row],[FILA]],1)","v":"T"},{"$f":"INDEX(Turnos_Turno,TURNOS_2021_03[[#This Row],[FILA]],1)","v":"T"},{"$f":"INDEX(Turnos_Turno,TURNOS_2021_03[[#This Row],[FILA]],1)","v":"T"},{"$f":"INDEX(Turnos_Turno,TURNOS_2021_03[[#This Row],[FILA]],1)","v":"T"},{"$f":"INDEX(Turnos_Turno,TURNOS_2021_03[[#This Row],[FILA]],1)","v":"T"},{"$f":"INDEX(Turnos_Turno,TURNOS_2021_03[[#This Row],[FILA]],1)","v":"T"},{"$f":"INDEX(Turnos_Turno,TURNOS_2021_03[[#This Row],[FILA]],1)","v":"T"},{"$f":"INDEX(Turnos_Turno,TURNOS_2021_03[[#This Row],[FILA]],1)","v":"T"},{"$f":"INDEX(Turnos_Turno,TURNOS_2021_03[[#This Row],[FILA]],1)","v":"T"}]
[null,{"$f":"MATCH(TURNOS_2021_03[[#This Row],[PERSONAL]],Turnos_Personal,0)","v":46},{"$f":"INDEX(Capacidades_Nombre,MATCH(TURNOS_2021_03[[#This Row],[PERSONAL]],Capacidades_Personal,0),1) & \"\"","v":"N46"},"F46",{"$f":"INDEX(Turnos_Turno,TURNOS_2021_03[[#This Row],[FILA]],1)","v":"T"},{"$f":"INDEX(Turnos_Turno,TURNOS_2021_03[[#This Row],[FILA]],1)","v":"T"},{"$f":"INDEX(Turnos_Turno,TURNOS_2021_03[[#This Row],[FILA]],1)","v":"T"},{"$f":"INDEX(Turnos_Turno,TURNOS_2021_03[[#This Row],[FILA]],1)","v":"T"},{"$f":"INDEX(Turnos_Turno,TURNOS_2021_03[[#This Row],[FILA]],1)","v":"T"},{"$f":"INDEX(Turnos_Turno,TURNOS_2021_03[[#This Row],[FILA]],1)","v":"T"},{"$f":"INDEX(Turnos_Turno,TURNOS_2021_03[[#This Row],[FILA]],1)","v":"T"},{"$f":"INDEX(Turnos_Turno,TURNOS_2021_03[[#This Row],[FILA]],1)","v":"T"},{"$f":"INDEX(Turnos_Turno,TURNOS_2021_03[[#This Row],[FILA]],1)","v":"T"},{"$f":"INDEX(Turnos_Turno,TURNOS_2021_03[[#This Row],[FILA]],1)","v":"T"},{"$f":"INDEX(Turnos_Turno,TURNOS_2021_03[[#This Row],[FILA]],1)","v":"T"},{"$f":"INDEX(Turnos_Turno,TURNOS_2021_03[[#This Row],[FILA]],1)","v":"T"},{"$f":"INDEX(Turnos_Turno,TURNOS_2021_03[[#This Row],[FILA]],1)","v":"T"},{"$f":"INDEX(Turnos_Turno,TURNOS_2021_03[[#This Row],[FILA]],1)","v":"T"},{"$f":"INDEX(Turnos_Turno,TURNOS_2021_03[[#This Row],[FILA]],1)","v":"T"},{"$f":"INDEX(Turnos_Turno,TURNOS_2021_03[[#This Row],[FILA]],1)","v":"T"},{"$f":"INDEX(Turnos_Turno,TURNOS_2021_03[[#This Row],[FILA]],1)","v":"T"},{"$f":"INDEX(Turnos_Turno,TURNOS_2021_03[[#This Row],[FILA]],1)","v":"T"},{"$f":"INDEX(Turnos_Turno,TURNOS_2021_03[[#This Row],[FILA]],1)","v":"T"},{"$f":"INDEX(Turnos_Turno,TURNOS_2021_03[[#This Row],[FILA]],1)","v":"T"},{"$f":"INDEX(Turnos_Turno,TURNOS_2021_03[[#This Row],[FILA]],1)","v":"T"},{"$f":"INDEX(Turnos_Turno,TURNOS_2021_03[[#This Row],[FILA]],1)","v":"T"},{"$f":"INDEX(Turnos_Turno,TURNOS_2021_03[[#This Row],[FILA]],1)","v":"T"},{"$f":"INDEX(Turnos_Turno,TURNOS_2021_03[[#This Row],[FILA]],1)","v":"T"},{"$f":"INDEX(Turnos_Turno,TURNOS_2021_03[[#This Row],[FILA]],1)","v":"T"},{"$f":"INDEX(Turnos_Turno,TURNOS_2021_03[[#This Row],[FILA]],1)","v":"T"},{"$f":"INDEX(Turnos_Turno,TURNOS_2021_03[[#This Row],[FILA]],1)","v":"T"},{"$f":"INDEX(Turnos_Turno,TURNOS_2021_03[[#This Row],[FILA]],1)","v":"T"},{"$f":"INDEX(Turnos_Turno,TURNOS_2021_03[[#This Row],[FILA]],1)","v":"T"},{"$f":"INDEX(Turnos_Turno,TURNOS_2021_03[[#This Row],[FILA]],1)","v":"T"},{"$f":"INDEX(Turnos_Turno,TURNOS_2021_03[[#This Row],[FILA]],1)","v":"T"}]
[null,{"$f":"MATCH(TURNOS_2021_03[[#This Row],[PERSONAL]],Turnos_Personal,0)","v":47},{"$f":"INDEX(Capacidades_Nombre,MATCH(TURNOS_2021_03[[#This Row],[PERSONAL]],Capacidades_Personal,0),1) & \"\"","v":"N47"},"F47",{"$f":"INDEX(Turnos_Turno,TURNOS_2021_03[[#This Row],[FILA]],1)","v":"T"},{"$f":"INDEX(Turnos_Turno,TURNOS_2021_03[[#This Row],[FILA]],1)","v":"T"},{"$f":"INDEX(Turnos_Turno,TURNOS_2021_03[[#This Row],[FILA]],1)","v":"T"},{"$f":"INDEX(Turnos_Turno,TURNOS_2021_03[[#This Row],[FILA]],1)","v":"T"},{"$f":"INDEX(Turnos_Turno,TURNOS_2021_03[[#This Row],[FILA]],1)","v":"T"},{"$f":"INDEX(Turnos_Turno,TURNOS_2021_03[[#This Row],[FILA]],1)","v":"T"},{"$f":"INDEX(Turnos_Turno,TURNOS_2021_03[[#This Row],[FILA]],1)","v":"T"},{"$f":"INDEX(Turnos_Turno,TURNOS_2021_03[[#This Row],[FILA]],1)","v":"T"},{"$f":"INDEX(Turnos_Turno,TURNOS_2021_03[[#This Row],[FILA]],1)","v":"T"},{"$f":"INDEX(Turnos_Turno,TURNOS_2021_03[[#This Row],[FILA]],1)","v":"T"},{"$f":"INDEX(Turnos_Turno,TURNOS_2021_03[[#This Row],[FILA]],1)","v":"T"},{"$f":"INDEX(Turnos_Turno,TURNOS_2021_03[[#This Row],[FILA]],1)","v":"T"},{"$f":"INDEX(Turnos_Turno,TURNOS_2021_03[[#This Row],[FILA]],1)","v":"T"},{"$f":"INDEX(Turnos_Turno,TURNOS_2021_03[[#This Row],[FILA]],1)","v":"T"},{"$f":"INDEX(Turnos_Turno,TURNOS_2021_03[[#This Row],[FILA]],1)","v":"T"},{"$f":"INDEX(Turnos_Turno,TURNOS_2021_03[[#This Row],[FILA]],1)","v":"T"},{"$f":"INDEX(Turnos_Turno,TURNOS_2021_03[[#This Row],[FILA]],1)","v":"T"},{"$f":"INDEX(Turnos_Turno,TURNOS_2021_03[[#This Row],[FILA]],1)","v":"T"},{"$f":"INDEX(Turnos_Turno,TURNOS_2021_03[[#This Row],[FILA]],1)","v":"T"},{"$f":"INDEX(Turnos_Turno,TURNOS_2021_03[[#This Row],[FILA]],1)","v":"T"},{"$f":"INDEX(Turnos_Turno,TURNOS_2021_03[[#This Row],[FILA]],1)","v":"T"},{"$f":"INDEX(Turnos_Turno,TURNOS_2021_03[[#This Row],[FILA]],1)","v":"T"},{"$f":"INDEX(Turnos_Turno,TURNOS_2021_03[[#This Row],[FILA]],1)","v":"T"},{"$f":"INDEX(Turnos_Turno,TURNOS_2021_03[[#This Row],[FILA]],1)","v":"T"},{"$f":"INDEX(Turnos_Turno,TURNOS_2021_03[[#This Row],[FILA]],1)","v":"T"},{"$f":"INDEX(Turnos_Turno,TURNOS_2021_03[[#This Row],[FILA]],1)","v":"T"},{"$f":"INDEX(Turnos_Turno,TURNOS_2021_03[[#This Row],[FILA]],1)","v":"T"},{"$f":"INDEX(Turnos_Turno,TURNOS_2021_03[[#This Row],[FILA]],1)","v":"T"},{"$f":"INDEX(Turnos_Turno,TURNOS_2021_03[[#This Row],[FILA]],1)","v":"T"},{"$f":"INDEX(Turnos_Turno,TURNOS_2021_03[[#This Row],[FILA]],1)","v":"T"},{"$f":"INDEX(Turnos_Turno,TURNOS_2021_03[[#This Row],[FILA]],1)","v":"T"}]
[null,{"$f":"MATCH(TURNOS_2021_03[[#This Row],[PERSONAL]],Turnos_Personal,0)","v":48},{"$f":"INDEX(Capacidades_Nombre,MATCH(TURNOS_2021_03[[#This Row],[PERSONAL]],Capacidades_Personal,0),1) & \"\"","v":"N48"},"F48",{"$f":"INDEX(Turnos_Turno,TURNOS_2021_03[[#This Row],[FILA]],1)","v":"T"},{"$f":"INDEX(Turnos_Turno,TURNOS_2021_03[[#This Row],[FILA]],1)","v":"T"},{"$f":"INDEX(Turnos_Turno,TURNOS_2021_03[[#This Row],[FILA]],1)","v":"T"},{"$f":"INDEX(Turnos_Turno,TURNOS_2021_03[[#This Row],[FILA]],1)","v":"T"},{"$f":"INDEX(Turnos_Turno,TURNOS_2021_03[[#This Row],[FILA]],1)","v":"T"},{"$f":"INDEX(Turnos_Turno,TURNOS_2021_03[[#This Row],[FILA]],1)","v":"T"},{"$f":"INDEX(Turnos_Turno,TURNOS_2021_03[[#This Row],[FILA]],1)","v":"T"},{"$f":"INDEX(Turnos_Turno,TURNOS_2021_03[[#This Row],[FILA]],1)","v":"T"},{"$f":"INDEX(Turnos_Turno,TURNOS_2021_03[[#This Row],[FILA]],1)","v":"T"},{"$f":"INDEX(Turnos_Turno,TURNOS_2021_03[[#This Row],[FILA]],1)","v":"T"},{"$f":"INDEX(Turnos_Turno,TURNOS_2021_03[[#This Row],[FILA]],1)","v":"T"},{"$f":"INDEX(Turnos_Turno,TURNOS_2021_03[[#This Row],[FILA]],1)","v":"T"},{"$f":"INDEX(Turnos_Turno,TURNOS_2021_03[[#This Row],[FILA]],1)","v":"T"},{"$f":"INDEX(Turnos_Turno,TURNOS_2021_03[[#This Row],[FILA]],1)","v":"T"},{"$f":"INDEX(Turnos_Turno,TURNOS_2021_03[[#This Row],[FILA]],1)","v":"T"},{"$f":"INDEX(Turnos_Turno,TURNOS_2021_03[[#This Row],[FILA]],1)","v":"T"},{"$f":"INDEX(Turnos_Turno,TURNOS_2021_03[[#This Row],[FILA]],1)","v":"T"},{"$f":"INDEX(Turnos_Turno,TURNOS_2021_03[[#This Row],[FILA]],1)","v":"T"},{"$f":"INDEX(Turnos_Turno,TURNOS_2021_03[[#This Row],[FILA]],1)","v":"T"},{"$f":"INDEX(Turnos_Turno,TURNOS_2021_03[[#This Row],[FILA]],1)","v":"T"},{"$f":"INDEX(Turnos_Turno,TURNOS_2021_03[[#This Row],[FILA]],1)","v":"T"},{"$f":"INDEX(Turnos_Turno,TURNOS_2021_03[[#This Row],[FILA]],1)","v":"T"},{"$f":"INDEX(Turnos_Turno,TURNOS_2021_03[[#This Row],[FILA]],1)","v":"T"},{"$f":"INDEX(Turnos_Turno,TURNOS_2021_03[[#This Row],[FILA]],1)","v":"T"},{"$f":"INDEX(Turnos_Turno,TURNOS_2021_03[[#This Row],[FILA]],1)","v":"T"},{"$f":"INDEX(Turnos_Turno,TURNOS_2021_03[[#This Row],[FILA]],1)","v":"T"},{"$f":"INDEX(Turnos_Turno,TURNOS_2021_03[[#This Row],[FILA]],1)","v":"T"},{"$f":"INDEX(Turnos_Turno,TURNOS_2021_03[[#This Row],[FILA]],1)","v":"T"},{"$f":"INDEX(Turnos_Turno,TURNOS_2021_03[[#This Row],[FILA]],1)","v":"T"},{"$f":"INDEX(Turnos_Turno,TURNOS_2021_03[[#This Row],[FILA]],1)","v":"T"},{"$f":"INDEX(Turnos_Turno,TURNOS_2021_03[[#This Row],[FILA]],1)","v":"T"}]
[null,{"$f":"MATCH(TURNOS_2021_03[[#This Row],[PERSONAL]],Turnos_Personal,0)","v":49},{"$f":"INDEX(Capacidades_Nombre,MATCH(TURNOS_2021_03[[#This Row],[PERSONAL]],Capacidades_Personal,0),1) & \"\"","v":"N49"},"F49",{"$f":"INDEX(Turnos_Turno,TURNOS_2021_03[[#This Row],[FILA]],1)","v":"M"},{"$f":"INDEX(Turnos_Turno,TURNOS_2021_03[[#This Row],[FILA]],1)","v":"M"},{"$f":"INDEX(Turnos_Turno,TURNOS_2021_03[[#This Row],[FILA]],1)","v":"M"},{"$f":"INDEX(Turnos_Turno,TURNOS_2021_03[[#This Row],[FILA]],1)","v":"M"},{"$f":"INDEX(Turnos_Turno,TURNOS_2021_03[[#This Row],[FILA]],1)","v":"M"},{"$f":"INDEX(Turnos_Turno,TURNOS_2021_03[[#This Row],[FILA]],1)","v":"M"},{"$f":"INDEX(Turnos_Turno,TURNOS_2021_03[[#This Row],[FILA]],1)","v":"M"},{"$f":"INDEX(Turnos_Turno,TURNOS_2021_03[[#This Row],[FILA]],1)","v":"M"},{"$f":"INDEX(Turnos_Turno,TURNOS_2021_03[[#This Row],[FILA]],1)","v":"M"},{"$f":"INDEX(Turnos_Turno,TURNOS_2021_03[[#This Row],[FILA]],1)","v":"M"},{"$f":"INDEX(Turnos_Turno,TURNOS_2021_03[[#This Row],[FILA]],1)","v":"M"},{"$f":"INDEX(Turnos_Turno,TURNOS_2021_03[[#This Row],[FILA]],1)","v":"M"},{"$f":"INDEX(Turnos_Turno,TURNOS_2021_03[[#This Row],[FILA]],1)","v":"M"},{"$f":"INDEX(Turnos_Turno,TURNOS_2021_03[[#This Row],[FILA]],1)","v":"M"},{"$f":"INDEX(Turnos_Turno,TURNOS_2021_03[[#This Row],[FILA]],1)","v":"M"},{"$f":"INDEX(Turnos_Turno,TURNOS_2021_03[[#This Row],[FILA]],1)","v":"M"},{"$f":"INDEX(Turnos_Turno,TURNOS_2021_03[[#This Row],[FILA]],1)","v":"M"},{"$f":"INDEX(Turnos_Turno,TURNOS_2021_03[[#This Row],[FILA]],1)","v":"M"},{"$f":"INDEX(Turnos_Turno,TURNOS_2021_03[[#This Row],[FILA]],1)","v":"M"},{"$f":"INDEX(Turnos_Turno,TURNOS_2021_03[[#This Row],[FILA]],1)","v":"M"},{"$f":"INDEX(Turnos_Turno,TURNOS_2021_03[[#This Row],[FILA]],1)","v":"M"},{"$f":"INDEX(Turnos_Turno,TURNOS_2021_03[[#This Row],[FILA]],1)","v":"M"},{"$f":"INDEX(Turnos_Turno,TURNOS_2021_03[[#This Row],[FILA]],1)","v":"M"},{"$f":"INDEX(Turnos_Turno,TURNOS_2021_03[[#This Row],[FILA]],1)","v":"M"},{"$f":"INDEX(Turnos_Turno,TURNOS_2021_03[[#This Row],[FILA]],1)","v":"M"},{"$f":"INDEX(Turnos_Turno,TURNOS_2021_03[[#This Row],[FILA]],1)","v":"M"},{"$f":"INDEX(Turnos_Turno,TURNOS_2021_03[[#This Row],[FILA]],1)","v":"M"},{"$f":"INDEX(Turnos_Turno,TURNOS_2021_03[[#This Row],[FILA]],1)","v":"M"},{"$f":"INDEX(Turnos_Turno,TURNOS_2021_03[[#This Row],[FILA]],1)","v":"M"},{"$f":"INDEX(Turnos_Turno,TURNOS_2021_03[[#This Row],[FILA]],1)","v":"M"},{"$f":"INDEX(Turnos_Turno,TURNOS_2021_03[[#This Row],[FILA]],1)","v":"M"}]
[null,{"$f":"MATCH(TURNOS_2021_03[[#This Row],[PERSONAL]],Turnos_Personal,0)","v":50},{"$f":"INDEX(Capacidades_Nombre,MATCH(TURNOS_2021_03[[#This Row],[PERSONAL]],Capacidades_Personal,0),1) & \"\"","v":"N50"},"F50",{"$f":"INDEX(Turnos_Turno,TURNOS_2021_03[[#This Row],[FILA]],1)","v":"M"},{"$f":"INDEX(Turnos_Turno,TURNOS_2021_03[[#This Row],[FILA]],1)","v":"M"},{"$f":"INDEX(Turnos_Turno,TURNOS_2021_03[[#This Row],[FILA]],1)","v":"M"},{"$f":"INDEX(Turnos_Turno,TURNOS_2021_03[[#This Row],[FILA]],1)","v":"M"},{"$f":"INDEX(Turnos_Turno,TURNOS_2021_03[[#This Row],[FILA]],1)","v":"M"},{"$f":"INDEX(Turnos_Turno,TURNOS_2021_03[[#This Row],[FILA]],1)","v":"M"},{"$f":"INDEX(Turnos_Turno,TURNOS_2021_03[[#This Row],[FILA]],1)","v":"M"},{"$f":"INDEX(Turnos_Turno,TURNOS_2021_03[[#This Row],[FILA]],1)","v":"M"},{"$f":"INDEX(Turnos_Turno,TURNOS_2021_03[[#This Row],[FILA]],1)","v":"M"},{"$f":"INDEX(Turnos_Turno,TURNOS_2021_03[[#This Row],[FILA]],1)","v":"M"},{"$f":"INDEX(Turnos_Turno,TURNOS_2021_03[[#This Row],[FILA]],1)","v":"M"},{"$f":"INDEX(Turnos_Turno,TURNOS_2021_03[[#This Row],[FILA]],1)","v":"M"},{"$f":"INDEX(Turnos_Turno,TURNOS_2021_03[[#This Row],[FILA]],1)","v":"M"},{"$f":"INDEX(Turnos_Turno,TURNOS_2021_03[[#This Row],[FILA]],1)","v":"M"},{"$f":"INDEX(Turnos_Turno,TURNOS_2021_03[[#This Row],[FILA]],1)","v":"M"},{"$f":"INDEX(Turnos_Turno,TURNOS_2021_03[[#This Row],[FILA]],1)","v":"M"},{"$f":"INDEX(Turnos_Turno,TURNOS_2021_03[[#This Row],[FILA]],1)","v":"M"},{"$f":"INDEX(Turnos_Turno,TURNOS_2021_03[[#This Row],[FILA]],1)","v":"M"},{"$f":"INDEX(Turnos_Turno,TURNOS_2021_03[[#This Row],[FILA]],1)","v":"M"},{"$f":"INDEX(Turnos_Turno,TURNOS_2021_03[[#This Row],[FILA]],1)","v":"M"},{"$f":"INDEX(Turnos_Turno,TURNOS_2021_03[[#This Row],[FILA]],1)","v":"M"},{"$f":"INDEX(Turnos_Turno,TURNOS_2021_03[[#This Row],[FILA]],1)","v":"M"},{"$f":"INDEX(Turnos_Turno,TURNOS_2021_03[[#This Row],[FILA]],1)","v":"M"},{"$f":"INDEX(Turnos_Turno,TURNOS_2021_03[[#This Row],[FILA]],1)","v":"M"},{"$f":"INDEX(Turnos_Turno,TURNOS_2021_03[[#This Row],[FILA]],1)","v":"M"},{"$f":"INDEX(Turnos_Turno,TURNOS_2021_03[[#This Row],[FILA]],1)","v":"M"},{"$f":"INDEX(Turnos_Turno,TURNOS_2021_03[[#This Row],[FILA]],1)","v":"M"},{"$f":"INDEX(Turnos_Turno,TURNOS_2021_03[[#This Row],[FILA]],1)","v":"M"},{"$f":"INDEX(Turnos_Turno,TURNOS_2021_03[[#This Row],[FILA]],1)","v":"M"},{"$f":"INDEX(Turnos_Turno,TURNOS_2021_03[[#This Row],[FILA]],1)","v":"M"},{"$f":"INDEX(Turnos_Turno,TURNOS_2021_03[[#This Row],[FILA]],1)","v":"M"}]
[null,{"$f":"MATCH(TURNOS_2021_03[[#This Row],[PERSONAL]],Turnos_Personal,0)","v":51},{"$f":"INDEX(Capacidades_Nombre,MATCH(TURNOS_2021_03[[#This Row],[PERSONAL]],Capacidades_Personal,0),1) & \"\"","v":"N51"},"F51",{"$f":"INDEX(Turnos_Turno,TURNOS_2021_03[[#This Row],[FILA]],1)","v":"M"},{"$f":"INDEX(Turnos_Turno,TURNOS_2021_03[[#This Row],[FILA]],1)","v":"M"},{"$f":"INDEX(Turnos_Turno,TURNOS_2021_03[[#This Row],[FILA]],1)","v":"M"},{"$f":"INDEX(Turnos_Turno,TURNOS_2021_03[[#This Row],[FILA]],1)","v":"M"},{"$f":"INDEX(Turnos_Turno,TURNOS_2021_03[[#This Row],[FILA]],1)","v":"M"},{"$f":"INDEX(Turnos_Turno,TURNOS_2021_03[[#This Row],[FILA]],1)","v":"M"},{"$f":"INDEX(Turnos_Turno,TURNOS_2021_03[[#This Row],[FILA]],1)","v":"M"},{"$f":"INDEX(Turnos_Turno,TURNOS_2021_03[[#This Row],[FILA]],1)","v":"M"},{"$f":"INDEX(Turnos_Turno,TURNOS_2021_03[[#This Row],[FILA]],1)","v":"M"},{"$f":"INDEX(Turnos_Turno,TURNOS_2021_03[[#This Row],[FILA]],1)","v":"M"},{"$f":"INDEX(Turnos_Turno,TURNOS_2021_03[[#This Row],[FILA]],1)","v":"M"},{"$f":"INDEX(Turnos_Turno,TURNOS_2021_03[[#This Row],[FILA]],1)","v":"M"},{"$f":"INDEX(Turnos_Turno,TURNOS_2021_03[[#This Row],[FILA]],1)","v":"M"},{"$f":"INDEX(Turnos_Turno,TURNOS_2021_03[[#This Row],[FILA]],1)","v":"M"},{"$f":"INDEX(Turnos_Turno,TURNOS_2021_03[[#This Row],[FILA]],1)","v":"M"},{"$f":"INDEX(Turnos_Turno,TURNOS_2021_03[[#This Row],[FILA]],1)","v":"M"},{"$f":"INDEX(Turnos_Turno,TURNOS_2021_03[[#This Row],[FILA]],1)","v":"M"},{"$f":"INDEX(Turnos_Turno,TURNOS_2021_03[[#This Row],[FILA]],1)","v":"M"},{"$f":"INDEX(Turnos_Turno,TURNOS_2021_03[[#This Row],[FILA]],1)","v":"M"},{"$f":"INDEX(Turnos_Turno,TURNOS_2021_03[[#This Row],[FILA]],1)","v":"M"},{"$f":"INDEX(Turnos_Turno,TURNOS_2021_03[[#This Row],[FILA]],1)","v":"M"},{"$f":"INDEX(Turnos_Turno,TURNOS_2021_03[[#This Row],[FILA]],1)","v":"M"},{"$f":"INDEX(Turnos_Turno,TURNOS_2021_03[[#This Row],[FILA]],1)","v":"M"},{"$f":"INDEX(Turnos_Turno,TURNOS_2021_03[[#This Row],[FILA]],1)","v":"M"},{"$f":"INDEX(Turnos_Turno,TURNOS_2021_03[[#This Row],[FILA]],1)","v":"M"},{"$f":"INDEX(Turnos_Turno,TURNOS_2021_03[[#This Row],[FILA]],1)","v":"M"},{"$f":"INDEX(Turnos_Turno,TURNOS_2021_03[[#This Row],[FILA]],1)","v":"M"},{"$f":"INDEX(Turnos_Turno,TURNOS_2021_03[[#This Row],[FILA]],1)","v":"M"},{"$f":"INDEX(Turnos_Turno,TURNOS_2021_03[[#This Row],[FILA]],1)","v":"M"},{"$f":"INDEX(Turnos_Turno,TURNOS_2021_03[[#This Row],[FILA]],1)","v":"M"},{"$f":"INDEX(Turnos_Turno,TURNOS_2021_03[[#This Row],[FILA]],1)","v":"M"}]
[null,{"$f":"MATCH(TURNOS_2021_03[[#This Row],[PERSONAL]],Turnos_Personal,0)","v":52},{"$f":"INDEX(Capacidades_Nombre,MATCH(TURNOS_2021_03[[#This Row],[PERSONAL]],Capacidades_Personal,0),1) & \"\"","v":"N52"},"F52",{"$f":"INDEX(Turnos_Turno,TURNOS_2021_03[[#This Row],[FILA]],1)","v":"M"},{"$f":"INDEX(Turnos_Turno,TURNOS_2021_03[[#This Row],[FILA]],1)","v":"M"},{"$f":"INDEX(Turnos_Turno,TURNOS_2021_03[[#This Row],[FILA]],1)","v":"M"},{"$f":"INDEX(Turnos_Turno,TURNOS_2021_03[[#This Row],[FILA]],1)","v":"M"},{"$f":"INDEX(Turnos_Turno,TURNOS_2021_03[[#This Row],[FILA]],1)","v":"M"},{"$f":"INDEX(Turnos_Turno,TURNOS_2021_03[[#This Row],[FILA]],1)","v":"M"},{"$f":"INDEX(Turnos_Turno,TURNOS_2021_03[[#This Row],[FILA]],1)","v":"M"},{"$f":"INDEX(Turnos_Turno,TURNOS_2021_03[[#This Row],[FILA]],1)","v":"M"},{"$f":"INDEX(Turnos_Turno,TURNOS_2021_03[[#This Row],[FILA]],1)","v":"M"},{"$f":"INDEX(Turnos_Turno,TURNOS_2021_03[[#This Row],[FILA]],1)","v":"M"},{"$f":"INDEX(Turnos_Turno,TURNOS_2021_03[[#This Row],[FILA]],1)","v":"M"},{"$f":"INDEX(Turnos_Turno,TURNOS_2021_03[[#This Row],[FILA]],1)","v":"M"},{"$f":"INDEX(Turnos_Turno,TURNOS_2021_03[[#This Row],[FILA]],1)","v":"M"},{"$f":"INDEX(Turnos_Turno,TURNOS_2021_03[[#This Row],[FILA]],1)","v":"M"},{"$f":"INDEX(Turnos_Turno,TURNOS_2021_03[[#This Row],[FILA]],1)","v":"M"},{"$f":"INDEX(Turnos_Turno,TURNOS_2021_03[[#This Row],[FILA]],1)","v":"M"},{"$f":"INDEX(Turnos_Turno,TURNOS_2021_03[[#This Row],[FILA]],1)","v":"M"},{"$f":"INDEX(Turnos_Turno,TURNOS_2021_03[[#This Row],[FILA]],1)","v":"M"},{"$f":"INDEX(Turnos_Turno,TURNOS_2021_03[[#This Row],[FILA]],1)","v":"M"},{"$f":"INDEX(Turnos_Turno,TURNOS_2021_03[[#This Row],[FILA]],1)","v":"M"},{"$f":"INDEX(Turnos_Turno,TURNOS_2021_03[[#This Row],[FILA]],1)","v":"M"},{"$f":"INDEX(Turnos_Turno,TURNOS_2021_03[[#This Row],[FILA]],1)","v":"M"},{"$f":"INDEX(Turnos_Turno,TURNOS_2021_03[[#This Row],[FILA]],1)","v":"M"},{"$f":"INDEX(Turnos_Turno,TURNOS_2021_03[[#This Row],[FILA]],1)","v":"M"},{"$f":"INDEX(Turnos_Turno,TURNOS_2021_03[[#This Row],[FILA]],1)","v":"M"},{"$f":"INDEX(Turnos_Turno,TURNOS_2021_03[[#This Row],[FILA]],1)","v":"M"},{"$f":"INDEX(Turnos_Turno,TURNOS_2021_03[[#This Row],[FILA]],1)","v":"M"},{"$f":"INDEX(Turnos_Turno,TURNOS_2021_03[[#This Row],[FILA]],1)","v":"M"},{"$f":"INDEX(Turnos_Turno,TURNOS_2021_03[[#This Row],[FILA]],1)","v":"M"},{"$f":"INDEX(Turnos_Turno,TURNOS_2021_03[[#This Row],[FILA]],1)","v":"M"},{"$f":"INDEX(Turnos_Turno,TURNOS_2021_03[[#This Row],[FILA]],1)","v":"M"}]
[null,{"$f":"MATCH(TURNOS_2021_03[[#This Row],[PERSONAL]],Turnos_Personal,0)","v":53},{"$f":"INDEX(Capacidades_Nombre,MATCH(TURNOS_2021_03[[#This Row],[PERSONAL]],Capacidades_Personal,0),1) & \"\"","v":"N53"},"F53",{"$f":"INDEX(Turnos_Turno,TURNOS_2021_03[[#This Row],[FILA]],1)","v":"M"},{"$f":"INDEX(Turnos_Turno,TURNOS_2021_03[[#This Row],[FILA]],1)","v":"M"},{"$f":"INDEX(Turnos_Turno,TURNOS_2021_03[[#This Row],[FILA]],1)","v":"M"},{"$f":"INDEX(Turnos_Turno,TURNOS_2021_03[[#This Row],[FILA]],1)","v":"M"},{"$f":"INDEX(Turnos_Turno,TURNOS_2021_03[[#This Row],[FILA]],1)","v":"M"},{"$f":"INDEX(Turnos_Turno,TURNOS_2021_03[[#This Row],[FILA]],1)","v":"M"},{"$f":"INDEX(Turnos_Turno,TURNOS_2021_03[[#This Row],[FILA]],1)","v":"M"},{"$f":"INDEX(Turnos_Turno,TURNOS_2021_03[[#This Row],[FILA]],1)","v":"M"},{"$f":"INDEX(Turnos_Turno,TURNOS_2021_03[[#This Row],[FILA]],1)","v":"M"},{"$f":"INDEX(Turnos_Turno,TURNOS_2021_03[[#This Row],[FILA]],1)","v":"M"},{"$f":"INDEX(Turnos_Turno,TURNOS_2021_03[[#This Row],[FILA]],1)","v":"M"},{"$f":"INDEX(Turnos_Turno,TURNOS_2021_03[[#This Row],[FILA]],1)","v":"M"},{"$f":"INDEX(Turnos_Turno,TURNOS_2021_03[[#This Row],[FILA]],1)","v":"M"},{"$f":"INDEX(Turnos_Turno,TURNOS_2021_03[[#This Row],[FILA]],1)","v":"M"},{"$f":"INDEX(Turnos_Turno,TURNOS_2021_03[[#This Row],[FILA]],1)","v":"M"},{"$f":"INDEX(Turnos_Turno,TURNOS_2021_03[[#This Row],[FILA]],1)","v":"M"},{"$f":"INDEX(Turnos_Turno,TURNOS_2021_03[[#This Row],[FILA]],1)","v":"M"},{"$f":"INDEX(Turnos_Turno,TURNOS_2021_03[[#This Row],[FILA]],1)","v":"M"},{"$f":"INDEX(Turnos_Turno,TURNOS_2021_03[[#This Row],[FILA]],1)","v":"M"},{"$f":"INDEX(Turnos_Turno,TURNOS_2021_03[[#This Row],[FILA]],1)","v":"M"},{"$f":"INDEX(Turnos_Turno,TURNOS_2021_03[[#This Row],[FILA]],1)","v":"M"},{"$f":"INDEX(Turnos_Turno,TURNOS_2021_03[[#This Row],[FILA]],1)","v":"M"},{"$f":"INDEX(Turnos_Turno,TURNOS_2021_03[[#This Row],[FILA]],1)","v":"M"},{"$f":"INDEX(Turnos_Turno,TURNOS_2021_03[[#This Row],[FILA]],1)","v":"M"},{"$f":"INDEX(Turnos_Turno,TURNOS_2021_03[[#This Row],[FILA]],1)","v":"M"},{"$f":"INDEX(Turnos_Turno,TURNOS_2021_03[[#This Row],[FILA]],1)","v":"M"},{"$f":"INDEX(Turnos_Turno,TURNOS_2021_03[[#This Row],[FILA]],1)","v":"M"},{"$f":"INDEX(Turnos_Turno,TURNOS_2021_03[[#This Row],[FILA]],1)","v":"M"},{"$f":"INDEX(Turnos_Turno,TURNOS_2021_03[[#This Row],[FILA]],1)","v":"M"},{"$f":"INDEX(Turnos_Turno,TURNOS_2021_03[[#This Row],[FILA]],1)","v":"M"},{"$f":"INDEX(Turnos_Turno,TURNOS_2021_03[[#This Row],[FILA]],1)","v":"M"}]
[null,{"$f":"MATCH(TURNOS_2021_03[[#This Row],[PERSONAL]],Turnos_Personal,0)","v":54},{"$f":"INDEX(Capacidades_Nombre,MATCH(TURNOS_2021_03[[#This Row],[PERSONAL]],Capacidades_Personal,0),1) & \"\"","v":"N54"},"F54",{"$f":"INDEX(Turnos_Turno,TURNOS_2021_03[[#This Row],[FILA]],1)","v":"M"},{"$f":"INDEX(Turnos_Turno,TURNOS_2021_03[[#This Row],[FILA]],1)","v":"M"},{"$f":"INDEX(Turnos_Turno,TURNOS_2021_03[[#This Row],[FILA]],1)","v":"M"},{"$f":"INDEX(Turnos_Turno,TURNOS_2021_03[[#This Row],[FILA]],1)","v":"M"},{"$f":"INDEX(Turnos_Turno,TURNOS_2021_03[[#This Row],[FILA]],1)","v":"M"},{"$f":"INDEX(Turnos_Turno,TURNOS_2021_03[[#This Row],[FILA]],1)","v":"M"},{"$f":"INDEX(Turnos_Turno,TURNOS_2021_03[[#This Row],[FILA]],1)","v":"M"},{"$f":"INDEX(Turnos_Turno,TURNOS_2021_03[[#This Row],[FILA]],1)","v":"M"},{"$f":"INDEX(Turnos_Turno,TURNOS_2021_03[[#This Row],[FILA]],1)","v":"M"},{"$f":"INDEX(Turnos_Turno,TURNOS_2021_03[[#This Row],[FILA]],1)","v":"M"},{"$f":"INDEX(Turnos_Turno,TURNOS_2021_03[[#This Row],[FILA]],1)","v":"M"},{"$f":"INDEX(Turnos_Turno,TURNOS_2021_03[[#This Row],[FILA]],1)","v":"M"},{"$f":"INDEX(Turnos_Turno,TURNOS_2021_03[[#This Row],[FILA]],1)","v":"M"},{"$f":"INDEX(Turnos_Turno,TURNOS_2021_03[[#This Row],[FILA]],1)","v":"M"},{"$f":"INDEX(Turnos_Turno,TURNOS_2021_03[[#This Row],[FILA]],1)","v":"M"},{"$f":"INDEX(Turnos_Turno,TURNOS_2021_03[[#This Row],[FILA]],1)","v":"M"},{"$f":"INDEX(Turnos_Turno,TURNOS_2021_03[[#This Row],[FILA]],1)","v":"M"},{"$f":"INDEX(Turnos_Turno,TURNOS_2021_03[[#This Row],[FILA]],1)","v":"M"},{"$f":"INDEX(Turnos_Turno,TURNOS_2021_03[[#This Row],[FILA]],1)","v":"M"},{"$f":"INDEX(Turnos_Turno,TURNOS_2021_03[[#This Row],[FILA]],1)","v":"M"},{"$f":"INDEX(Turnos_Turno,TURNOS_2021_03[[#This Row],[FILA]],1)","v":"M"},{"$f":"INDEX(Turnos_Turno,TURNOS_2021_03[[#This Row],[FILA]],1)","v":"M"},{"$f":"INDEX(Turnos_Turno,TURNOS_2021_03[[#This Row],[FILA]],1)","v":"M"},{"$f":"INDEX(Turnos_Turno,TURNOS_2021_03[[#This Row],[FILA]],1)","v":"M"},{"$f":"INDEX(Turnos_Turno,TURNOS_2021_03[[#This Row],[FILA]],1)","v":"M"},{"$f":"INDEX(Turnos_Turno,TURNOS_2021_03[[#This Row],[FILA]],1)","v":"M"},{"$f":"INDEX(Turnos_Turno,TURNOS_2021_03[[#This Row],[FILA]],1)","v":"M"},{"$f":"INDEX(Turnos_Turno,TURNOS_2021_03[[#This Row],[FILA]],1)","v":"M"},{"$f":"INDEX(Turnos_Turno,TURNOS_2021_03[[#This Row],[FILA]],1)","v":"M"},{"$f":"INDEX(Turnos_Turno,TURNOS_2021_03[[#This Row],[FILA]],1)","v":"M"},{"$f":"INDEX(Turnos_Turno,TURNOS_2021_03[[#This Row],[FILA]],1)","v":"M"}]
[null,{"$f":"MATCH(TURNOS_2021_03[[#This Row],[PERSONAL]],Turnos_Personal,0)","v":55},{"$f":"INDEX(Capacidades_Nombre,MATCH(TURNOS_2021_03[[#This Row],[PERSONAL]],Capacidades_Personal,0),1) & \"\"","v":"N55"},"F55",{"$f":"INDEX(Turnos_Turno,TURNOS_2021_03[[#This Row],[FILA]],1)","v":"M"},{"$f":"INDEX(Turnos_Turno,TURNOS_2021_03[[#This Row],[FILA]],1)","v":"M"},{"$f":"INDEX(Turnos_Turno,TURNOS_2021_03[[#This Row],[FILA]],1)","v":"M"},{"$f":"INDEX(Turnos_Turno,TURNOS_2021_03[[#This Row],[FILA]],1)","v":"M"},{"$f":"INDEX(Turnos_Turno,TURNOS_2021_03[[#This Row],[FILA]],1)","v":"M"},{"$f":"INDEX(Turnos_Turno,TURNOS_2021_03[[#This Row],[FILA]],1)","v":"M"},{"$f":"INDEX(Turnos_Turno,TURNOS_2021_03[[#This Row],[FILA]],1)","v":"M"},{"$f":"INDEX(Turnos_Turno,TURNOS_2021_03[[#This Row],[FILA]],1)","v":"M"},{"$f":"INDEX(Turnos_Turno,TURNOS_2021_03[[#This Row],[FILA]],1)","v":"M"},{"$f":"INDEX(Turnos_Turno,TURNOS_2021_03[[#This Row],[FILA]],1)","v":"M"},{"$f":"INDEX(Turnos_Turno,TURNOS_2021_03[[#This Row],[FILA]],1)","v":"M"},{"$f":"INDEX(Turnos_Turno,TURNOS_2021_03[[#This Row],[FILA]],1)","v":"M"},{"$f":"INDEX(Turnos_Turno,TURNOS_2021_03[[#This Row],[FILA]],1)","v":"M"},{"$f":"INDEX(Turnos_Turno,TURNOS_2021_03[[#This Row],[FILA]],1)","v":"M"},{"$f":"INDEX(Turnos_Turno,TURNOS_2021_03[[#This Row],[FILA]],1)","v":"M"},{"$f":"INDEX(Turnos_Turno,TURNOS_2021_03[[#This Row],[FILA]],1)","v":"M"},{"$f":"INDEX(Turnos_Turno,TURNOS_2021_03[[#This Row],[FILA]],1)","v":"M"},{"$f":"INDEX(Turnos_Turno,TURNOS_2021_03[[#This Row],[FILA]],1)","v":"M"},{"$f":"INDEX(Turnos_Turno,TURNOS_2021_03[[#This Row],[FILA]],1)","v":"M"},{"$f":"INDEX(Turnos_Turno,TURNOS_2021_03[[#This Row],[FILA]],1)","v":"M"},{"$f":"INDEX(Turnos_Turno,TURNOS_2021_03[[#This Row],[FILA]],1)","v":"M"},{"$f":"INDEX(Turnos_Turno,TURNOS_2021_03[[#This Row],[FILA]],1)","v":"M"},{"$f":"INDEX(Turnos_Turno,TURNOS_2021_03[[#This Row],[FILA]],1)","v":"M"},{"$f":"INDEX(Turnos_Turno,TURNOS_2021_03[[#This Row],[FILA]],1)","v":"M"},{"$f":"INDEX(Turnos_Turno,TURNOS_2021_03[[#This Row],[FILA]],1)","v":"M"},{"$f":"INDEX(Turnos_Turno,TURNOS_2021_03[[#This Row],[FILA]],1)","v":"M"},{"$f":"INDEX(Turnos_Turno,TURNOS_2021_03[[#This Row],[FILA]],1)","v":"M"},{"$f":"INDEX(Turnos_Turno,TURNOS_2021_03[[#This Row],[FILA]],1)","v":"M"},{"$f":"INDEX(Turnos_Turno,TURNOS_2021_03[[#This Row],[FILA]],1)","v":"M"},{"$f":"INDEX(Turnos_Turno,TURNOS_2021_03[[#This Row],[FILA]],1)","v":"M"},{"$f":"INDEX(Turnos_Turno,TURNOS_2021_03[[#This Row],[FILA]],1)","v":"M"}]
[null,{"$f":"MATCH(TURNOS_2021_03[[#This Row],[PERSONAL]],Turnos_Personal,0)","v":56},{"$f":"INDEX(Capacidades_Nombre,MATCH(TURNOS_2021_03[[#This Row],[PERSONAL]],Capacidades_Personal,0),1) & \"\"","v":"N56"},"F56",{"$f":"INDEX(Turnos_Turno,TURNOS_2021_03[[#This Row],[FILA]],1)","v":"M"},{"$f":"INDEX(Turnos_Turno,TURNOS_2021_03[[#This Row],[FILA]],1)","v":"M"},{"$f":"INDEX(Turnos_Turno,TURNOS_2021_03[[#This Row],[FILA]],1)","v":"M"},{"$f":"INDEX(Turnos_Turno,TURNOS_2021_03[[#This Row],[FILA]],1)","v":"M"},{"$f":"INDEX(Turnos_Turno,TURNOS_2021_03[[#This Row],[FILA]],1)","v":"M"},{"$f":"INDEX(Turnos_Turno,TURNOS_2021_03[[#This Row],[FILA]],1)","v":"M"},{"$f":"INDEX(Turnos_Turno,TURNOS_2021_03[[#This Row],[FILA]],1)","v":"M"},{"$f":"INDEX(Turnos_Turno,TURNOS_2021_03[[#This Row],[FILA]],1)","v":"M"},{"$f":"INDEX(Turnos_Turno,TURNOS_2021_03[[#This Row],[FILA]],1)","v":"M"},{"$f":"INDEX(Turnos_Turno,TURNOS_2021_03[[#This Row],[FILA]],1)","v":"M"},{"$f":"INDEX(Turnos_Turno,TURNOS_2021_03[[#This Row],[FILA]],1)","v":"M"},{"$f":"INDEX(Turnos_Turno,TURNOS_2021_03[[#This Row],[FILA]],1)","v":"M"},{"$f":"INDEX(Turnos_Turno,TURNOS_2021_03[[#This Row],[FILA]],1)","v":"M"},{"$f":"INDEX(Turnos_Turno,TURNOS_2021_03[[#This Row],[FILA]],1)","v":"M"},{"$f":"INDEX(Turnos_Turno,TURNOS_2021_03[[#This Row],[FILA]],1)","v":"M"},{"$f":"INDEX(Turnos_Turno,TURNOS_2021_03[[#This Row],[FILA]],1)","v":"M"},{"$f":"INDEX(Turnos_Turno,TURNOS_2021_03[[#This Row],[FILA]],1)","v":"M"},{"$f":"INDEX(Turnos_Turno,TURNOS_2021_03[[#This Row],[FILA]],1)","v":"M"},{"$f":"INDEX(Turnos_Turno,TURNOS_2021_03[[#This Row],[FILA]],1)","v":"M"},{"$f":"INDEX(Turnos_Turno,TURNOS_2021_03[[#This Row],[FILA]],1)","v":"M"},{"$f":"INDEX(Turnos_Turno,TURNOS_2021_03[[#This Row],[FILA]],1)","v":"M"},{"$f":"INDEX(Turnos_Turno,TURNOS_2021_03[[#This Row],[FILA]],1)","v":"M"},{"$f":"INDEX(Turnos_Turno,TURNOS_2021_03[[#This Row],[FILA]],1)","v":"M"},{"$f":"INDEX(Turnos_Turno,TURNOS_2021_03[[#This Row],[FILA]],1)","v":"M"},{"$f":"INDEX(Turnos_Turno,TURNOS_2021_03[[#This Row],[FILA]],1)","v":"M"},{"$f":"INDEX(Turnos_Turno,TURNOS_2021_03[[#This Row],[FILA]],1)","v":"M"},{"$f":"INDEX(Turnos_Turno,TURNOS_2021_03[[#This Row],[FILA]],1)","v":"M"},{"$f":"INDEX(Turnos_Turno,TURNOS_2021_03[[#This Row],[FILA]],1)","v":"M"},{"$f":"INDEX(Turnos_Turno,TURNOS_2021_03[[#This Row],[FILA]],1)","v":"M"},{"$f":"INDEX(Turnos_Turno,TURNOS_2021_03[[#This Row],[FILA]],1)","v":"M"},{"$f":"INDEX(Turnos_Turno,TURNOS_2021_03[[#This Row],[FILA]],1)","v":"M"}]
[null,{"$f":"MATCH(TURNOS_2021_03[[#This Row],[PERSONAL]],Turnos_Personal,0)","v":57},{"$f":"INDEX(Capacidades_Nombre,MATCH(TURNOS_2021_03[[#This Row],[PERSONAL]],Capacidades_Personal,0),1) & \"\"","v":"N57"},"F57",{"$f":"INDEX(Turnos_Turno,TURNOS_2021_03[[#This Row],[FILA]],1)","v":"M"},{"$f":"INDEX(Turnos_Turno,TURNOS_2021_03[[#This Row],[FILA]],1)","v":"M"},{"$f":"INDEX(Turnos_Turno,TURNOS_2021_03[[#This Row],[FILA]],1)","v":"M"},{"$f":"INDEX(Turnos_Turno,TURNOS_2021_03[[#This Row],[FILA]],1)","v":"M"},{"$f":"INDEX(Turnos_Turno,TURNOS_2021_03[[#This Row],[FILA]],1)","v":"M"},{"$f":"INDEX(Turnos_Turno,TURNOS_2021_03[[#This Row],[FILA]],1)","v":"M"},{"$f":"INDEX(Turnos_Turno,TURNOS_2021_03[[#This Row],[FILA]],1)","v":"M"},{"$f":"INDEX(Turnos_Turno,TURNOS_2021_03[[#This Row],[FILA]],1)","v":"M"},{"$f":"INDEX(Turnos_Turno,TURNOS_2021_03[[#This Row],[FILA]],1)","v":"M"},{"$f":"INDEX(Turnos_Turno,TURNOS_2021_03[[#This Row],[FILA]],1)","v":"M"},{"$f":"INDEX(Turnos_Turno,TURNOS_2021_03[[#This Row],[FILA]],1)","v":"M"},{"$f":"INDEX(Turnos_Turno,TURNOS_2021_03[[#This Row],[FILA]],1)","v":"M"},{"$f":"INDEX(Turnos_Turno,TURNOS_2021_03[[#This Row],[FILA]],1)","v":"M"},{"$f":"INDEX(Turnos_Turno,TURNOS_2021_03[[#This Row],[FILA]],1)","v":"M"},{"$f":"INDEX(Turnos_Turno,TURNOS_2021_03[[#This Row],[FILA]],1)","v":"M"},{"$f":"INDEX(Turnos_Turno,TURNOS_2021_03[[#This Row],[FILA]],1)","v":"M"},{"$f":"INDEX(Turnos_Turno,TURNOS_2021_03[[#This Row],[FILA]],1)","v":"M"},{"$f":"INDEX(Turnos_Turno,TURNOS_2021_03[[#This Row],[FILA]],1)","v":"M"},{"$f":"INDEX(Turnos_Turno,TURNOS_2021_03[[#This Row],[FILA]],1)","v":"M"},{"$f":"INDEX(Turnos_Turno,TURNOS_2021_03[[#This Row],[FILA]],1)","v":"M"},{"$f":"INDEX(Turnos_Turno,TURNOS_2021_03[[#This Row],[FILA]],1)","v":"M"},{"$f":"INDEX(Turnos_Turno,TURNOS_2021_03[[#This Row],[FILA]],1)","v":"M"},{"$f":"INDEX(Turnos_Turno,TURNOS_2021_03[[#This Row],[FILA]],1)","v":"M"},{"$f":"INDEX(Turnos_Turno,TURNOS_2021_03[[#This Row],[FILA]],1)","v":"M"},{"$f":"INDEX(Turnos_Turno,TURNOS_2021_03[[#This Row],[FILA]],1)","v":"M"},{"$f":"INDEX(Turnos_Turno,TURNOS_2021_03[[#This Row],[FILA]],1)","v":"M"},{"$f":"INDEX(Turnos_Turno,TURNOS_2021_03[[#This Row],[FILA]],1)","v":"M"},{"$f":"INDEX(Turnos_Turno,TURNOS_2021_03[[#This Row],[FILA]],1)","v":"M"},{"$f":"INDEX(Turnos_Turno,TURNOS_2021_03[[#This Row],[FILA]],1)","v":"M"},{"$f":"INDEX(Turnos_Turno,TURNOS_2021_03[[#This Row],[FILA]],1)","v":"M"},{"$f":"INDEX(Turnos_Turno,TURNOS_2021_03[[#This Row],[FILA]],1)","v":"M"}]
[null,{"$f":"MATCH(TURNOS_2021_03[[#This Row],[PERSONAL]],Turnos_Personal,0)","v":58},{"$f":"INDEX(Capacidades_Nombre,MATCH(TURNOS_2021_03[[#This Row],[PERSONAL]],Capacidades_Personal,0),1) & \"\"","v":"N58"},"F58",{"$f":"INDEX(Turnos_Turno,TURNOS_2021_03[[#This Row],[FILA]],1)","v":"M"},{"$f":"INDEX(Turnos_Turno,TURNOS_2021_03[[#This Row],[FILA]],1)","v":"M"},{"$f":"INDEX(Turnos_Turno,TURNOS_2021_03[[#This Row],[FILA]],1)","v":"M"},{"$f":"INDEX(Turnos_Turno,TURNOS_2021_03[[#This Row],[FILA]],1)","v":"M"},{"$f":"INDEX(Turnos_Turno,TURNOS_2021_03[[#This Row],[FILA]],1)","v":"M"},{"$f":"INDEX(Turnos_Turno,TURNOS_2021_03[[#This Row],[FILA]],1)","v":"M"},{"$f":"INDEX(Turnos_Turno,TURNOS_2021_03[[#This Row],[FILA]],1)","v":"M"},{"$f":"INDEX(Turnos_Turno,TURNOS_2021_03[[#This Row],[FILA]],1)","v":"M"},{"$f":"INDEX(Turnos_Turno,TURNOS_2021_03[[#This Row],[FILA]],1)","v":"M"},{"$f":"INDEX(Turnos_Turno,TURNOS_2021_03[[#This Row],[FILA]],1)","v":"M"},{"$f":"INDEX(Turnos_Turno,TURNOS_2021_03[[#This Row],[FILA]],1)","v":"M"},{"$f":"INDEX(Turnos_Turno,TURNOS_2021_03[[#This Row],[FILA]],1)","v":"M"},{"$f":"INDEX(Turnos_Turno,TURNOS_2021_03[[#This Row],[FILA]],1)","v":"M"},{"$f":"INDEX(Turnos_Turno,TURNOS_2021_03[[#This Row],[FILA]],1)","v":"M"},{"$f":"INDEX(Turnos_Turno,TURNOS_2021_03[[#This Row],[FILA]],1)","v":"M"},{"$f":"INDEX(Turnos_Turno,TURNOS_2021_03[[#This Row],[FILA]],1)","v":"M"},{"$f":"INDEX(Turnos_Turno,TURNOS_2021_03[[#This Row],[FILA]],1)","v":"M"},{"$f":"INDEX(Turnos_Turno,TURNOS_2021_03[[#This Row],[FILA]],1)","v":"M"},{"$f":"INDEX(Turnos_Turno,TURNOS_2021_03[[#This Row],[FILA]],1)","v":"M"},{"$f":"INDEX(Turnos_Turno,TURNOS_2021_03[[#This Row],[FILA]],1)","v":"M"},{"$f":"INDEX(Turnos_Turno,TURNOS_2021_03[[#This Row],[FILA]],1)","v":"M"},{"$f":"INDEX(Turnos_Turno,TURNOS_2021_03[[#This Row],[FILA]],1)","v":"M"},{"$f":"INDEX(Turnos_Turno,TURNOS_2021_03[[#This Row],[FILA]],1)","v":"M"},{"$f":"INDEX(Turnos_Turno,TURNOS_2021_03[[#This Row],[FILA]],1)","v":"M"},{"$f":"INDEX(Turnos_Turno,TURNOS_2021_03[[#This Row],[FILA]],1)","v":"M"},{"$f":"INDEX(Turnos_Turno,TURNOS_2021_03[[#This Row],[FILA]],1)","v":"M"},{"$f":"INDEX(Turnos_Turno,TURNOS_2021_03[[#This Row],[FILA]],1)","v":"M"},{"$f":"INDEX(Turnos_Turno,TURNOS_2021_03[[#This Row],[FILA]],1)","v":"M"},{"$f":"INDEX(Turnos_Turno,TURNOS_2021_03[[#This Row],[FILA]],1)","v":"M"},{"$f":"INDEX(Turnos_Turno,TURNOS_2021_03[[#This Row],[FILA]],1)","v":"M"},{"$f":"INDEX(Turnos_Turno,TURNOS_2021_03[[#This Row],[FILA]],1)","v":"M"}]
[null,{"$f":"MATCH(TURNOS_2021_03[[#This Row],[PERSONAL]],Turnos_Personal,0)","v":59},{"$f":"INDEX(Capacidades_Nombre,MATCH(TURNOS_2021_03[[#This Row],[PERSONAL]],Capacidades_Personal,0),1) & \"\"","v":"N59"},"F59",{"$f":"INDEX(Turnos_Turno,TURNOS_2021_03[[#This Row],[FILA]],1)","v":"M"},{"$f":"INDEX(Turnos_Turno,TURNOS_2021_03[[#This Row],[FILA]],1)","v":"M"},{"$f":"INDEX(Turnos_Turno,TURNOS_2021_03[[#This Row],[FILA]],1)","v":"M"},{"$f":"INDEX(Turnos_Turno,TURNOS_2021_03[[#This Row],[FILA]],1)","v":"M"},{"$f":"INDEX(Turnos_Turno,TURNOS_2021_03[[#This Row],[FILA]],1)","v":"M"},{"$f":"INDEX(Turnos_Turno,TURNOS_2021_03[[#This Row],[FILA]],1)","v":"M"},{"$f":"INDEX(Turnos_Turno,TURNOS_2021_03[[#This Row],[FILA]],1)","v":"M"},{"$f":"INDEX(Turnos_Turno,TURNOS_2021_03[[#This Row],[FILA]],1)","v":"M"},{"$f":"INDEX(Turnos_Turno,TURNOS_2021_03[[#This Row],[FILA]],1)","v":"M"},{"$f":"INDEX(Turnos_Turno,TURNOS_2021_03[[#This Row],[FILA]],1)","v":"M"},{"$f":"INDEX(Turnos_Turno,TURNOS_2021_03[[#This Row],[FILA]],1)","v":"M"},{"$f":"INDEX(Turnos_Turno,TURNOS_2021_03[[#This Row],[FILA]],1)","v":"M"},{"$f":"INDEX(Turnos_Turno,TURNOS_2021_03[[#This Row],[FILA]],1)","v":"M"},{"$f":"INDEX(Turnos_Turno,TURNOS_2021_03[[#This Row],[FILA]],1)","v":"M"},{"$f":"INDEX(Turnos_Turno,TURNOS_2021_03[[#This Row],[FILA]],1)","v":"M"},{"$f":"INDEX(Turnos_Turno,TURNOS_2021_03[[#This Row],[FILA]],1)","v":"M"},{"$f":"INDEX(Turnos_Turno,TURNOS_2021_03[[#This Row],[FILA]],1)","v":"M"},{"$f":"INDEX(Turnos_Turno,TURNOS_2021_03[[#This Row],[FILA]],1)","v":"M"},{"$f":"INDEX(Turnos_Turno,TURNOS_2021_03[[#This Row],[FILA]],1)","v":"M"},{"$f":"INDEX(Turnos_Turno,TURNOS_2021_03[[#This Row],[FILA]],1)","v":"M"},{"$f":"INDEX(Turnos_Turno,TURNOS_2021_03[[#This Row],[FILA]],1)","v":"M"},{"$f":"INDEX(Turnos_Turno,TURNOS_2021_03[[#This Row],[FILA]],1)","v":"M"},{"$f":"INDEX(Turnos_Turno,TURNOS_2021_03[[#This Row],[FILA]],1)","v":"M"},{"$f":"INDEX(Turnos_Turno,TURNOS_2021_03[[#This Row],[FILA]],1)","v":"M"},{"$f":"INDEX(Turnos_Turno,TURNOS_2021_03[[#This Row],[FILA]],1)","v":"M"},{"$f":"INDEX(Turnos_Turno,TURNOS_2021_03[[#This Row],[FILA]],1)","v":"M"},{"$f":"INDEX(Turnos_Turno,TURNOS_2021_03[[#This Row],[FILA]],1)","v":"M"},{"$f":"INDEX(Turnos_Turno,TURNOS_2021_03[[#This Row],[FILA]],1)","v":"M"},{"$f":"INDEX(Turnos_Turno,TURNOS_2021_03[[#This Row],[FILA]],1)","v":"M"},{"$f":"INDEX(Turnos_Turno,TURNOS_2021_03[[#This Row],[FILA]],1)","v":"M"},{"$f":"INDEX(Turnos_Turno,TURNOS_2021_03[[#This Row],[FILA]],1)","v":"M"}]
[null,{"$f":"MATCH(TURNOS_2021_03[[#This Row],[PERSONAL]],Turnos_Personal,0)","v":60},{"$f":"INDEX(Capacidades_Nombre,MATCH(TURNOS_2021_03[[#This Row],[PERSONAL]],Capacidades_Personal,0),1) & \"\"","v":"N60"},"F60",{"$f":"INDEX(Turnos_Turno,TURNOS_2021_03[[#This Row],[FILA]],1)","v":"M"},{"$f":"INDEX(Turnos_Turno,TURNOS_2021_03[[#This Row],[FILA]],1)","v":"M"},{"$f":"INDEX(Turnos_Turno,TURNOS_2021_03[[#This Row],[FILA]],1)","v":"M"},{"$f":"INDEX(Turnos_Turno,TURNOS_2021_03[[#This Row],[FILA]],1)","v":"M"},{"$f":"INDEX(Turnos_Turno,TURNOS_2021_03[[#This Row],[FILA]],1)","v":"M"},{"$f":"INDEX(Turnos_Turno,TURNOS_2021_03[[#This Row],[FILA]],1)","v":"M"},{"$f":"INDEX(Turnos_Turno,TURNOS_2021_03[[#This Row],[FILA]],1)","v":"M"},{"$f":"INDEX(Turnos_Turno,TURNOS_2021_03[[#This Row],[FILA]],1)","v":"M"},{"$f":"INDEX(Turnos_Turno,TURNOS_2021_03[[#This Row],[FILA]],1)","v":"M"},{"$f":"INDEX(Turnos_Turno,TURNOS_2021_03[[#This Row],[FILA]],1)","v":"M"},{"$f":"INDEX(Turnos_Turno,TURNOS_2021_03[[#This Row],[FILA]],1)","v":"M"},{"$f":"INDEX(Turnos_Turno,TURNOS_2021_03[[#This Row],[FILA]],1)","v":"M"},{"$f":"INDEX(Turnos_Turno,TURNOS_2021_03[[#This Row],[FILA]],1)","v":"M"},{"$f":"INDEX(Turnos_Turno,TURNOS_2021_03[[#This Row],[FILA]],1)","v":"M"},{"$f":"INDEX(Turnos_Turno,TURNOS_2021_03[[#This Row],[FILA]],1)","v":"M"},{"$f":"INDEX(Turnos_Turno,TURNOS_2021_03[[#This Row],[FILA]],1)","v":"M"},{"$f":"INDEX(Turnos_Turno,TURNOS_2021_03[[#This Row],[FILA]],1)","v":"M"},{"$f":"INDEX(Turnos_Turno,TURNOS_2021_03[[#This Row],[FILA]],1)","v":"M"},{"$f":"INDEX(Turnos_Turno,TURNOS_2021_03[[#This Row],[FILA]],1)","v":"M"},{"$f":"INDEX(Turnos_Turno,TURNOS_2021_03[[#This Row],[FILA]],1)","v":"M"},{"$f":"INDEX(Turnos_Turno,TURNOS_2021_03[[#This Row],[FILA]],1)","v":"M"},{"$f":"INDEX(Turnos_Turno,TURNOS_2021_03[[#This Row],[FILA]],1)","v":"M"},{"$f":"INDEX(Turnos_Turno,TURNOS_2021_03[[#This Row],[FILA]],1)","v":"M"},{"$f":"INDEX(Turnos_Turno,TURNOS_2021_03[[#This Row],[FILA]],1)","v":"M"},{"$f":"INDEX(Turnos_Turno,TURNOS_2021_03[[#This Row],[FILA]],1)","v":"M"},{"$f":"INDEX(Turnos_Turno,TURNOS_2021_03[[#This Row],[FILA]],1)","v":"M"},{"$f":"INDEX(Turnos_Turno,TURNOS_2021_03[[#This Row],[FILA]],1)","v":"M"},{"$f":"INDEX(Turnos_Turno,TURNOS_2021_03[[#This Row],[FILA]],1)","v":"M"},{"$f":"INDEX(Turnos_Turno,TURNOS_2021_03[[#This Row],[FILA]],1)","v":"M"},{"$f":"INDEX(Turnos_Turno,TURNOS_2021_03[[#This Row],[FILA]],1)","v":"M"},{"$f":"INDEX(Turnos_Turno,TURNOS_2021_03[[#This Row],[FILA]],1)","v":"M"}]
[null,{"$f":"MATCH(TURNOS_2021_03[[#This Row],[PERSONAL]],Turnos_Personal,0)","v":61},{"$f":"INDEX(Capacidades_Nombre,MATCH(TURNOS_2021_03[[#This Row],[PERSONAL]],Capacidades_Personal,0),1) & \"\"","v":"N61"},"F61",{"$f":"INDEX(Turnos_Turno,TURNOS_2021_03[[#This Row],[FILA]],1)","v":"M"},{"$f":"INDEX(Turnos_Turno,TURNOS_2021_03[[#This Row],[FILA]],1)","v":"M"},{"$f":"INDEX(Turnos_Turno,TURNOS_2021_03[[#This Row],[FILA]],1)","v":"M"},{"$f":"INDEX(Turnos_Turno,TURNOS_2021_03[[#This Row],[FILA]],1)","v":"M"},{"$f":"INDEX(Turnos_Turno,TURNOS_2021_03[[#This Row],[FILA]],1)","v":"M"},{"$f":"INDEX(Turnos_Turno,TURNOS_2021_03[[#This Row],[FILA]],1)","v":"M"},{"$f":"INDEX(Turnos_Turno,TURNOS_2021_03[[#This Row],[FILA]],1)","v":"M"},{"$f":"INDEX(Turnos_Turno,TURNOS_2021_03[[#This Row],[FILA]],1)","v":"M"},{"$f":"INDEX(Turnos_Turno,TURNOS_2021_03[[#This Row],[FILA]],1)","v":"M"},{"$f":"INDEX(Turnos_Turno,TURNOS_2021_03[[#This Row],[FILA]],1)","v":"M"},{"$f":"INDEX(Turnos_Turno,TURNOS_2021_03[[#This Row],[FILA]],1)","v":"M"},{"$f":"INDEX(Turnos_Turno,TURNOS_2021_03[[#This Row],[FILA]],1)","v":"M"},{"$f":"INDEX(Turnos_Turno,TURNOS_2021_03[[#This Row],[FILA]],1)","v":"M"},{"$f":"INDEX(Turnos_Turno,TURNOS_2021_03[[#This Row],[FILA]],1)","v":"M"},{"$f":"INDEX(Turnos_Turno,TURNOS_2021_03[[#This Row],[FILA]],1)","v":"M"},{"$f":"INDEX(Turnos_Turno,TURNOS_2021_03[[#This Row],[FILA]],1)","v":"M"},{"$f":"INDEX(Turnos_Turno,TURNOS_2021_03[[#This Row],[FILA]],1)","v":"M"},{"$f":"INDEX(Turnos_Turno,TURNOS_2021_03[[#This Row],[FILA]],1)","v":"M"},{"$f":"INDEX(Turnos_Turno,TURNOS_2021_03[[#This Row],[FILA]],1)","v":"M"},{"$f":"INDEX(Turnos_Turno,TURNOS_2021_03[[#This Row],[FILA]],1)","v":"M"},{"$f":"INDEX(Turnos_Turno,TURNOS_2021_03[[#This Row],[FILA]],1)","v":"M"},{"$f":"INDEX(Turnos_Turno,TURNOS_2021_03[[#This Row],[FILA]],1)","v":"M"},{"$f":"INDEX(Turnos_Turno,TURNOS_2021_03[[#This Row],[FILA]],1)","v":"M"},{"$f":"INDEX(Turnos_Turno,TURNOS_2021_03[[#This Row],[FILA]],1)","v":"M"},{"$f":"INDEX(Turnos_Turno,TURNOS_2021_03[[#This Row],[FILA]],1)","v":"M"},{"$f":"INDEX(Turnos_Turno,TURNOS_2021_03[[#This Row],[FILA]],1)","v":"M"},{"$f":"INDEX(Turnos_Turno,TURNOS_2021_03[[#This Row],[FILA]],1)","v":"M"},{"$f":"INDEX(Turnos_Turno,TURNOS_2021_03[[#This Row],[FILA]],1)","v":"M"},{"$f":"INDEX(Turnos_Turno,TURNOS_2021_03[[#This Row],[FILA]],1)","v":"M"},{"$f":"INDEX(Turnos_Turno,TURNOS_2021_03[[#This Row],[FILA]],1)","v":"M"},{"$f":"INDEX(Turnos_Turno,TURNOS_2021_03[[#This Row],[FILA]],1)","v":"M"}]