{"text_format":"1","workbook":"xlsx","n_sheets":3,"sheets":["Año>=1900","Fechas","Idiomas"],"not_rendered":{"charts":0,"images":0,"macros":1,"external_links":0,"defined_names":37,"comments":2,"pivot_tables":0},"unopened":[],"bounds":{"document_bytes":16777216,"sheet_cells":100000,"rows_first":2000,"rows_last":500,"rows_between":2000,"halvings":0,"cell_chars":16384,"cell_head_chars":4096},"cells_cut":0,"cells_raw":0,"read":"whole","date_system":"1900"}

{"sheet":"Año>=1900","index":0,"n_rows":46,"n_cols":26,"rows_kept":46,"cut":false,"hidden":false,"merged":[[22,20,22,23],[4,20,4,23],[4,2,4,5],[15,1,15,24],[16,1,18,6],[16,7,18,12],[16,13,18,18],[16,19,18,24],[20,0,20,26],[2,11,2,12],[2,14,2,15],[22,2,22,5],[4,11,4,14],[22,11,22,14],[2,2,2,8]]}
[]
[null,{"$f":"Idiomas!$A$2","v":"Autor:"},"Pedro Wave for Excel Guys",null,null,null,null,null,null,null,null,null,null,{"$f":"IF(OR($C$5<61,Rango_MesNom<61,$U$5<61),Idiomas!$A$5,Idiomas!$A$4)","v":"Calendario Perpetuo Excel"},null,null,null,null,null,null,null,null,null,null,{"$f":"Idiomas!$A$6 & \" \"","v":"La semana comienza en "},"1900-01-02"]
[null,{"$f":"Idiomas!$A$3","v":"Blog:"},"https://pedrowave.blogspot.com/calendario",null,null,null,null,null,null,null,null,"1900-03-01",null,"¦","9999-12-31",null,null,null,null,null,null,null,null,null,{"$f":"Idiomas!$A$7 & \" \"","v":"Muestra los días de otros meses "},"û"]
[null,null,null,null,null,null,null,null,null,null,null,null,null,null,null,"×","Ø"]
[null,{"$f":"MONTH(C5)","v":7},{"$f":"IFERROR(DATE(YEAR(Rango_MesNom),MONTH(Rango_MesNom)-1,1),2958435)","v":"1962-07-01"},null,null,null,{"$f":"INT(YEAR(C5)/100)","v":19},{"$f":"MOD(YEAR(C5),100)","v":62},null,"×",{"$f":"MONTH(Rango_MesNom)","v":8},"1962-08-01",null,null,null,19,62,"Ø",null,{"$f":"MONTH(U5)","v":9},{"$f":"IFERROR(DATE(YEAR(Rango_MesNom),MONTH(Rango_MesNom)+1,1),1)","v":"1962-09-01"},null,null,null,{"$f":"INT(YEAR(U5)/100)","v":19},{"$f":"MOD(YEAR(U5),100)","v":62}]
[null,{"$f":"B26","v":"1962-07-02"},"1962-07-03","1962-07-04","1962-07-05","1962-07-06","1962-07-07","1962-07-08",null,null,{"$f":"K26","v":"1962-08-06"},"1962-08-07","1962-08-08","1962-08-09","1962-08-10","1962-08-11","1962-08-12",null,null,{"$f":"T26","v":"1962-09-03"},"1962-09-04","1962-09-05","1962-09-06","1962-09-07","1962-09-08","1962-09-09"]
[null,{"$f":"HYPERLINK(MouseOver(B25),IFERROR(IF(OR($Z$3=\"ü\",MONTH(B25)=$B$5),DAY(B25),\"\"),\"\"))","v":""},{"$f":"HYPERLINK(MouseOver(C25),IFERROR(IF(OR($Z$3=\"ü\",MONTH(C25)=$B$5),DAY(C25),\"\"),\"\"))","v":""},{"$f":"HYPERLINK(MouseOver(D25),IFERROR(IF(OR($Z$3=\"ü\",MONTH(D25)=$B$5),DAY(D25),\"\"),\"\"))","v":""},{"$f":"HYPERLINK(MouseOver(E25),IFERROR(IF(OR($Z$3=\"ü\",MONTH(E25)=$B$5),DAY(E25),\"\"),\"\"))","v":""},{"$f":"HYPERLINK(MouseOver(F25),IFERROR(IF(OR($Z$3=\"ü\",MONTH(F25)=$B$5),DAY(F25),\"\"),\"\"))","v":""},{"$f":"HYPERLINK(MouseOver(G25),IFERROR(IF(OR($Z$3=\"ü\",MONTH(G25)=$B$5),DAY(G25),\"\"),\"\"))","v":""},{"$f":"HYPERLINK(MouseOver(H25),IFERROR(IF(OR($Z$3=\"ü\",MONTH(H25)=$B$5),DAY(H25),\"\"),\"\"))","v":1},null,null,{"$f":"HYPERLINK(MouseOver(K25),IFERROR(IF(OR($Z$3=\"ü\",MONTH(K25)=$K$5),DAY(K25),\"\"),\"\"))","v":""},{"$f":"HYPERLINK(MouseOver(L25),IFERROR(IF(OR($Z$3=\"ü\",MONTH(L25)=$K$5),DAY(L25),\"\"),\"\"))","v":""},{"$f":"HYPERLINK(MouseOver(M25),IFERROR(IF(OR($Z$3=\"ü\",MONTH(M25)=$K$5),DAY(M25),\"\"),\"\"))","v":1},{"$f":"HYPERLINK(MouseOver(N25),IFERROR(IF(OR($Z$3=\"ü\",MONTH(N25)=$K$5),DAY(N25),\"\"),\"\"))","v":2},{"$f":"HYPERLINK(MouseOver(O25),IFERROR(IF(OR($Z$3=\"ü\",MONTH(O25)=$K$5),DAY(O25),\"\"),\"\"))","v":3},{"$f":"HYPERLINK(MouseOver(P25),IFERROR(IF(OR($Z$3=\"ü\",MONTH(P25)=$K$5),DAY(P25),\"\"),\"\"))","v":4},{"$f":"HYPERLINK(MouseOver(Q25),IFERROR(IF(OR($Z$3=\"ü\",MONTH(Q25)=$K$5),DAY(Q25),\"\"),\"\"))","v":5},null,null,{"$f":"HYPERLINK(MouseOver(T25),IFERROR(IF(OR($Z$3=\"ü\",MONTH(T25)=$T$5),DAY(T25),\"\"),\"\"))","v":""},{"$f":"HYPERLINK(MouseOver(U25),IFERROR(IF(OR($Z$3=\"ü\",MONTH(U25)=$T$5),DAY(U25),\"\"),\"\"))","v":""},{"$f":"HYPERLINK(MouseOver(V25),IFERROR(IF(OR($Z$3=\"ü\",MONTH(V25)=$T$5),DAY(V25),\"\"),\"\"))","v":""},{"$f":"HYPERLINK(MouseOver(W25),IFERROR(IF(OR($Z$3=\"ü\",MONTH(W25)=$T$5),DAY(W25),\"\"),\"\"))","v":""},{"$f":"HYPERLINK(MouseOver(X25),IFERROR(IF(OR($Z$3=\"ü\",MONTH(X25)=$T$5),DAY(X25),\"\"),\"\"))","v":""},{"$f":"HYPERLINK(MouseOver(Y25),IFERROR(IF(OR($Z$3=\"ü\",MONTH(Y25)=$T$5),DAY(Y25),\"\"),\"\"))","v":1},{"$f":"HYPERLINK(MouseOver(Z25),IFERROR(IF(OR($Z$3=\"ü\",MONTH(Z25)=$T$5),DAY(Z25),\"\"),\"\"))","v":2}]
[null,{"$f":"HYPERLINK(MouseOver(B26),IFERROR(IF(OR($Z$3=\"ü\",MONTH(B26)=$B$5),DAY(B26),\"\"),\"\"))","v":2},{"$f":"HYPERLINK(MouseOver(C26),IFERROR(IF(OR($Z$3=\"ü\",MONTH(C26)=$B$5),DAY(C26),\"\"),\"\"))","v":3},{"$f":"HYPERLINK(MouseOver(D26),IFERROR(IF(OR($Z$3=\"ü\",MONTH(D26)=$B$5),DAY(D26),\"\"),\"\"))","v":4},{"$f":"HYPERLINK(MouseOver(E26),IFERROR(IF(OR($Z$3=\"ü\",MONTH(E26)=$B$5),DAY(E26),\"\"),\"\"))","v":5},{"$f":"HYPERLINK(MouseOver(F26),IFERROR(IF(OR($Z$3=\"ü\",MONTH(F26)=$B$5),DAY(F26),\"\"),\"\"))","v":6},{"$f":"HYPERLINK(MouseOver(G26),IFERROR(IF(OR($Z$3=\"ü\",MONTH(G26)=$B$5),DAY(G26),\"\"),\"\"))","v":7},{"$f":"HYPERLINK(MouseOver(H26),IFERROR(IF(OR($Z$3=\"ü\",MONTH(H26)=$B$5),DAY(H26),\"\"),\"\"))","v":8},null,null,{"$f":"HYPERLINK(MouseOver(K26),IFERROR(IF(OR($Z$3=\"ü\",MONTH(K26)=$K$5),DAY(K26),\"\"),\"\"))","v":6},{"$f":"HYPERLINK(MouseOver(L26),IFERROR(IF(OR($Z$3=\"ü\",MONTH(L26)=$K$5),DAY(L26),\"\"),\"\"))","v":7},{"$f":"HYPERLINK(MouseOver(M26),IFERROR(IF(OR($Z$3=\"ü\",MONTH(M26)=$K$5),DAY(M26),\"\"),\"\"))","v":8},{"$f":"HYPERLINK(MouseOver(N26),IFERROR(IF(OR($Z$3=\"ü\",MONTH(N26)=$K$5),DAY(N26),\"\"),\"\"))","v":9},{"$f":"HYPERLINK(MouseOver(O26),IFERROR(IF(OR($Z$3=\"ü\",MONTH(O26)=$K$5),DAY(O26),\"\"),\"\"))","v":10},{"$f":"HYPERLINK(MouseOver(P26),IFERROR(IF(OR($Z$3=\"ü\",MONTH(P26)=$K$5),DAY(P26),\"\"),\"\"))","v":11},{"$f":"HYPERLINK(MouseOver(Q26),IFERROR(IF(OR($Z$3=\"ü\",MONTH(Q26)=$K$5),DAY(Q26),\"\"),\"\"))","v":12},null,null,{"$f":"HYPERLINK(MouseOver(T26),IFERROR(IF(OR($Z$3=\"ü\",MONTH(T26)=$T$5),DAY(T26),\"\"),\"\"))","v":3},{"$f":"HYPERLINK(MouseOver(U26),IFERROR(IF(OR($Z$3=\"ü\",MONTH(U26)=$T$5),DAY(U26),\"\"),\"\"))","v":4},{"$f":"HYPERLINK(MouseOver(V26),IFERROR(IF(OR($Z$3=\"ü\",MONTH(V26)=$T$5),DAY(V26),\"\"),\"\"))","v":5},{"$f":"HYPERLINK(MouseOver(W26),IFERROR(IF(OR($Z$3=\"ü\",MONTH(W26)=$T$5),DAY(W26),\"\"),\"\"))","v":6},{"$f":"HYPERLINK(MouseOver(X26),IFERROR(IF(OR($Z$3=\"ü\",MONTH(X26)=$T$5),DAY(X26),\"\"),\"\"))","v":7},{"$f":"HYPERLINK(MouseOver(Y26),IFERROR(IF(OR($Z$3=\"ü\",MONTH(Y26)=$T$5),DAY(Y26),\"\"),\"\"))","v":8},{"$f":"HYPERLINK(MouseOver(Z26),IFERROR(IF(OR($Z$3=\"ü\",MONTH(Z26)=$T$5),DAY(Z26),\"\"),\"\"))","v":9}]
[null,{"$f":"HYPERLINK(MouseOver(B27),IFERROR(IF(OR($Z$3=\"ü\",MONTH(B27)=$B$5),DAY(B27),\"\"),\"\"))","v":9},{"$f":"HYPERLINK(MouseOver(C27),IFERROR(IF(OR($Z$3=\"ü\",MONTH(C27)=$B$5),DAY(C27),\"\"),\"\"))","v":10},{"$f":"HYPERLINK(MouseOver(D27),IFERROR(IF(OR($Z$3=\"ü\",MONTH(D27)=$B$5),DAY(D27),\"\"),\"\"))","v":11},{"$f":"HYPERLINK(MouseOver(E27),IFERROR(IF(OR($Z$3=\"ü\",MONTH(E27)=$B$5),DAY(E27),\"\"),\"\"))","v":12},{"$f":"HYPERLINK(MouseOver(F27),IFERROR(IF(OR($Z$3=\"ü\",MONTH(F27)=$B$5),DAY(F27),\"\"),\"\"))","v":13},{"$f":"HYPERLINK(MouseOver(G27),IFERROR(IF(OR($Z$3=\"ü\",MONTH(G27)=$B$5),DAY(G27),\"\"),\"\"))","v":14},{"$f":"HYPERLINK(MouseOver(H27),IFERROR(IF(OR($Z$3=\"ü\",MONTH(H27)=$B$5),DAY(H27),\"\"),\"\"))","v":15},null,null,{"$f":"HYPERLINK(MouseOver(K27),IFERROR(IF(OR($Z$3=\"ü\",MONTH(K27)=$K$5),DAY(K27),\"\"),\"\"))","v":13},{"$f":"HYPERLINK(MouseOver(L27),IFERROR(IF(OR($Z$3=\"ü\",MONTH(L27)=$K$5),DAY(L27),\"\"),\"\"))","v":14},{"$f":"HYPERLINK(MouseOver(M27),IFERROR(IF(OR($Z$3=\"ü\",MONTH(M27)=$K$5),DAY(M27),\"\"),\"\"))","v":15},{"$f":"HYPERLINK(MouseOver(N27),IFERROR(IF(OR($Z$3=\"ü\",MONTH(N27)=$K$5),DAY(N27),\"\"),\"\"))","v":16},{"$f":"HYPERLINK(MouseOver(O27),IFERROR(IF(OR($Z$3=\"ü\",MONTH(O27)=$K$5),DAY(O27),\"\"),\"\"))","v":17},{"$f":"HYPERLINK(MouseOver(P27),IFERROR(IF(OR($Z$3=\"ü\",MONTH(P27)=$K$5),DAY(P27),\"\"),\"\"))","v":18},{"$f":"HYPERLINK(MouseOver(Q27),IFERROR(IF(OR($Z$3=\"ü\",MONTH(Q27)=$K$5),DAY(Q27),\"\"),\"\"))","v":19},null,null,{"$f":"HYPERLINK(MouseOver(T27),IFERROR(IF(OR($Z$3=\"ü\",MONTH(T27)=$T$5),DAY(T27),\"\"),\"\"))","v":10},{"$f":"HYPERLINK(MouseOver(U27),IFERROR(IF(OR($Z$3=\"ü\",MONTH(U27)=$T$5),DAY(U27),\"\"),\"\"))","v":11},{"$f":"HYPERLINK(MouseOver(V27),IFERROR(IF(OR($Z$3=\"ü\",MONTH(V27)=$T$5),DAY(V27),\"\"),\"\"))","v":12},{"$f":"HYPERLINK(MouseOver(W27),IFERROR(IF(OR($Z$3=\"ü\",MONTH(W27)=$T$5),DAY(W27),\"\"),\"\"))","v":13},{"$f":"HYPERLINK(MouseOver(X27),IFERROR(IF(OR($Z$3=\"ü\",MONTH(X27)=$T$5),DAY(X27),\"\"),\"\"))","v":14},{"$f":"HYPERLINK(MouseOver(Y27),IFERROR(IF(OR($Z$3=\"ü\",MONTH(Y27)=$T$5),DAY(Y27),\"\"),\"\"))","v":15},{"$f":"HYPERLINK(MouseOver(Z27),IFERROR(IF(OR($Z$3=\"ü\",MONTH(Z27)=$T$5),DAY(Z27),\"\"),\"\"))","v":16}]
[null,{"$f":"HYPERLINK(MouseOver(B28),IFERROR(IF(OR($Z$3=\"ü\",MONTH(B28)=$B$5),DAY(B28),\"\"),\"\"))","v":16},{"$f":"HYPERLINK(MouseOver(C28),IFERROR(IF(OR($Z$3=\"ü\",MONTH(C28)=$B$5),DAY(C28),\"\"),\"\"))","v":17},{"$f":"HYPERLINK(MouseOver(D28),IFERROR(IF(OR($Z$3=\"ü\",MONTH(D28)=$B$5),DAY(D28),\"\"),\"\"))","v":18},{"$f":"HYPERLINK(MouseOver(E28),IFERROR(IF(OR($Z$3=\"ü\",MONTH(E28)=$B$5),DAY(E28),\"\"),\"\"))","v":19},{"$f":"HYPERLINK(MouseOver(F28),IFERROR(IF(OR($Z$3=\"ü\",MONTH(F28)=$B$5),DAY(F28),\"\"),\"\"))","v":20},{"$f":"HYPERLINK(MouseOver(G28),IFERROR(IF(OR($Z$3=\"ü\",MONTH(G28)=$B$5),DAY(G28),\"\"),\"\"))","v":21},{"$f":"HYPERLINK(MouseOver(H28),IFERROR(IF(OR($Z$3=\"ü\",MONTH(H28)=$B$5),DAY(H28),\"\"),\"\"))","v":22},null,null,{"$f":"HYPERLINK(MouseOver(K28),IFERROR(IF(OR($Z$3=\"ü\",MONTH(K28)=$K$5),DAY(K28),\"\"),\"\"))","v":20},{"$f":"HYPERLINK(MouseOver(L28),IFERROR(IF(OR($Z$3=\"ü\",MONTH(L28)=$K$5),DAY(L28),\"\"),\"\"))","v":21},{"$f":"HYPERLINK(MouseOver(M28),IFERROR(IF(OR($Z$3=\"ü\",MONTH(M28)=$K$5),DAY(M28),\"\"),\"\"))","v":22},{"$f":"HYPERLINK(MouseOver(N28),IFERROR(IF(OR($Z$3=\"ü\",MONTH(N28)=$K$5),DAY(N28),\"\"),\"\"))","v":23},{"$f":"HYPERLINK(MouseOver(O28),IFERROR(IF(OR($Z$3=\"ü\",MONTH(O28)=$K$5),DAY(O28),\"\"),\"\"))","v":24},{"$f":"HYPERLINK(MouseOver(P28),IFERROR(IF(OR($Z$3=\"ü\",MONTH(P28)=$K$5),DAY(P28),\"\"),\"\"))","v":25},{"$f":"HYPERLINK(MouseOver(Q28),IFERROR(IF(OR($Z$3=\"ü\",MONTH(Q28)=$K$5),DAY(Q28),\"\"),\"\"))","v":26},null,null,{"$f":"HYPERLINK(MouseOver(T28),IFERROR(IF(OR($Z$3=\"ü\",MONTH(T28)=$T$5),DAY(T28),\"\"),\"\"))","v":17},{"$f":"HYPERLINK(MouseOver(U28),IFERROR(IF(OR($Z$3=\"ü\",MONTH(U28)=$T$5),DAY(U28),\"\"),\"\"))","v":18},{"$f":"HYPERLINK(MouseOver(V28),IFERROR(IF(OR($Z$3=\"ü\",MONTH(V28)=$T$5),DAY(V28),\"\"),\"\"))","v":19},{"$f":"HYPERLINK(MouseOver(W28),IFERROR(IF(OR($Z$3=\"ü\",MONTH(W28)=$T$5),DAY(W28),\"\"),\"\"))","v":20},{"$f":"HYPERLINK(MouseOver(X28),IFERROR(IF(OR($Z$3=\"ü\",MONTH(X28)=$T$5),DAY(X28),\"\"),\"\"))","v":21},{"$f":"HYPERLINK(MouseOver(Y28),IFERROR(IF(OR($Z$3=\"ü\",MONTH(Y28)=$T$5),DAY(Y28),\"\"),\"\"))","v":22},{"$f":"HYPERLINK(MouseOver(Z28),IFERROR(IF(OR($Z$3=\"ü\",MONTH(Z28)=$T$5),DAY(Z28),\"\"),\"\"))","v":23}]
[null,{"$f":"HYPERLINK(MouseOver(B29),IFERROR(IF(OR($Z$3=\"ü\",MONTH(B29)=$B$5),DAY(B29),\"\"),\"\"))","v":23},{"$f":"HYPERLINK(MouseOver(C29),IFERROR(IF(OR($Z$3=\"ü\",MONTH(C29)=$B$5),DAY(C29),\"\"),\"\"))","v":24},{"$f":"HYPERLINK(MouseOver(D29),IFERROR(IF(OR($Z$3=\"ü\",MONTH(D29)=$B$5),DAY(D29),\"\"),\"\"))","v":25},{"$f":"HYPERLINK(MouseOver(E29),IFERROR(IF(OR($Z$3=\"ü\",MONTH(E29)=$B$5),DAY(E29),\"\"),\"\"))","v":26},{"$f":"HYPERLINK(MouseOver(F29),IFERROR(IF(OR($Z$3=\"ü\",MONTH(F29)=$B$5),DAY(F29),\"\"),\"\"))","v":27},{"$f":"HYPERLINK(MouseOver(G29),IFERROR(IF(OR($Z$3=\"ü\",MONTH(G29)=$B$5),DAY(G29),\"\"),\"\"))","v":28},{"$f":"HYPERLINK(MouseOver(H29),IFERROR(IF(OR($Z$3=\"ü\",MONTH(H29)=$B$5),DAY(H29),\"\"),\"\"))","v":29},null,null,{"$f":"HYPERLINK(MouseOver(K29),IFERROR(IF(OR($Z$3=\"ü\",MONTH(K29)=$K$5),DAY(K29),\"\"),\"\"))","v":27},{"$f":"HYPERLINK(MouseOver(L29),IFERROR(IF(OR($Z$3=\"ü\",MONTH(L29)=$K$5),DAY(L29),\"\"),\"\"))","v":28},{"$f":"HYPERLINK(MouseOver(M29),IFERROR(IF(OR($Z$3=\"ü\",MONTH(M29)=$K$5),DAY(M29),\"\"),\"\"))","v":29},{"$f":"HYPERLINK(MouseOver(N29),IFERROR(IF(OR($Z$3=\"ü\",MONTH(N29)=$K$5),DAY(N29),\"\"),\"\"))","v":30},{"$f":"HYPERLINK(MouseOver(O29),IFERROR(IF(OR($Z$3=\"ü\",MONTH(O29)=$K$5),DAY(O29),\"\"),\"\"))","v":31},{"$f":"HYPERLINK(MouseOver(P29),IFERROR(IF(OR($Z$3=\"ü\",MONTH(P29)=$K$5),DAY(P29),\"\"),\"\"))","v":""},{"$f":"HYPERLINK(MouseOver(Q29),IFERROR(IF(OR($Z$3=\"ü\",MONTH(Q29)=$K$5),DAY(Q29),\"\"),\"\"))","v":""},null,null,{"$f":"HYPERLINK(MouseOver(T29),IFERROR(IF(OR($Z$3=\"ü\",MONTH(T29)=$T$5),DAY(T29),\"\"),\"\"))","v":24},{"$f":"HYPERLINK(MouseOver(U29),IFERROR(IF(OR($Z$3=\"ü\",MONTH(U29)=$T$5),DAY(U29),\"\"),\"\"))","v":25},{"$f":"HYPERLINK(MouseOver(V29),IFERROR(IF(OR($Z$3=\"ü\",MONTH(V29)=$T$5),DAY(V29),\"\"),\"\"))","v":26},{"$f":"HYPERLINK(MouseOver(W29),IFERROR(IF(OR($Z$3=\"ü\",MONTH(W29)=$T$5),DAY(W29),\"\"),\"\"))","v":27},{"$f":"HYPERLINK(MouseOver(X29),IFERROR(IF(OR($Z$3=\"ü\",MONTH(X29)=$T$5),DAY(X29),\"\"),\"\"))","v":28},{"$f":"HYPERLINK(MouseOver(Y29),IFERROR(IF(OR($Z$3=\"ü\",MONTH(Y29)=$T$5),DAY(Y29),\"\"),\"\"))","v":29},{"$f":"HYPERLINK(MouseOver(Z29),IFERROR(IF(OR($Z$3=\"ü\",MONTH(Z29)=$T$5),DAY(Z29),\"\"),\"\"))","v":30}]
[null,{"$f":"HYPERLINK(MouseOver(B30),IFERROR(IF(OR($Z$3=\"ü\",MONTH(B30)=$B$5),DAY(B30),\"\"),\"\"))","v":30},{"$f":"HYPERLINK(MouseOver(C30),IFERROR(IF(OR($Z$3=\"ü\",MONTH(C30)=$B$5),DAY(C30),\"\"),\"\"))","v":31},{"$f":"HYPERLINK(MouseOver(D30),IFERROR(IF(OR($Z$3=\"ü\",MONTH(D30)=$B$5),DAY(D30),\"\"),\"\"))","v":""},{"$f":"HYPERLINK(MouseOver(E30),IFERROR(IF(OR($Z$3=\"ü\",MONTH(E30)=$B$5),DAY(E30),\"\"),\"\"))","v":""},{"$f":"HYPERLINK(MouseOver(F30),IFERROR(IF(OR($Z$3=\"ü\",MONTH(F30)=$B$5),DAY(F30),\"\"),\"\"))","v":""},{"$f":"HYPERLINK(MouseOver(G30),IFERROR(IF(OR($Z$3=\"ü\",MONTH(G30)=$B$5),DAY(G30),\"\"),\"\"))","v":""},{"$f":"HYPERLINK(MouseOver(H30),IFERROR(IF(OR($Z$3=\"ü\",MONTH(H30)=$B$5),DAY(H30),\"\"),\"\"))","v":""},null,null,{"$f":"HYPERLINK(MouseOver(K30),IFERROR(IF(OR($Z$3=\"ü\",MONTH(K30)=$K$5),DAY(K30),\"\"),\"\"))","v":""},{"$f":"HYPERLINK(MouseOver(L30),IFERROR(IF(OR($Z$3=\"ü\",MONTH(L30)=$K$5),DAY(L30),\"\"),\"\"))","v":""},{"$f":"HYPERLINK(MouseOver(M30),IFERROR(IF(OR($Z$3=\"ü\",MONTH(M30)=$K$5),DAY(M30),\"\"),\"\"))","v":""},{"$f":"HYPERLINK(MouseOver(N30),IFERROR(IF(OR($Z$3=\"ü\",MONTH(N30)=$K$5),DAY(N30),\"\"),\"\"))","v":""},{"$f":"HYPERLINK(MouseOver(O30),IFERROR(IF(OR($Z$3=\"ü\",MONTH(O30)=$K$5),DAY(O30),\"\"),\"\"))","v":""},{"$f":"HYPERLINK(MouseOver(P30),IFERROR(IF(OR($Z$3=\"ü\",MONTH(P30)=$K$5),DAY(P30),\"\"),\"\"))","v":""},{"$f":"HYPERLINK(MouseOver(Q30),IFERROR(IF(OR($Z$3=\"ü\",MONTH(Q30)=$K$5),DAY(Q30),\"\"),\"\"))","v":""},null,null,{"$f":"HYPERLINK(MouseOver(T30),IFERROR(IF(OR($Z$3=\"ü\",MONTH(T30)=$T$5),DAY(T30),\"\"),\"\"))","v":""},{"$f":"HYPERLINK(MouseOver(U30),IFERROR(IF(OR($Z$3=\"ü\",MONTH(U30)=$T$5),DAY(U30),\"\"),\"\"))","v":""},{"$f":"HYPERLINK(MouseOver(V30),IFERROR(IF(OR($Z$3=\"ü\",MONTH(V30)=$T$5),DAY(V30),\"\"),\"\"))","v":""},{"$f":"HYPERLINK(MouseOver(W30),IFERROR(IF(OR($Z$3=\"ü\",MONTH(W30)=$T$5),DAY(W30),\"\"),\"\"))","v":""},{"$f":"HYPERLINK(MouseOver(X30),IFERROR(IF(OR($Z$3=\"ü\",MONTH(X30)=$T$5),DAY(X30),\"\"),\"\"))","v":""},{"$f":"HYPERLINK(MouseOver(Y30),IFERROR(IF(OR($Z$3=\"ü\",MONTH(Y30)=$T$5),DAY(Y30),\"\"),\"\"))","v":""},{"$f":"HYPERLINK(MouseOver(Z30),IFERROR(IF(OR($Z$3=\"ü\",MONTH(Z30)=$T$5),DAY(Z30),\"\"),\"\"))","v":""}]
[]
[null,"ü",{"$f":"\" \" & Idiomas!$A$15","v":" Evento activo de ratón sobre celda"},null,null,null,null,null,null,null,9,7,3,";",4,8,":",null,null,null,null,null,null,null,{"$f":"Idiomas!$A$14 & \" \"","v":"Velocidad de la animación "},2]
[]
[null,"1962-07-01"]
[null,{"$f":"INDEX(Rango_Eventos_Día,4*Rango_Página-3,1)","v":"Burundi - Independencia de Bélgica en 1962."},null,null,null,null,null,{"$f":"INDEX(Rango_Eventos_Día,4*Rango_Página-2,1)","v":"Ruanda - Independencia de Bélgica en 1962."},null,null,null,null,null,{"$f":"INDEX(Rango_Eventos_Día,4*Rango_Página-1,1)","v":""},null,null,null,null,null,{"$f":"INDEX(Rango_Eventos_Día,4*Rango_Página,1)","v":""},null,null,null,null,null,"Ù"]
[null,null,null,null,null,null,null,null,null,null,null,null,null,null,null,null,null,null,null,null,null,null,null,null,null,1]
[null,null,null,null,null,null,null,null,null,null,null,null,null,null,null,null,null,null,null,null,null,null,null,null,null,"Ú"]
[]
["Ú"]
[]
[null,{"$f":"B5","v":7},{"$f":"C5","v":"1962-07-01"},null,null,null,{"$f":"P5","v":19},{"$f":"Q5","v":62},null,null,{"$f":"Rango_MesNum","v":8},{"$f":"Rango_MesNom","v":"1962-08-01"},null,null,null,{"$f":"Rango_AñoCen","v":19},{"$f":"Rango_AñoUni","v":62},null,null,{"$f":"T5","v":9},{"$f":"U5","v":"1962-09-01"},null,null,null,{"$f":"Y5","v":19},{"$f":"Z5","v":62}]
[null,{"$f":"B26","v":"1962-07-02"},{"$f":"C26","v":"1962-07-03"},"1962-07-04","1962-07-05","1962-07-06","1962-07-07","1962-07-08",null,null,{"$f":"K26","v":"1962-08-06"},{"$f":"L26","v":"1962-08-07"},"1962-08-08","1962-08-09","1962-08-10","1962-08-11","1962-08-12",null,null,{"$f":"T26","v":"1962-09-03"},{"$f":"U26","v":"1962-09-04"},"1962-09-05","1962-09-06","1962-09-07","1962-09-08","1962-09-09"]
[null,{"$f":"C5+1-WEEKDAY(C5,Rango_DíaSemana)","v":"1962-06-25"},{"$f":"B25+1","v":"1962-06-26"},{"$f":"C25+1","v":"1962-06-27"},{"$f":"D25+1","v":"1962-06-28"},{"$f":"E25+1","v":"1962-06-29"},{"$f":"F25+1","v":"1962-06-30"},{"$f":"G25+1","v":"1962-07-01"},null,null,{"$f":"Rango_MesNom+1-WEEKDAY(Rango_MesNom,Rango_DíaSemana)","v":"1962-07-30"},{"$f":"K25+1","v":"1962-07-31"},{"$f":"L25+1","v":"1962-08-01"},{"$f":"M25+1","v":"1962-08-02"},{"$f":"N25+1","v":"1962-08-03"},{"$f":"O25+1","v":"1962-08-04"},{"$f":"P25+1","v":"1962-08-05"},null,null,{"$f":"U5+1-WEEKDAY(U5,Rango_DíaSemana)","v":"1962-08-27"},{"$f":"T25+1","v":"1962-08-28"},{"$f":"U25+1","v":"1962-08-29"},{"$f":"V25+1","v":"1962-08-30"},{"$f":"W25+1","v":"1962-08-31"},{"$f":"X25+1","v":"1962-09-01"},{"$f":"Y25+1","v":"1962-09-02"}]
[null,{"$f":"H25+1","v":"1962-07-02"},"1962-07-03","1962-07-04","1962-07-05","1962-07-06","1962-07-07","1962-07-08",null,null,{"$f":"Q25+1","v":"1962-08-06"},"1962-08-07","1962-08-08","1962-08-09","1962-08-10",{"$f":"O26+1","v":"1962-08-11"},"1962-08-12",null,null,{"$f":"Z25+1","v":"1962-09-03"},"1962-09-04","1962-09-05","1962-09-06","1962-09-07",{"$f":"X26+1","v":"1962-09-08"},"1962-09-09"]
[null,{"$f":"H26+1","v":"1962-07-09"},"1962-07-10","1962-07-11","1962-07-12","1962-07-13","1962-07-14","1962-07-15",null,null,{"$f":"Q26+1","v":"1962-08-13"},"1962-08-14","1962-08-15","1962-08-16","1962-08-17","1962-08-18","1962-08-19",null,null,{"$f":"Z26+1","v":"1962-09-10"},"1962-09-11","1962-09-12","1962-09-13","1962-09-14","1962-09-15","1962-09-16"]
[null,{"$f":"H27+1","v":"1962-07-16"},"1962-07-17","1962-07-18","1962-07-19","1962-07-20","1962-07-21","1962-07-22",null,null,{"$f":"Q27+1","v":"1962-08-20"},"1962-08-21","1962-08-22","1962-08-23","1962-08-24","1962-08-25","1962-08-26",null,null,{"$f":"Z27+1","v":"1962-09-17"},"1962-09-18","1962-09-19","1962-09-20","1962-09-21","1962-09-22","1962-09-23"]
[null,{"$f":"H28+1","v":"1962-07-23"},"1962-07-24","1962-07-25","1962-07-26","1962-07-27","1962-07-28","1962-07-29",null,null,{"$f":"Q28+1","v":"1962-08-27"},"1962-08-28","1962-08-29","1962-08-30","1962-08-31","1962-09-01","1962-09-02",null,null,{"$f":"Z28+1","v":"1962-09-24"},"1962-09-25","1962-09-26","1962-09-27","1962-09-28","1962-09-29","1962-09-30"]
[null,{"$f":"H29+1","v":"1962-07-30"},"1962-07-31","1962-08-01","1962-08-02","1962-08-03","1962-08-04","1962-08-05",null,null,{"$f":"Q29+1","v":"1962-09-03"},"1962-09-04","1962-09-05","1962-09-06","1962-09-07","1962-09-08","1962-09-09",null,null,{"$f":"Z29+1","v":"1962-10-01"},"1962-10-02","1962-10-03","1962-10-04","1962-10-05","1962-10-06","1962-10-07"]
[]
[]
[null,null,null,null,null,null,null,null,null,null,null,null,null,null,null,null,null,null,null,null,null,null,null,{"$f":"INDEX(Rango_MesesNom,Rango_PonNumMes,1)","v":"1962-08-01"},null,8]
[null,{"$f":"Idiomas!$A$8 & \" \" & TEXT(Rango_Día,\"[$-F800]dddd, mmmm dd, yyyy\")","v":"Eventos del domingo, 01 de julio de 1962"},null,null,null,null,null,null,null,null,null,null,null,null,null,null,null,null,null,null,null,{"$f":"Idiomas!$A$16","v":"Fila"},null,{"$f":"Idiomas!$A$9","v":"Meses"},null,{"$f":"Idiomas!$A$10","v":"Núm"}]
[null,{"$f":"IF(V35=0,\"\",INDEX(Rango_Eventos,V35))","v":"Burundi - Independencia de Bélgica en 1962."},null,null,null,null,null,null,null,null,null,null,null,null,null,null,null,null,null,null,null,{"$f":"IFERROR(SMALL(IF($B$16=Rango_Fechas,ROW(Rango_Eventos)-MIN(ROW(Rango_Fechas))+1,\"\"),ROW()-ROW(B34)),0)","v":80},null,{"$f":"DATE(--(TEXT(Rango_AñoCen,\"00\")&TEXT(Rango_AñoUni,\"00\")),Z35,1)","v":"1962-01-01"},null,1]
[null,"Ruanda - Independencia de Bélgica en 1962.",null,null,null,null,null,null,null,null,null,null,null,null,null,null,null,null,null,null,null,81,null,"1962-02-01",null,2]
[null,"",null,null,null,null,null,null,null,null,null,null,null,null,null,null,null,null,null,null,null,0,null,"1962-03-01",null,3]
[null,"",null,null,null,null,null,null,null,null,null,null,null,null,null,null,null,null,null,null,null,0,null,"1962-04-01",null,4]
[null,"",null,null,null,null,null,null,null,null,null,null,null,null,null,null,null,null,null,null,null,0,null,"1962-05-01",null,5]
[null,"",null,null,null,null,null,null,null,null,null,null,null,null,null,null,null,null,null,null,null,0,null,"1962-06-01",null,6]
[null,"",null,null,null,null,null,null,null,null,null,null,null,null,null,null,null,null,null,null,null,0,null,"1962-07-01",null,7]
[null,"",null,null,null,null,null,null,null,null,null,null,null,null,null,null,null,null,null,null,null,0,null,"1962-08-01",null,8]
[null,"",null,null,null,null,null,null,null,null,null,null,null,null,null,null,null,null,null,null,null,0,null,"1962-09-01",null,9]
[null,"",null,null,null,null,null,null,null,null,null,null,null,null,null,null,null,null,null,null,null,0,null,"1962-10-01",null,10]
[null,"",null,null,null,null,null,null,null,null,null,null,null,null,null,null,null,null,null,null,null,0,null,"1962-11-01",null,11]
[null,"",null,null,null,null,null,null,null,null,null,null,null,null,null,null,null,null,null,null,null,0,null,"1962-12-01",null,12]

{"sheet":"Fechas","index":1,"n_rows":142,"n_cols":3,"rows_kept":142,"cut":false,"hidden":false,"merged":[]}
["Fecha","Evento","Núm. Serie VBA"]
["01-01-0100","Primer día de VBA",{"$f":"ObtenerSerieFechaVBA(A2, ISNUMBER(A2))","v":-657434}]
["01-08-1291","Suiza - Alianza contra el Sacro Imperio Romano Germánico en 1291.",-222218]
["15-10-1582","Día 1 Gregoriano en Italia y España",-115858]
["20-12-1582","Día 1 Gregoriano en Francia",-115792]
["01-12-1640","Portugal - Restauración de la independencia de Portugal (de España) en 1640.",-94626]
["14-09-1752","Día 1 Gregoriano en Inglaterra",-53797]
["03-09-1783","Estados Unidos de América - (4 de julio) Declaración de la independencia del Reino Unido en 1776. Consumada el 3 de septiembre de 1783.",-42486]
["01-01-1804","Haití - Independencia de Francia en 1804.",-35062]
["20-07-1810","Colombia - Día de la independencia De España. Declaración de la independencia: 20 de julio de 1810.",-32670]
["16-09-1810","México - Independencia de España declarada en 1810.",-32612]
["15-05-1811","Paraguay - (Día de Independencia) Independencia de España en 1811.",-32371]
["05-07-1811","Venezuela - Declaración de la independencia de España en 1811.",-32320]
["09-07-1816","Argentina - Independencia de España en 1816.",-30489]
["12-02-1818","Chile - Se declaró su independencia de España, que fue reconocida por el gobierno español el 24 de abril de 1844.",-29906]
["25-03-1821","Grecia - Declaración de la independencia del Imperio otomano en 1821.",-28769]
["28-07-1821","Perú - Independencia de España en 1821.",-28644]
["15-09-1821","Costa Rica - Independencia de España en 1821.",-28595]
["15-09-1821","El Salvador - Independencia de España en 1821.",-28595]
["15-09-1821","Guatemala - Independencia de España en 1821.",-28595]
["15-09-1821","Honduras - Independencia del España en 1821.",-28595]
["15-09-1821","Nicaragua - Independencia de España en 1821",-28595]
["24-05-1822","Ecuador - Independencia de España el 10 de agosto de 1809. La Independencia real ocurrió el 24 de mayo de 1822.",-28344]
["07-09-1822","Brasil - Declarada la Independencia de Portugal en esa fecha en 1822. No fue reconocida hasta el 29 de agosto de 1825.",-28238]
["06-08-1825","Bolivia - Independencia de España en 1825.",-27174]
["25-08-1828","Uruguay - Declaración de independencia de las Provincias Unidas del Río de la Plata en 1828.",-26059]
["27-02-1844","República Dominicana - Independencia de Haití en 1844.",-20395]
["26-07-1847","Liberia - Independencia de los Estados Unidos en 1847.",-19150]
["01-07-1867","Canadá - Independencia del Reino Unido (reconocida en 1931 con el Tratado de Westminster) en 1867.",-11870]
["09-05-1877","Rumanía - Independencia del Imperio otomano en 1877.",-8270]
["12-06-1898","Filipinas - El Día de la Independencia Day de Filipinas: Araw ng Kalayaan. Independencia de España en 1898.",-566]
[60,"Error en Excel: Año 1900 no bisiesto",-0.1]
["00:00:00","Error en Excel: Día 0 no existe",0]
["1900-03-01","Primer día de Excel",{"$f":"ObtenerSerieFechaVBA(A34, ISNUMBER(A34))","v":61}]
["1901-01-01","Australia - Independencia del Reino Unido en 1901.",367]
["1903-11-03","Panamá - Independencia de España en 1821. Es también celebrado el 3 de noviembre, como el Día de la Separación de Colombia de 1903",1403]
["1905-05-17","Noruega - Independencia de Suecia en 1905. Celebrada el 17 de mayo, el Día de la Constitución de Noruega en Eidsvoll en 1814.",1964]
["1907-07-01","Nueva Zelanda - Independencia del Reino Unido (reconocida en 1931 con el Tratado de Westminster) en 1907.",2739]
["1908-09-22","Bulgaria - Independencia De jure del Imperio otomano en 1908",3188]
["1912-11-28","Albania - Independencia del Imperio otomano en 1912.",4716]
["1917-12-06","Finlandia - Independencia de Rusia in 1917.",6550]
["1918-02-24","Estonia - Independencia de Rusia Bolchevique en 1918.",6630]
["1918-10-28","República Checa - Como Checoslovaquia, marca la restauración de la independencia del Imperio austrohúngaro en 1918.",6876]
["1918-10-31","Austria - Independencia del Imperio austrohúngaro en 1918.",6879]
["1918-11-11","Polonia - (Święto Niepodległości) Restauración de la independencia de Polonia en 1918.",6890]
["1918-11-18","Letonia - Independencia de Rusia en 1918.",6897]
["1919-08-19","Afganistán - Independencia del Reino Unido en 1919.",7171]
["1921-11-26","Mongolia - Independencia de China el 11 de julio de 1921",8001]
["1922-12-06","República de Irlanda - Independencia del Reino Unido en 1922.",8376]
["1929-02-11","Vaticano - Tratado Laterano firmado con Italia en 1929.",10635]
["1931-12-11","Sudáfrica - Independencia del Reino Unido en 1931. No es un Feriado público. La Unión Sudafricana se formó e 31 de mayo de 1910 y La República Sudafricana se declaró el 31 de mayo de 1961.",11668]
["1943-11-22","Líbano - Independencia de Francia en 1943.",16032]
["1944-06-17","Islandia - Independencia de Dinamarca en 1944.",16240]
["1944-07-03","Bielorrusia - Liberación de Minsk de la ocupación Alemana por tropas Soviéticas en 1944.",16256]
["1945-08-15","Corea del Sur - (Gwangbokjeol) Independencia del Japón en 1945.",16664]
["1945-08-17","Indonesia - Proclamación de la independencia (Hari Proklamasi Kemerdekaan R.I.) de Holanda. Independencia de Japón en 1945.",16666]
["1945-09-02","Vietnam - Declaración de la independencia de Francia en 1945.",16682]
["1946-05-25","Jordania - Independencia del Reino Unido en 1946.",16947]
["1947-08-14","Pakistán - (Yaum e Azadi) Independencia del Reino Unido en 1947.",17393]
["1947-08-15","India - Día de la independencia (en India: Independencia viene a ser Libertad / Azaadi)]] del Reino Unido en 1947.",17394]
["1948-01-04","Birmania - Independencia del Reino Unido en 1948",17536]
["1948-02-04","Sri Lanka - Independencia del Reino Unido en 1948.",17567]
["1948-05-14","Israel - Independencia fue proclamada cuando se independizó del Mandato Británico de Palestina (Reino Unido) el 14 de mayo de 1948.",17667]
["1948-09-09","Corea del Norte - Fundación del DPRK en 1948.",17785]
["1956-03-02","Marruecos - Independencia de Francia y España en 1956",20516]
["1956-03-20","Túnez - Declaración de independencia de Francia en 1956.",{"$f":"ObtenerSerieFechaVBA(A66, ISNUMBER(A66))","v":20534}]
["1957-03-06","Ghana - Independencia del Reino Unido en 1957.",20885]
["1957-08-31","Malasia - (Hari Merdeka) Independencia del Reino Unido en 1957",21063]
["1960-06-26","Madagascar - Independencia de Francia en 1960.",22093]
["1960-06-30","República Democrática del Congo - Independencia de Bélgica en 1960.",22097]
["1960-08-01","Benín - Independencia de Francia en 1960.",22129]
["1960-08-03","Níger - Independencia de Francia en 1960",22131]
["1960-08-05","Burkina Faso - Independencia de Francia en 1960",22133]
["1960-08-11","Chad - Independencia de Francia en 1960.",22139]
["1960-08-16","Chipre - Independencia de Reino Unido el 16 de agosto de 1960",22144]
["1960-09-22","Malí - Independencia de Francia en 1960",22181]
["1960-10-01","Nigeria - Independencia del Reino Unido en 1960",22190]
["1961-01-26","Kuwait - Independencia del Reino Unido en 1961.",22307]
["1961-04-27","Sierra Leona - Independencia del Reino Unido en 1961.",22398]
["1961-12-09","Tanzania - Declaración de la independencia del Reino Unido en 1961.",22624]
["1962-07-01","Burundi - Independencia de Bélgica en 1962.",22828]
["1962-07-01","Ruanda - Independencia de Bélgica en 1962.",22828]
["1962-07-05","Argelia - Independencia de Francia en 1962.",22832]
["1962-08-06","Jamaica - Independencia del Reino Unido en 1962.",22864]
["1962-08-31","Trinidad y Tobago - Independencia del Reino Unido en 1962.",22889]
["1963-12-12","Kenia - Independencia del Reino Unido en 1963.",23357]
["1964-07-06","Malaui - Independencia del Reino Unido en 1964.",23564]
["1964-09-21","Malta - Independencia del Reino Unido en 1964.",23641]
["1964-10-24","Zambia - Declaración de la independencia del Reino Unido en 1964.",23674]
["1965-02-18","Gambia - Independencia del Reino Unido en 1965.",23791]
["1965-07-26","Maldivas - Independencia del Reino Unido en 1965",23949]
["1965-08-09","Singapur - (Fiesta Nacional) marca la separación de Malasia en 1965.",23963]
["1966-05-26","Guyana - Independencia del Reino Unido en 1966.",24253]
["1966-09-30","Botsuana - Emancipación del Reino Unido en 1966.",24380]
["1966-10-04","Lesoto - Independencia del Reino Unido en 1966.",24384]
["1966-11-30","Barbados - Independencia del Reino Unido en 1966.",24441]
["1967-11-30","Yemen - Declaración de la independencia del Reino Unido en 1967.",24806]
["1968-03-12","Mauricio - Independencia del Reino Unido en 1968.",{"$f":"ObtenerSerieFechaVBA(A98, ISNUMBER(A98))","v":24909}]
["1968-09-06","Suazilandia - Independencia del Reino Unido en 1968.",25087]
["1970-06-04","Tonga - Independencia del Reino Unido en 1970.",25723]
["1971-03-26","Bangladés - Independencia fue declarada de Pakistán y originó una guerra de 9 meses, terminando el 16 de diciembre de 1971.",26018]
["1971-08-15","Baréin - Independencia del Reino Unido en 1971.",26160]
["1971-09-03","Catar - Independencia del Reino Unido en 1971.",26179]
["1971-12-02","Emiratos Árabes Unidos - (Día Nacional) Independencia del Reino Unido en 1971.",26269]
["1973-07-10","Bahamas - Independencia del Reino Unido en 1973.",26855]
["1973-09-24","Guinea-Bissau - Independencia de Portugal en 1973",26931]
["1975-06-25","Mozambique - Independencia de Portugal en 1975",27570]
["1975-07-05","Cabo Verde - Independencia del Portugal en 1975.",27580]
["1975-07-12","Santo Tomé y Príncipe - Independencia de Portugal en 1975.",27587]
["1975-09-16","Nueva Guinea - Independencia de Australia de los territorios de Nueva Guinea, y Papua, en 1975.",27653]
["1975-11-11","Angola - Independencia de Portugal en 1975.",27709]
["1975-11-25","Surinam - Independencia de Holanda en 1975.",27723]
["1976-06-29","Seychelles - Independencia del Reino Unido en 1976.",27940]
["1980-04-18","Zimbabue - Declaración de la independencia del Reino Unido en 1980.",29329]
["1981-09-21","Belice - Independencia del Reino Unido en 1981.",29850]
["1981-11-01","Antigua y Barbuda - Independencia del Reino Unido en 1981.",29891]
["1984-01-01","Brunéi - Independencia del Reino Unido en 1984",30682]
["1989-11-17","Las Repúblicas Eslovacas - Como Checoslovaquia, marca la Revolución de 1989.",32829]
["1990-03-11","Lituania - Independencia de Rusia y Alemania en febrero de 1918; independencia de la Unión Soviética en marzo de 1990.",32943]
["1990-03-21","Namibia - Independencia de Sudáfrica por mandato en 1990",32953]
["1990-12-26","Eslovenia - La fecha de la publicación oficial de los resultados del plebiscito por la independencia en 1990.",33233]
["1991-05-25","República de Macedonia del Norte - (Den na nezavisnosta o Ден на независноста) Independencia de Yugoslavia en 1991.",33383]
["1991-05-26","Georgia - Independencia de la Unión Soviética en 1991.",33384]
["1991-06-12","Rusia - (El día de Rusia). La separación formal de la Unión Soviética es el 25 de diciembre de 1991.",33401]
["1991-08-24","Ucrania - Independencia de la Unión Soviética en 1991.",33474]
["1991-08-27","Moldavia - Independencia de la Unión Soviética en 1991",33477]
["1991-08-31","Kirguistán - Independencia de la Unión Soviética en 1991.",33481]
["1991-09-01","Uzbekistán - Independencia de la Unión Soviética en 1991.",33482]
["1991-09-09","Tayikistán - Independencia de la Unión Soviética en 1991.",33490]
["1991-09-21","Armenia - Independencia de la Unión Soviética en 1991.",{"$f":"ObtenerSerieFechaVBA(A130, ISNUMBER(A130))","v":33502}]
["1991-10-08","Croacia - Independencia de Yugoslavia en 1991.",33519]
["1991-10-18","Azerbaiyán - Independencia de la Unión Soviética en 1991.",33529]
["1991-12-16","Kazajistán - Independencia de la Unión Soviética en 1991.",33588]
["1992-03-01","Bosnia y Herzegovina - Independencia de Yugoslavia en 1992.",33664]
["1993-01-01","Eslovaquia - La independencia de la división de Checoslovaquia (feriado público) se efectuó el 1 de enero de 1993.",33970]
["1993-05-24","Eritrea - Independencia de Etiopía en 1993.",34113]
["2002-05-20","Timor del Este - Independencia de Indonesia en 2002.",37396]
["2006-05-21","Serbia - El comienzo de la primera rebelión en contra de la ocupación del Imperio otomano en 1804. La independencia contemporánea se produjo el 21 de mayo de 2006.",38858]
["2006-05-21","Montenegro - Su unión con Serbia acabó en 2006",38858]
["2008-02-17","Kosovo - Declaración de la independencia de Serbia en 2008.",39495]
[{"$f":"TODAY()","v":"2020-11-13"},"Hoy",44148]
["9999-12-31","Último día de Excel y VBA",2958465]

{"sheet":"Idiomas","index":2,"n_rows":16,"n_cols":3,"rows_kept":16,"cut":false,"hidden":false,"merged":[]}
["Español","Español","English"]
[{"$f":"INDEX($B2:$C2,MATCH($A$1,$B$1:$C$1,0))","v":"Autor:"},"Autor:","Author:"]
[{"$f":"INDEX($B3:$C3,MATCH($A$1,$B$1:$C$1,0))","v":"Blog:"},"Blog:","Blog:"]
["Calendario Perpetuo Excel","Calendario Perpetuo Excel","Perpetual Calendar Excel"]
["Error Calendario Perpetuo Excel","Error Calendario Perpetuo Excel","Excel Perpetual Calendar Error"]
["La semana comienza en","La semana comienza en","Week starts in"]
["Muestra los días de otros meses","Muestra los días de otros meses","Shows the days of other months"]
["Eventos del","Eventos del","Events of"]
["Meses","Meses","Months"]
["Núm","Núm","No."]
["Fecha","Fecha","Date"]
["Evento","Evento","Event"]
["Núm. Serie VBA","Núm. Serie VBA","VBA Serial No."]
["Velocidad de la animación","Velocidad de la animación","Animation speed"]
["Evento activo de ratón sobre celda","Evento activo de ratón sobre celda","Mouseover cell event active"]
["Fila","Fila","Row"]